{
  "data": [
    {
      "id": "olip",
      "name": "olip",
      "displayName": "Olip",
      "port": "80",
      "exposeServices": null,
      "version": "1.0.0",
      "logo": "images/9c5d0911-53e6-4681-9164-9211745c1256.webp",
      "image": "images/18c25740-64e9-451f-91f5-19dcdc94e260.webp",
      "url": "olip.ideascube.io",
      "size": 100000,
      "compose": "version: \"3.8\"\nservices:\n  kiwix:\n    image: offlineinternet/surfer:latest\n    container_name: ${APPLICATION_NAME}-${VM_ID:-olip}\n    networks:\n      - application_network\n    ports:\n      - ${EXPOSE_PORT:-}:3000\n    labels:\n      - traefik.enable=true\n      - traefik.http.routers.${APPLICATION_NAME}-${VM_ID:-olip}.rule=Host(`${APPLICATION_NAME}.${OLIP_HOST}`)\n      - traefik.http.routers.${APPLICATION_NAME}-${VM_ID:-olip}.tls=${TLS_ENABLED:-false}\n      - traefik.http.services.${APPLICATION_NAME}-${VM_ID:-olip}.loadbalancer.server.port=3000\n      - traefik.http.routers.${APPLICATION_NAME}-${VM_ID:-olip}.entrypoints=websecure\n      - traefik.http.routers.${APPLICATION_NAME}-${VM_ID:-olip}.tls.certresolver=olip_resolver\nnetworks:\n  application_network:\n    name: ${APPLICATIONS_NETWORK}\n    external: true\n",
      "isInstalled": true,
      "isDownloading": false,
      "isInstalling": false,
      "isUp": false,
      "isUpdateNeeded": false,
      "isUpdating": false,
      "isOlip": true,
      "hooks": "{\"hooks\":[]}",
      "applicationType": {
        "id": "b5b6bd1d-e768-4b5c-b55e-7bc0530f030c",
        "name": "CONTENT_HOST",
        "md5": "419199e7f0a9c156cae99acd5140e9b2",
        "applicationTypeTranslations": [
          {
            "id": 3,
            "label": "Content host",
            "description": "Used to host content",
            "language": {
              "id": 1833,
              "identifier": "eng",
              "oldIdentifier": "en",
              "label": "English"
            }
          }
        ]
      },
      "visibility": { "id": 2, "users": [], "roles": [] },
      "applicationTranslations": [
        {
          "id": 2,
          "shortDescription": "My app description",
          "longDescription": "My long app description",
          "indexId": null,
          "language": {
            "id": 1833,
            "identifier": "eng",
            "oldIdentifier": "en",
            "label": "English"
          }
        }
      ]
    },
    {
      "id": "1189ec92-bb68-4953-b26f-55beafb12cc2",
      "name": "surfer",
      "displayName": "Surfer",
      "port": "3000",
      "exposeServices": null,
      "version": "1.0.0",
      "logo": "images/0b421478-9d78-4a32-ab97-b2a6d37d73f0.png",
      "image": "images/569c48cd-31cf-44f1-b5b4-3765b750f35f.jpg",
      "url": "surfer.ideascube.io",
      "size": 100000,
      "compose": "services:\n  olip-app-main:\n    volumes:\n      - ${OLIP_APP_VOLUME}/data:/app/code/files\n    image: registry.gitlab.com/bibliosansfrontieres/olip-ng/apps/surfer:{{APPS_IMAGES_TAG}}\n",
      "isInstalled": false,
      "isDownloading": false,
      "isInstalling": false,
      "isUp": false,
      "isUpdateNeeded": false,
      "isUpdating": false,
      "isOlip": false,
      "hooks": "{\"hooks\":[]}",
      "applicationType": {
        "id": "fb1a8454-0ec3-40a4-8f28-f8778033ae6e",
        "name": "STORAGE",
        "md5": "a4506336f061f78a8b74ee205f1a0b29",
        "applicationTypeTranslations": [
          {
            "id": 2,
            "label": "Storage",
            "description": "Used to store data/files",
            "language": {
              "id": 1833,
              "identifier": "eng",
              "oldIdentifier": "en",
              "label": "English"
            }
          }
        ]
      },
      "visibility": { "id": 11, "users": [], "roles": [] },
      "applicationTranslations": [
        {
          "id": 5,
          "shortDescription": "My app description",
          "longDescription": "My long app description",
          "indexId": "BlRKGZUBHK9luxeUs4aY",
          "language": {
            "id": 1833,
            "identifier": "eng",
            "oldIdentifier": "en",
            "label": "English"
          }
        }
      ]
    },
    {
      "id": "413bcf99-ee71-4ac6-bc4d-106c482027dc",
      "name": "kiwix",
      "displayName": "Kiwix",
      "port": "8080",
      "exposeServices": null,
      "version": "0.0.1",
      "logo": "images/7baed661-50ec-4fa0-be86-083dfe97a71e.png",
      "image": "images/5b85acca-9f4e-4f5a-ae5a-cd58d8820999.jpg",
      "url": "kiwix.ideascube.io",
      "size": 100000,
      "compose": "services:\n  olip-app-main:\n    volumes:\n      - ${OLIP_APP_VOLUME}/data:/data\n    image: registry.gitlab.com/bibliosansfrontieres/olip-ng/apps/kiwix:{{APPS_IMAGES_TAG}}\n",
      "isInstalled": true,
      "isDownloading": false,
      "isInstalling": false,
      "isUp": true,
      "isUpdateNeeded": false,
      "isUpdating": false,
      "isOlip": false,
      "hooks": "{\"hooks\":[{\"name\":\"INSTALL_APPLICATION_CONTENT\",\"actions\":[{\"exec\":\"/usr/local/bin/kiwix-manage /data/library.xml add \\\"/data/content/{{file.name}}\\\"\"},{\"docker\":\"restart\"}]},{\"name\":\"UNINSTALL_APPLICATION_CONTENT\",\"actions\":[{\"exec\":\"/usr/local/bin/kiwix-manage /data/library.xml remove \\\"/data/content/{{file.name}}\\\"\"},{\"docker\":\"restart\"}]},{\"name\":\"IS_APPLICATION_CONTENT_INSTALLED\",\"returnExec\":\"grep -q '$content' /data/library.xml && echo true || echo false\"},{\"name\":\"GET_APPLICATION_CONTENT_URL\",\"returnValue\":\"{{application.url}}/{{file.name}}\"}]}",
      "applicationType": {
        "id": "b5b6bd1d-e768-4b5c-b55e-7bc0530f030c",
        "name": "CONTENT_HOST",
        "md5": "419199e7f0a9c156cae99acd5140e9b2",
        "applicationTypeTranslations": [
          {
            "id": 3,
            "label": "Content host",
            "description": "Used to host content",
            "language": {
              "id": 1833,
              "identifier": "eng",
              "oldIdentifier": "en",
              "label": "English"
            }
          }
        ]
      },
      "visibility": { "id": 1, "users": [], "roles": [] },
      "applicationTranslations": [
        {
          "id": 1,
          "shortDescription": "My app description",
          "longDescription": "My long app description",
          "indexId": "B1RKGZUBHK9luxeU7oZZ",
          "language": {
            "id": 1833,
            "identifier": "eng",
            "oldIdentifier": "en",
            "label": "English"
          }
        }
      ]
    }
  ],
  "meta": {
    "page": 1,
    "take": 12,
    "totalItemsCount": 3,
    "pageCount": 1,
    "hasPreviousPage": false,
    "hasNextPage": false
  }
}
