{
  "data": [
    {
      "playlist": {
        "id": "2782",
        "image": "playlist_thumbnails/2782.png",
        "isInstalled": true,
        "isUpdateNeeded": true,
        "isBroken": false,
        "isManuallyInstalled": false,
        "version": null,
        "size": 223890865,
        "createdAt": 1716904384618,
        "updatedAt": "2024-06-18T09:16:26.000Z",
        "playlistTranslations": [
          {
            "id": 1,
            "title": "Mon paquet 1",
            "description": "OLIPV2 Package1",
            "indexId": "qWl5v48BfS_ECn8b2Ed-",
            "language": {
              "id": 1954,
              "identifier": "fra",
              "oldIdentifier": "fr",
              "label": "French"
            }
          }
        ]
      },
      "category": {
        "id": 6,
        "sourceId": 6,
        "pictogram": "images/c878d89f-8c11-4ae0-acec-48f3280c3651.svg",
        "isHomepageDisplayed": true,
        "order": 5,
        "deletedAt": null
      },
      "order": 1,
      "id": 1,
      "totalItems": 7
    },
    {
      "playlist": {
        "id": "2783",
        "image": "playlist_thumbnails/2783.png",
        "isInstalled": true,
        "isUpdateNeeded": true,
        "isBroken": false,
        "isManuallyInstalled": false,
        "version": null,
        "size": 186989274,
        "createdAt": 1716904384642,
        "updatedAt": "2024-06-18T09:55:54.000Z",
        "playlistTranslations": [
          {
            "id": 2,
            "title": "Mon paquet 2",
            "description": "OLIPV2 Package1",
            "indexId": "qml5v48BfS_ECn8b2EeY",
            "language": {
              "id": 1954,
              "identifier": "fra",
              "oldIdentifier": "fr",
              "label": "French"
            }
          }
        ]
      },
      "category": {
        "id": 6,
        "sourceId": 6,
        "pictogram": "images/c878d89f-8c11-4ae0-acec-48f3280c3651.svg",
        "isHomepageDisplayed": true,
        "order": 5,
        "deletedAt": null
      },
      "order": 2,
      "id": 2,
      "totalItems": 6
    },
    {
      "playlist": {
        "id": "2784",
        "image": "playlist_thumbnails/2784.png",
        "isInstalled": true,
        "isUpdateNeeded": true,
        "isBroken": false,
        "isManuallyInstalled": false,
        "version": null,
        "size": 186989274,
        "createdAt": 1716904384663,
        "updatedAt": "2024-06-18T09:55:54.000Z",
        "playlistTranslations": [
          {
            "id": 3,
            "title": "Mon paquet 3",
            "description": "OLIPV2 Package3 !",
            "indexId": "q2l5v48BfS_ECn8b2EfD",
            "language": {
              "id": 1954,
              "identifier": "fra",
              "oldIdentifier": "fr",
              "label": "French"
            }
          }
        ]
      },
      "category": {
        "id": 6,
        "sourceId": 6,
        "pictogram": "images/c878d89f-8c11-4ae0-acec-48f3280c3651.svg",
        "isHomepageDisplayed": true,
        "order": 5,
        "deletedAt": null
      },
      "order": 3,
      "id": 3,
      "totalItems": 6
    },
    {
      "playlist": {
        "id": "2785",
        "image": "playlist_thumbnails/2785.png",
        "isInstalled": true,
        "isUpdateNeeded": true,
        "isBroken": false,
        "isManuallyInstalled": false,
        "version": null,
        "size": 186989274,
        "createdAt": 1716904384711,
        "updatedAt": "2024-06-18T09:55:54.000Z",
        "playlistTranslations": [
          {
            "id": 4,
            "title": "Mon paquet 4",
            "description": "OLIPV2 Package4",
            "indexId": "rGl5v48BfS_ECn8b2Efi",
            "language": {
              "id": 1954,
              "identifier": "fra",
              "oldIdentifier": "fr",
              "label": "French"
            }
          }
        ]
      },
      "category": {
        "id": 6,
        "sourceId": 6,
        "pictogram": "images/c878d89f-8c11-4ae0-acec-48f3280c3651.svg",
        "isHomepageDisplayed": true,
        "order": 5,
        "deletedAt": null
      },
      "order": 4,
      "id": 4,
      "totalItems": 6
    },
    {
      "playlist": {
        "id": "2786",
        "image": "playlist_thumbnails/2786.png",
        "isInstalled": true,
        "isUpdateNeeded": true,
        "isBroken": false,
        "isManuallyInstalled": false,
        "version": null,
        "size": 186989274,
        "createdAt": 1716904384742,
        "updatedAt": "2024-06-18T09:55:54.000Z",
        "playlistTranslations": [
          {
            "id": 5,
            "title": "Mon paquet 5",
            "description": "OLIPV2 Package5",
            "indexId": "rWl5v48BfS_ECn8b2UcV",
            "language": {
              "id": 1954,
              "identifier": "fra",
              "oldIdentifier": "fr",
              "label": "French"
            }
          }
        ]
      },
      "category": {
        "id": 6,
        "sourceId": 6,
        "pictogram": "images/c878d89f-8c11-4ae0-acec-48f3280c3651.svg",
        "isHomepageDisplayed": true,
        "order": 5,
        "deletedAt": null
      },
      "order": 5,
      "id": 5,
      "totalItems": 6
    },
    {
      "playlist": {
        "id": "2787",
        "image": "playlist_thumbnails/2787.png",
        "isInstalled": true,
        "isUpdateNeeded": true,
        "isBroken": false,
        "isManuallyInstalled": false,
        "version": null,
        "size": 25083401,
        "createdAt": 1716904384792,
        "updatedAt": "2024-06-18T09:55:54.000Z",
        "playlistTranslations": [
          {
            "id": 6,
            "title": "Mon paquet 1",
            "description": "OLIPV2 Package1_1",
            "indexId": "rml5v48BfS_ECn8b2Ucx",
            "language": {
              "id": 1954,
              "identifier": "fra",
              "oldIdentifier": "fr",
              "label": "French"
            }
          }
        ]
      },
      "category": {
        "id": 4,
        "sourceId": 4,
        "pictogram": "images/1449b313-edde-40cb-89d9-7c5f432cc5ea.svg",
        "isHomepageDisplayed": true,
        "order": 2,
        "deletedAt": null
      },
      "order": 6,
      "id": 6,
      "totalItems": 6
    },
    {
      "playlist": {
        "id": "2788",
        "image": "playlist_thumbnails/2788.png",
        "isInstalled": true,
        "isUpdateNeeded": true,
        "isBroken": false,
        "isManuallyInstalled": false,
        "version": null,
        "size": 25083401,
        "createdAt": 1716904384819,
        "updatedAt": "2024-06-18T09:55:54.000Z",
        "playlistTranslations": [
          {
            "id": 7,
            "title": "Mon paquet 2",
            "description": "OLIPV2 Package1_2",
            "indexId": "r2l5v48BfS_ECn8b2Uda",
            "language": {
              "id": 1954,
              "identifier": "fra",
              "oldIdentifier": "fr",
              "label": "French"
            }
          }
        ]
      },
      "category": {
        "id": 4,
        "sourceId": 4,
        "pictogram": "images/1449b313-edde-40cb-89d9-7c5f432cc5ea.svg",
        "isHomepageDisplayed": true,
        "order": 2,
        "deletedAt": null
      },
      "order": 35,
      "id": 35,
      "totalItems": 6
    },
    {
      "playlist": {
        "id": "2789",
        "image": "playlist_thumbnails/2789.png",
        "isInstalled": true,
        "isUpdateNeeded": true,
        "isBroken": false,
        "isManuallyInstalled": false,
        "version": null,
        "size": 25083401,
        "createdAt": 1716904384863,
        "updatedAt": "2024-06-18T09:55:54.000Z",
        "playlistTranslations": [
          {
            "id": 8,
            "title": "Mon paquet 3",
            "description": "OLIPV2 Package1_3",
            "indexId": "sGl5v48BfS_ECn8b2Ud4",
            "language": {
              "id": 1954,
              "identifier": "fra",
              "oldIdentifier": "fr",
              "label": "French"
            }
          }
        ]
      },
      "category": {
        "id": 4,
        "sourceId": 4,
        "pictogram": "images/1449b313-edde-40cb-89d9-7c5f432cc5ea.svg",
        "isHomepageDisplayed": true,
        "order": 2,
        "deletedAt": null
      },
      "order": 8,
      "id": 8,
      "totalItems": 6
    },
    {
      "playlist": {
        "id": "2790",
        "image": "playlist_thumbnails/2790.png",
        "isInstalled": true,
        "isUpdateNeeded": true,
        "isBroken": false,
        "isManuallyInstalled": false,
        "version": null,
        "size": 25083401,
        "createdAt": 1716904384891,
        "updatedAt": "2024-06-18T09:55:54.000Z",
        "playlistTranslations": [
          {
            "id": 9,
            "title": "Mon paquet 4",
            "description": "OLIPV2 Package1_4",
            "indexId": "sWl5v48BfS_ECn8b2Uej",
            "language": {
              "id": 1954,
              "identifier": "fra",
              "oldIdentifier": "fr",
              "label": "French"
            }
          }
        ]
      },
      "category": {
        "id": 4,
        "sourceId": 4,
        "pictogram": "images/1449b313-edde-40cb-89d9-7c5f432cc5ea.svg",
        "isHomepageDisplayed": true,
        "order": 2,
        "deletedAt": null
      },
      "order": 9,
      "id": 9,
      "totalItems": 6
    },
    {
      "playlist": {
        "id": "2791",
        "image": "playlist_thumbnails/2791.png",
        "isInstalled": true,
        "isUpdateNeeded": true,
        "isBroken": false,
        "isManuallyInstalled": false,
        "version": null,
        "size": 25083401,
        "createdAt": 1716904384933,
        "updatedAt": "2024-06-18T09:55:54.000Z",
        "playlistTranslations": [
          {
            "id": 10,
            "title": "Mon paquet 5",
            "description": "OLIPV2 Package1_5",
            "indexId": "sml5v48BfS_ECn8b2Ue6",
            "language": {
              "id": 1954,
              "identifier": "fra",
              "oldIdentifier": "fr",
              "label": "French"
            }
          }
        ]
      },
      "category": {
        "id": 4,
        "sourceId": 4,
        "pictogram": "images/1449b313-edde-40cb-89d9-7c5f432cc5ea.svg",
        "isHomepageDisplayed": true,
        "order": 2,
        "deletedAt": null
      },
      "order": 10,
      "id": 10,
      "totalItems": 6
    },
    {
      "playlist": {
        "id": "2792",
        "image": "playlist_thumbnails/2792.png",
        "isInstalled": true,
        "isUpdateNeeded": true,
        "isBroken": false,
        "isManuallyInstalled": false,
        "version": null,
        "size": 6555116,
        "createdAt": 1716904384957,
        "updatedAt": "2024-06-18T09:55:54.000Z",
        "playlistTranslations": [
          {
            "id": 11,
            "title": "Mon paquet 1",
            "description": "OLIPV2 Package2_1",
            "indexId": "s2l5v48BfS_ECn8b2Ufw",
            "language": {
              "id": 1954,
              "identifier": "fra",
              "oldIdentifier": "fr",
              "label": "French"
            }
          }
        ]
      },
      "category": {
        "id": 2,
        "sourceId": 2,
        "pictogram": "images/12385e38-b528-4450-a423-b5425792914a.svg",
        "isHomepageDisplayed": false,
        "order": 1,
        "deletedAt": null
      },
      "order": 11,
      "id": 11,
      "totalItems": 6
    },
    {
      "playlist": {
        "id": "2793",
        "image": "playlist_thumbnails/2793.png",
        "isInstalled": true,
        "isUpdateNeeded": true,
        "isBroken": false,
        "isManuallyInstalled": false,
        "version": null,
        "size": 6555116,
        "createdAt": 1716904385009,
        "updatedAt": "2024-06-18T09:55:54.000Z",
        "playlistTranslations": [
          {
            "id": 12,
            "title": "Mon paquet 2",
            "description": "OLIPV2 Package2_2",
            "indexId": "tGl5v48BfS_ECn8b2kcO",
            "language": {
              "id": 1954,
              "identifier": "fra",
              "oldIdentifier": "fr",
              "label": "French"
            }
          }
        ]
      },
      "category": {
        "id": 2,
        "sourceId": 2,
        "pictogram": "images/12385e38-b528-4450-a423-b5425792914a.svg",
        "isHomepageDisplayed": false,
        "order": 1,
        "deletedAt": null
      },
      "order": 12,
      "id": 12,
      "totalItems": 6
    }
  ],
  "meta": {
    "page": 1,
    "take": 12,
    "totalItemsCount": 30,
    "pageCount": 3,
    "hasPreviousPage": false,
    "hasNextPage": true
  }
}
