{
  "data": [
    {
      "id": 1,
      "username": "admin",
      "photo": "images/dccdd76e-448f-4976-8e20-25f3c189c176.jpg",
      "language": "fra",
      "role": { "id": 1, "name": "admin" }
    },
    {
      "id": 2,
      "username": "animator",
      "photo": "images/3131a81a-3360-4234-8829-4cf1f1282ca5.jpg",
      "language": "fra",
      "role": { "id": 2, "name": "animator" }
    },
    {
      "id": 3,
      "username": "user",
      "photo": "images/5a1b8af5-bc05-4cac-9e2e-9d8e410b0f75.jpg",
      "language": "fra",
      "role": { "id": 3, "name": "user" }
    },
    {
      "id": 4,
      "username": "user_no_password",
      "photo": "images/03b0d7ab-249c-4a6c-a69b-6751009ffe23.jpg",
      "language": "fra",
      "role": { "id": 4, "name": "user_no_password" }
    }
  ],
  "meta": {
    "page": 1,
    "take": 10,
    "totalItemsCount": 4,
    "pageCount": 1,
    "hasPreviousPage": false,
    "hasNextPage": false
  }
}
