<svg width="60" height="60" viewBox="0 0 60 60" fill="none" xmlns="http://www.w3.org/2000/svg">
<path fill-rule="evenodd" clip-rule="evenodd" d="M31.5263 3.9924C32.8741 -0.219453 38.7925 -0.219491 40.1403 3.9924L43.5686 14.7063H54.6377C59.0984 14.7063 60.7709 20.3862 57.3122 22.9378L48.3243 29.5685L51.762 40.3118C53.0638 44.3801 48.434 48.0796 44.7806 45.3844L35.8333 38.7836L26.886 45.3844C23.2326 48.0796 18.6027 44.3801 19.9045 40.3118L23.3423 29.5685L14.3544 22.9378C10.8957 20.3862 12.5682 14.7063 17.0289 14.7063H28.098L31.5263 3.9924ZM35.8333 6.93866L32.7586 16.5474C32.1626 18.4101 30.4369 19.7063 28.4516 19.7063H18.3963L26.564 25.7319C28.1466 26.8995 28.7906 28.948 28.1965 30.8045L25.097 40.4908L33.1588 34.5433C34.751 33.3687 36.9156 33.3687 38.5077 34.5433L46.5696 40.4908L43.4701 30.8045C42.876 28.948 43.5199 26.8995 45.1026 25.7319L53.2702 19.7063H43.2149C41.2297 19.7063 39.504 18.4101 38.908 16.5474L35.8333 6.93866Z" fill="#FDB851"/>
<path fill-rule="evenodd" clip-rule="evenodd" d="M16.6329 33.7561C16.8599 35.1181 15.9398 36.4061 14.5779 36.6331L4.57789 38.2998C3.21597 38.5268 1.9279 37.6067 1.70091 36.2448C1.47392 34.8829 2.39397 33.5948 3.7559 33.3678L13.7559 31.7012C15.1178 31.4742 16.4059 32.3942 16.6329 33.7561ZM18.5871 46.733C19.471 47.7937 19.3277 49.3701 18.267 50.254L8.26696 58.5874C7.20627 59.4713 5.62986 59.328 4.74595 58.2673C3.86204 57.2066 4.00535 55.6302 5.06604 54.7463L15.066 46.4129C16.1267 45.529 17.7031 45.6723 18.5871 46.733ZM35.5284 51.0105C35.9746 49.7039 35.277 48.283 33.9703 47.8368C32.6637 47.3907 31.2428 48.0882 30.7966 49.3949L29.2266 55.5409C28.7805 56.8476 29.4781 58.2685 30.7847 58.7147C32.0913 59.1608 33.5123 58.4632 33.9584 57.1566L35.5284 51.0105Z" fill="#FDB851"/>
</svg>
