<svg width="60" height="60" viewBox="0 0 60 60" fill="none" xmlns="http://www.w3.org/2000/svg">
<path fill-rule="evenodd" clip-rule="evenodd" d="M19.1668 5.83325C17.7861 5.83325 16.6668 6.95254 16.6668 8.33325V19.4081C14.7816 19.9692 13.2958 21.4577 12.7384 23.3445C12.66 23.337 12.5805 23.3333 12.5002 23.3333H10.0002V15.8333C10.0002 14.4525 8.88087 13.3333 7.50016 13.3333C6.11945 13.3333 5.00016 14.4525 5.00016 15.8333V25.8333C5.00016 27.214 6.11945 28.3333 7.50016 28.3333H10.2016C4.73923 30.2994 0.833496 35.5269 0.833496 41.6666C0.833496 49.4906 7.17613 55.8333 15.0002 55.8333C21.0641 55.8333 26.2382 52.0233 28.2592 46.6666H37.5002C37.6735 46.6666 37.8428 46.6489 38.0062 46.6153C39.3966 50.994 43.4945 54.1666 48.3335 54.1666C54.3166 54.1666 59.1668 49.3163 59.1668 43.3333V29.1666C59.1668 25.9449 56.5552 23.3333 53.3335 23.3333H40.9404L37.5313 10.8331C38.8977 10.8164 40.0002 9.70357 40.0002 8.33325C40.0002 6.95254 38.8809 5.83325 37.5002 5.83325H19.1668ZM37.6271 41.6698C38.4274 36.4764 42.9161 32.4999 48.3335 32.4999C50.4812 32.4999 52.483 33.1249 54.1668 34.2029V29.1666C54.1668 28.7063 53.7937 28.3333 53.3335 28.3333H31.8875C29.8384 28.3333 27.9396 27.2582 26.8854 25.5011L26.3274 24.5712C26.1768 24.3202 25.9056 24.1666 25.6129 24.1666H18.3335C17.8733 24.1666 17.5002 24.5397 17.5002 24.9999V27.7198C24.1319 28.9006 29.1668 34.6956 29.1668 41.6666H37.5002C37.5427 41.6666 37.585 41.6677 37.6271 41.6698ZM35.7578 23.3333L32.3487 10.8333H21.6668V19.1666H25.6129C27.6619 19.1666 29.5607 20.2417 30.6149 21.9987L31.1729 22.9287C31.3235 23.1797 31.5947 23.3333 31.8875 23.3333H35.7578ZM42.5002 43.3333C42.5002 40.1116 45.1118 37.4999 48.3335 37.4999C51.5552 37.4999 54.1668 40.1116 54.1668 43.3333C54.1668 46.5549 51.5552 49.1666 48.3335 49.1666C45.1118 49.1666 42.5002 46.5549 42.5002 43.3333ZM15.0002 32.4999C9.93755 32.4999 5.8335 36.604 5.8335 41.6666C5.8335 46.7292 9.93755 50.8333 15.0002 50.8333C20.0628 50.8333 24.1668 46.7292 24.1668 41.6666C24.1668 36.604 20.0628 32.4999 15.0002 32.4999Z" fill="#FDB851"/>
</svg>
