{
  "id": 88040,
  "source": "OMEKA",
  "url": "http://omeka.tm.bsf-intranet.org/api/items/88040",
  "title": "TMBSF_OLIP_V2_TEST",
  "description": "Projet de test pour OLIP V2",
  "date": "date",
  "languages": "fr,bn",
  "startDate": "12/2023",
  "endDate": "01/2024",
  "partners": "Bibliothèques sans frontières\r\nShareIT",
  "location": "Worldwide",
  "device": "752",
  "projectManager": "Alexandre\r\nClément",
  "virtualMachines": [
    {
      "id": "quflz",
      "title": "Seed database",
      "description": null,
      "referenceUrl": null,
      "defaultLanguageIdentifier": "eng",
      "status": "STARTING",
      "approval": "APPROVED",
      "approvalSaveId": "b545de87-be5c-4c8a-b004-45a09479f9bc",
      "projectVersion": "1721653782263",
      "isUpdateAvailable": false,
      "token": "eyJhbGciOiJIUzI1NiIsInR5cCI6IkpXVCJ9.eyJ2aXJ0dWFsTWFjaGluZUlkIjoicXVmbHoiLCJpYXQiOjE3MjE2NTM3ODIsImV4cCI6NDg3NzQxMzc4Mn0.r39F2m8MJ_FpOUt14yr8gn_vSx0T78_mGb_g_h4fL9A",
      "isArchived": false,
      "createdAt": "2024-07-22T13:09:42.000Z",
      "updatedAt": "2024-10-09T15:01:49.000Z",
      "user": {
        "id": "76670c75-78d3-4afd-aa7e-073a47baf692",
        "mail": "audrey.clerc@bibliosansfrontieres.org",
        "name": "Audrey Clerc",
        "avatar": "https://ui-avatars.com/api/?name=Audrey Clerc"
      },
      "virtualMachineSaves": [
        {
          "id": "b545de87-be5c-4c8a-b004-45a09479f9bc",
          "name": "Before approval process save",
          "description": "This save will be restored after approval process",
          "type": "AUTOMATIC",
          "createdAt": "2024-10-09T15:01:46.000Z",
          "deploys": []
        },
        {
          "id": "d349b0ac-7b8f-444e-9d2d-bf1a448a9497",
          "name": "DNUM",
          "description": null,
          "type": "APPROVE",
          "createdAt": "2024-10-09T15:01:49.000Z",
          "deploys": []
        }
      ]
    }
  ],
  "projectErrors": [
    {
      "id": 2,
      "entity": "ITEM",
      "entityId": 89258,
      "message": "item_type not found"
    },
    {
      "id": 1,
      "entity": "PACKAGE",
      "entityId": 2782,
      "message": "subject not found"
    }
  ]
}
