{
	"info": {
		"_postman_id": "f4aca7e5-282a-4163-a22d-696bc849132e",
		"name": "Meilleurs Masters",
		"schema": "https://schema.getpostman.com/json/collection/v2.1.0/collection.json",
		"_exporter_id": "840446"
	},
	"item": [
		{
			"name": "Secured",
			"item": [
				{
					"name": "Advertiser",
					"item": [
						{
							"name": "New",
							"request": {
								"method": "POST",
								"header": [],
								"body": {
									"mode": "raw",
									"raw": "{\r\n    \"firstName\": \"Art School\",\r\n    \"lastName\": \"Advertiser Test\",\r\n    \"email\": \"test.ter@email.com\"\r\n}",
									"options": {
										"raw": {
											"language": "json"
										}
									}
								},
								"url": {
									"raw": "{{apiUrl}}/advertiser",
									"host": [
										"{{apiUrl}}"
									],
									"path": [
										"advertiser"
									]
								}
							},
							"response": []
						},
						{
							"name": "Update",
							"request": {
								"method": "POST",
								"header": [],
								"body": {
									"mode": "raw",
									"raw": "{\r\n    \"id\": 1,\r\n    \"firstName\": \"Art School\",\r\n    \"lastName\": \"Advertiser Test\",\r\n    \"email\": \"test.ter@email.com\"\r\n}",
									"options": {
										"raw": {
											"language": "json"
										}
									}
								},
								"url": {
									"raw": "{{apiUrl}}/advertiser/update",
									"host": [
										"{{apiUrl}}"
									],
									"path": [
										"advertiser",
										"update"
									]
								}
							},
							"response": []
						},
						{
							"name": "Delete",
							"request": {
								"method": "DELETE",
								"header": [],
								"body": {
									"mode": "raw",
									"raw": "",
									"options": {
										"raw": {
											"language": "json"
										}
									}
								},
								"url": {
									"raw": "{{apiUrl}}/advertiser/1",
									"host": [
										"{{apiUrl}}"
									],
									"path": [
										"advertiser",
										"1"
									]
								}
							},
							"response": []
						},
						{
							"name": "Get list",
							"request": {
								"method": "GET",
								"header": [],
								"url": {
									"raw": "{{apiUrl}}/advertiser/list",
									"host": [
										"{{apiUrl}}"
									],
									"path": [
										"advertiser",
										"list"
									]
								}
							},
							"response": []
						}
					]
				},
				{
					"name": "Campaign",
					"item": [
						{
							"name": "New",
							"request": {
								"method": "POST",
								"header": [],
								"body": {
									"mode": "formdata",
									"formdata": [
										{
											"key": "name",
											"value": "Take One",
											"type": "text"
										},
										{
											"key": "advertiser",
											"value": "2",
											"type": "text"
										},
										{
											"key": "startDate",
											"value": "2022-07-03",
											"type": "text"
										},
										{
											"key": "status",
											"value": "running",
											"type": "text"
										},
										{
											"key": "stopAtDate",
											"value": "",
											"type": "text"
										},
										{
											"key": "stopAtImpression",
											"value": "",
											"type": "text"
										},
										{
											"key": "stopAtClick",
											"value": "",
											"type": "text"
										},
										{
											"key": "stopAtConversion",
											"value": "",
											"type": "text"
										},
										{
											"key": "priority",
											"value": "1",
											"type": "text"
										},
										{
											"key": "adverts[0][link]",
											"value": "google.com",
											"type": "text"
										},
										{
											"key": "adverts[0][media]",
											"type": "file",
											"src": "SUtT3-7Gl/screenshot-stumble.bkk.th.your-pos.com-2022.07.04-19_59_33.png"
										},
										{
											"key": "adverts[0][slotType]",
											"value": "1",
											"type": "text"
										},
										{
											"key": "adverts[0][pages][]",
											"value": "1",
											"type": "text"
										},
										{
											"key": "adverts[0][pages][]",
											"value": "2",
											"type": "text"
										}
									]
								},
								"url": {
									"raw": "{{apiUrl}}/campaign",
									"host": [
										"{{apiUrl}}"
									],
									"path": [
										"campaign"
									]
								}
							},
							"response": []
						},
						{
							"name": "Update",
							"request": {
								"method": "POST",
								"header": [],
								"body": {
									"mode": "raw",
									"raw": "{\r\n    \"id\": 1,\r\n    \"name\": \"June Sale 2\",\r\n    \"advertiser\": 2,\r\n    \"startDate\": \"2022-10-03 17:22:00\",\r\n    \"stopAtDate\": null,\r\n    \"stopAtImpression\": null,\r\n    \"stopAtClick\": null,\r\n    \"priority\": 6,\r\n    \"viewerLimitTotal\": null,\r\n    \"viewerLimitPerSession\": null,\r\n    \"viewerLimitReset\": null\r\n}",
									"options": {
										"raw": {
											"language": "json"
										}
									}
								},
								"url": {
									"raw": "{{apiUrl}}/campaign/update",
									"host": [
										"{{apiUrl}}"
									],
									"path": [
										"campaign",
										"update"
									]
								}
							},
							"response": []
						},
						{
							"name": "Delete",
							"request": {
								"method": "DELETE",
								"header": [],
								"body": {
									"mode": "raw",
									"raw": "",
									"options": {
										"raw": {
											"language": "json"
										}
									}
								},
								"url": {
									"raw": "{{apiUrl}}/campaign/1",
									"host": [
										"{{apiUrl}}"
									],
									"path": [
										"campaign",
										"1"
									]
								}
							},
							"response": []
						},
						{
							"name": "Get list",
							"request": {
								"method": "GET",
								"header": [
									{
										"key": "X-Ozone-Spot",
										"value": "QXNpYS9Ib19DaGlfTWluaA==",
										"type": "text"
									}
								],
								"url": {
									"raw": "{{apiUrl}}/campaign/list",
									"host": [
										"{{apiUrl}}"
									],
									"path": [
										"campaign",
										"list"
									]
								}
							},
							"response": []
						}
					]
				},
				{
					"name": "Advert",
					"item": [
						{
							"name": "New",
							"request": {
								"method": "POST",
								"header": [],
								"body": {
									"mode": "formdata",
									"formdata": [
										{
											"key": "name",
											"value": "banner take one",
											"type": "text"
										},
										{
											"key": "campaign",
											"value": "17",
											"type": "text"
										},
										{
											"key": "link",
											"value": "google.com",
											"type": "text"
										},
										{
											"key": "media",
											"type": "file",
											"src": "aQ_N8XDS6/screenshot-localhost-2022.07.05-10_14_39.png"
										},
										{
											"key": "slotType",
											"value": "1",
											"type": "text"
										},
										{
											"key": "pages[]",
											"value": "1",
											"type": "text"
										},
										{
											"key": "pages[]",
											"value": "2",
											"type": "text"
										}
									]
								},
								"url": {
									"raw": "{{apiUrl}}/advert",
									"host": [
										"{{apiUrl}}"
									],
									"path": [
										"advert"
									]
								}
							},
							"response": []
						},
						{
							"name": "Update",
							"request": {
								"method": "POST",
								"header": [],
								"body": {
									"mode": "formdata",
									"formdata": [
										{
											"key": "id",
											"value": "1",
											"type": "text"
										},
										{
											"key": "name",
											"value": "banner take one",
											"type": "text"
										},
										{
											"key": "campaign",
											"value": "2",
											"type": "text"
										},
										{
											"key": "link",
											"value": "google.com",
											"type": "text"
										},
										{
											"key": "media",
											"type": "file",
											"src": "aQ_N8XDS6/screenshot-localhost-2022.07.05-10_14_39.png"
										},
										{
											"key": "slotType",
											"value": "1",
											"type": "text"
										},
										{
											"key": "pages[]",
											"value": "2",
											"type": "text"
										},
										{
											"key": "pages[]",
											"value": "1",
											"type": "text"
										}
									]
								},
								"url": {
									"raw": "{{apiUrl}}/advert/update",
									"host": [
										"{{apiUrl}}"
									],
									"path": [
										"advert",
										"update"
									]
								}
							},
							"response": []
						},
						{
							"name": "Delete",
							"request": {
								"method": "DELETE",
								"header": [],
								"body": {
									"mode": "raw",
									"raw": "",
									"options": {
										"raw": {
											"language": "json"
										}
									}
								},
								"url": {
									"raw": "{{apiUrl}}/advert/1",
									"host": [
										"{{apiUrl}}"
									],
									"path": [
										"advert",
										"1"
									]
								}
							},
							"response": []
						},
						{
							"name": "Get list",
							"request": {
								"method": "GET",
								"header": [
									{
										"key": "X-Ozone-Spot",
										"value": "QXNpYS9Ib19DaGlfTWluaA==",
										"type": "text"
									}
								],
								"url": {
									"raw": "{{apiUrl}}/campaign/list?filter_id=1",
									"host": [
										"{{apiUrl}}"
									],
									"path": [
										"campaign",
										"list"
									],
									"query": [
										{
											"key": "filter_id",
											"value": "1"
										}
									]
								}
							},
							"response": []
						}
					]
				},
				{
					"name": "School",
					"item": [
						{
							"name": "Get list",
							"request": {
								"method": "GET",
								"header": [],
								"url": {
									"raw": "{{apiUrl}}/school/list",
									"host": [
										"{{apiUrl}}"
									],
									"path": [
										"school",
										"list"
									]
								}
							},
							"response": []
						},
						{
							"name": "Get one",
							"request": {
								"method": "GET",
								"header": [],
								"url": {
									"raw": "{{apiUrl}}/school/1",
									"host": [
										"{{apiUrl}}"
									],
									"path": [
										"school",
										"1"
									]
								}
							},
							"response": []
						}
					]
				},
				{
					"name": "School League",
					"item": [
						{
							"name": "Get list",
							"request": {
								"method": "GET",
								"header": [],
								"url": {
									"raw": "{{apiUrl}}/school-league/list",
									"host": [
										"{{apiUrl}}"
									],
									"path": [
										"school-league",
										"list"
									]
								}
							},
							"response": []
						}
					]
				},
				{
					"name": "School Group",
					"item": [
						{
							"name": "Get list",
							"request": {
								"method": "GET",
								"header": [],
								"url": {
									"raw": "{{apiUrl}}/school-group/list",
									"host": [
										"{{apiUrl}}"
									],
									"path": [
										"school-group",
										"list"
									]
								}
							},
							"response": []
						}
					]
				},
				{
					"name": "Shool Type",
					"item": [
						{
							"name": "Get list",
							"request": {
								"method": "GET",
								"header": [],
								"url": {
									"raw": "{{apiUrl}}/school-type/list",
									"host": [
										"{{apiUrl}}"
									],
									"path": [
										"school-type",
										"list"
									]
								}
							},
							"response": []
						}
					]
				},
				{
					"name": "Zone",
					"item": [
						{
							"name": "Get list",
							"request": {
								"method": "GET",
								"header": [],
								"url": {
									"raw": "{{apiUrl}}/zone/list",
									"host": [
										"{{apiUrl}}"
									],
									"path": [
										"zone",
										"list"
									]
								}
							},
							"response": []
						}
					]
				},
				{
					"name": "Country",
					"item": [
						{
							"name": "Get list",
							"request": {
								"method": "GET",
								"header": [],
								"url": {
									"raw": "{{apiUrl}}/country/list",
									"host": [
										"{{apiUrl}}"
									],
									"path": [
										"country",
										"list"
									]
								}
							},
							"response": []
						}
					]
				},
				{
					"name": "Program",
					"item": [
						{
							"name": "Get list",
							"request": {
								"method": "GET",
								"header": [],
								"url": {
									"raw": "{{apiUrl}}/program/list",
									"host": [
										"{{apiUrl}}"
									],
									"path": [
										"program",
										"list"
									]
								}
							},
							"response": []
						},
						{
							"name": "Get one",
							"request": {
								"method": "GET",
								"header": [],
								"url": {
									"raw": "{{apiUrl}}/program/1",
									"host": [
										"{{apiUrl}}"
									],
									"path": [
										"program",
										"1"
									]
								}
							},
							"response": []
						}
					]
				},
				{
					"name": "Program Level",
					"item": [
						{
							"name": "Get list",
							"request": {
								"method": "GET",
								"header": [],
								"url": {
									"raw": "{{apiUrl}}/program-level/list",
									"host": [
										"{{apiUrl}}"
									],
									"path": [
										"program-level",
										"list"
									]
								}
							},
							"response": []
						}
					]
				},
				{
					"name": "Program Type",
					"item": [
						{
							"name": "Get list",
							"request": {
								"method": "GET",
								"header": [],
								"url": {
									"raw": "{{apiUrl}}/program-type/list",
									"host": [
										"{{apiUrl}}"
									],
									"path": [
										"program-type",
										"list"
									]
								}
							},
							"response": []
						}
					]
				},
				{
					"name": "Program Major",
					"item": [
						{
							"name": "Get list",
							"request": {
								"method": "GET",
								"header": [],
								"url": {
									"raw": "{{apiUrl}}/program-major/list",
									"host": [
										"{{apiUrl}}"
									],
									"path": [
										"program-major",
										"list"
									]
								}
							},
							"response": []
						}
					]
				},
				{
					"name": "Program Speciality",
					"item": [
						{
							"name": "Get list",
							"request": {
								"method": "GET",
								"header": [],
								"url": {
									"raw": "{{apiUrl}}/program-speciality/list",
									"host": [
										"{{apiUrl}}"
									],
									"path": [
										"program-speciality",
										"list"
									]
								}
							},
							"response": []
						}
					]
				},
				{
					"name": "Ranking",
					"item": [
						{
							"name": "New",
							"request": {
								"method": "POST",
								"header": [],
								"body": {
									"mode": "raw",
									"raw": "{\r\n    \"programId\": 1,\r\n    \"programSpecialityId\": 1,\r\n    \"rank\": 1,\r\n    \"stars\": 1,\r\n    \"year\": 2022 \r\n}\r\n",
									"options": {
										"raw": {
											"language": "json"
										}
									}
								},
								"url": {
									"raw": "{{apiUrl}}/ranking",
									"host": [
										"{{apiUrl}}"
									],
									"path": [
										"ranking"
									]
								}
							},
							"response": []
						},
						{
							"name": "Update",
							"request": {
								"method": "POST",
								"header": [],
								"body": {
									"mode": "raw",
									"raw": "{\r\n    \"id\": 2,\r\n    \"programId\" : 2,\r\n    \"programSpecialityId\" : 2,\r\n    \"rank\": 2,\r\n    \"stars\": 2,\r\n    \"year\": 2022 \r\n}\r\n\r\n",
									"options": {
										"raw": {
											"language": "json"
										}
									}
								},
								"url": {
									"raw": "{{apiUrl}}/ranking/update",
									"host": [
										"{{apiUrl}}"
									],
									"path": [
										"ranking",
										"update"
									]
								}
							},
							"response": []
						},
						{
							"name": "Delete",
							"request": {
								"method": "DELETE",
								"header": [],
								"url": {
									"raw": "{{apiUrl}}/ranking/1",
									"host": [
										"{{apiUrl}}"
									],
									"path": [
										"ranking",
										"1"
									]
								}
							},
							"response": []
						},
						{
							"name": "Get list",
							"request": {
								"method": "GET",
								"header": [],
								"url": {
									"raw": "{{apiUrl}}/ranking/list",
									"host": [
										"{{apiUrl}}"
									],
									"path": [
										"ranking",
										"list"
									]
								}
							},
							"response": []
						}
					]
				}
			],
			"event": [
				{
					"listen": "prerequest",
					"script": {
						"type": "text/javascript",
						"exec": [
							"var sha256 = function sha256(ascii) {",
							"      function rightRotate(value, amount) {",
							"        return (value>>>amount) | (value<<(32 - amount));",
							"      };",
							"      ",
							"      var mathPow = Math.pow;",
							"      var maxWord = mathPow(2, 32);",
							"      var lengthProperty = 'length'",
							"      var i, j; // Used as a counter across the whole file",
							"      var result = ''",
							"",
							"      var words = [];",
							"      var asciiBitLength = ascii[lengthProperty]*8;",
							"      ",
							"      //* caching results is optional - remove/add slash from front of this line to toggle",
							"      // Initial hash value: first 32 bits of the fractional parts of the square roots of the first 8 primes",
							"      // (we actually calculate the first 64, but extra values are just ignored)",
							"      var hash = sha256.h = sha256.h || [];",
							"      // Round constants: first 32 bits of the fractional parts of the cube roots of the first 64 primes",
							"      var k = sha256.k = sha256.k || [];",
							"      var primeCounter = k[lengthProperty];",
							"      /*/",
							"      var hash = [], k = [];",
							"      var primeCounter = 0;",
							"      //*/",
							"",
							"      var isComposite = {};",
							"      for (var candidate = 2; primeCounter < 64; candidate++) {",
							"        if (!isComposite[candidate]) {",
							"          for (i = 0; i < 313; i += candidate) {",
							"            isComposite[i] = candidate;",
							"          }",
							"          hash[primeCounter] = (mathPow(candidate, .5)*maxWord)|0;",
							"          k[primeCounter++] = (mathPow(candidate, 1/3)*maxWord)|0;",
							"        }",
							"      }",
							"      ",
							"      ascii += '\\x80' // Append Ƈ' bit (plus zero padding)",
							"      while (ascii[lengthProperty]%64 - 56) ascii += '\\x00' // More zero padding",
							"      for (i = 0; i < ascii[lengthProperty]; i++) {",
							"        j = ascii.charCodeAt(i);",
							"        if (j>>8) return; // ASCII check: only accept characters in range 0-255",
							"        words[i>>2] |= j << ((3 - i)%4)*8;",
							"      }",
							"      words[words[lengthProperty]] = ((asciiBitLength/maxWord)|0);",
							"      words[words[lengthProperty]] = (asciiBitLength)",
							"      ",
							"      // process each chunk",
							"      for (j = 0; j < words[lengthProperty];) {",
							"        var w = words.slice(j, j += 16); // The message is expanded into 64 words as part of the iteration",
							"        var oldHash = hash;",
							"        // This is now the undefinedworking hash\", often labelled as variables a...g",
							"        // (we have to truncate as well, otherwise extra entries at the end accumulate",
							"        hash = hash.slice(0, 8);",
							"        ",
							"        for (i = 0; i < 64; i++) {",
							"          var i2 = i + j;",
							"          // Expand the message into 64 words",
							"          // Used below if ",
							"          var w15 = w[i - 15], w2 = w[i - 2];",
							"",
							"          // Iterate",
							"          var a = hash[0], e = hash[4];",
							"          var temp1 = hash[7]",
							"            + (rightRotate(e, 6) ^ rightRotate(e, 11) ^ rightRotate(e, 25)) // S1",
							"            + ((e&hash[5])^((~e)&hash[6])) // ch",
							"            + k[i]",
							"            // Expand the message schedule if needed",
							"            + (w[i] = (i < 16) ? w[i] : (",
							"                w[i - 16]",
							"                + (rightRotate(w15, 7) ^ rightRotate(w15, 18) ^ (w15>>>3)) // s0",
							"                + w[i - 7]",
							"                + (rightRotate(w2, 17) ^ rightRotate(w2, 19) ^ (w2>>>10)) // s1",
							"              )|0",
							"            );",
							"          // This is only used once, so could be moved below, but it only saves 4 bytes and makes things unreadble",
							"          var temp2 = (rightRotate(a, 2) ^ rightRotate(a, 13) ^ rightRotate(a, 22)) // S0",
							"            + ((a&hash[1])^(a&hash[2])^(hash[1]&hash[2])); // maj",
							"          ",
							"          hash = [(temp1 + temp2)|0].concat(hash); // We don't bother trimming off the extra ones, they're harmless as long as we're truncating when we do the slice()",
							"          hash[4] = (hash[4] + temp1)|0;",
							"        }",
							"        ",
							"        for (i = 0; i < 8; i++) {",
							"          hash[i] = (hash[i] + oldHash[i])|0;",
							"        }",
							"      }",
							"      ",
							"      for (i = 0; i < 8; i++) {",
							"        for (j = 3; j + 1; j--) {",
							"          var b = (hash[i]>>(j*8))&255;",
							"          result += ((b < 16) ? 0 : '') + b.toString(16);",
							"        }",
							"      }",
							"      return result;",
							"    };",
							"var nonce = \"\";",
							"var possible = \"ABCDEFGHIJKLMNOPQRSTUVWXYZabcdefghijklmnopqrstuvwxyz0123456789\";",
							"for(var i = 0; i < 11; i++) {",
							"    nonce += possible.charAt(Math.floor(Math.random() * possible.length));",
							"}",
							"var created = Math.floor(Date.now() / 1000);",
							"var password = pm.environment.get(\"X-W-Password-Encrypted\");",
							"var username = pm.environment.get(\"X-W-Username\");",
							"var passwordDigest = sha256(nonce + created + password);",
							"pm.request.headers.add({key: 'X-W-Auth', value: '/UsernameToken Email=\"' + username + '\", PasswordDigest=\"' + passwordDigest + '\", Nonce=\"' + nonce + '\", Created=\"' + created + '\"/' })"
						]
					}
				},
				{
					"listen": "test",
					"script": {
						"type": "text/javascript",
						"exec": [
							""
						]
					}
				}
			]
		},
		{
			"name": "Public",
			"item": [
				{
					"name": "Login",
					"event": [
						{
							"listen": "test",
							"script": {
								"exec": [
									"function generateJWT(email, passwordEncrypted) {\r",
									"    var sha256 = function sha256(ascii) {\r",
									"      function rightRotate(value, amount) {\r",
									"        return (value>>>amount) | (value<<(32 - amount));\r",
									"      };\r",
									"      \r",
									"      var mathPow = Math.pow;\r",
									"      var maxWord = mathPow(2, 32);\r",
									"      var lengthProperty = 'length'\r",
									"      var i, j; // Used as a counter across the whole file\r",
									"      var result = ''\r",
									"\r",
									"      var words = [];\r",
									"      var asciiBitLength = ascii[lengthProperty]*8;\r",
									"      \r",
									"      //* caching results is optional - remove/add slash from front of this line to toggle\r",
									"      // Initial hash value: first 32 bits of the fractional parts of the square roots of the first 8 primes\r",
									"      // (we actually calculate the first 64, but extra values are just ignored)\r",
									"      var hash = sha256.h = sha256.h || [];\r",
									"      // Round constants: first 32 bits of the fractional parts of the cube roots of the first 64 primes\r",
									"      var k = sha256.k = sha256.k || [];\r",
									"      var primeCounter = k[lengthProperty];\r",
									"      /*/\r",
									"      var hash = [], k = [];\r",
									"      var primeCounter = 0;\r",
									"      //*/\r",
									"\r",
									"      var isComposite = {};\r",
									"      for (var candidate = 2; primeCounter < 64; candidate++) {\r",
									"        if (!isComposite[candidate]) {\r",
									"          for (i = 0; i < 313; i += candidate) {\r",
									"            isComposite[i] = candidate;\r",
									"          }\r",
									"          hash[primeCounter] = (mathPow(candidate, .5)*maxWord)|0;\r",
									"          k[primeCounter++] = (mathPow(candidate, 1/3)*maxWord)|0;\r",
									"        }\r",
									"      }\r",
									"      \r",
									"      ascii += '\\x80' // Append Ƈ' bit (plus zero padding)\r",
									"      while (ascii[lengthProperty]%64 - 56) ascii += '\\x00' // More zero padding\r",
									"      for (i = 0; i < ascii[lengthProperty]; i++) {\r",
									"        j = ascii.charCodeAt(i);\r",
									"        if (j>>8) return; // ASCII check: only accept characters in range 0-255\r",
									"        words[i>>2] |= j << ((3 - i)%4)*8;\r",
									"      }\r",
									"      words[words[lengthProperty]] = ((asciiBitLength/maxWord)|0);\r",
									"      words[words[lengthProperty]] = (asciiBitLength)\r",
									"      \r",
									"      // process each chunk\r",
									"      for (j = 0; j < words[lengthProperty];) {\r",
									"        var w = words.slice(j, j += 16); // The message is expanded into 64 words as part of the iteration\r",
									"        var oldHash = hash;\r",
									"        // This is now the undefinedworking hash\", often labelled as variables a...g\r",
									"        // (we have to truncate as well, otherwise extra entries at the end accumulate\r",
									"        hash = hash.slice(0, 8);\r",
									"        \r",
									"        for (i = 0; i < 64; i++) {\r",
									"          var i2 = i + j;\r",
									"          // Expand the message into 64 words\r",
									"          // Used below if \r",
									"          var w15 = w[i - 15], w2 = w[i - 2];\r",
									"\r",
									"          // Iterate\r",
									"          var a = hash[0], e = hash[4];\r",
									"          var temp1 = hash[7]\r",
									"            + (rightRotate(e, 6) ^ rightRotate(e, 11) ^ rightRotate(e, 25)) // S1\r",
									"            + ((e&hash[5])^((~e)&hash[6])) // ch\r",
									"            + k[i]\r",
									"            // Expand the message schedule if needed\r",
									"            + (w[i] = (i < 16) ? w[i] : (\r",
									"                w[i - 16]\r",
									"                + (rightRotate(w15, 7) ^ rightRotate(w15, 18) ^ (w15>>>3)) // s0\r",
									"                + w[i - 7]\r",
									"                + (rightRotate(w2, 17) ^ rightRotate(w2, 19) ^ (w2>>>10)) // s1\r",
									"              )|0\r",
									"            );\r",
									"          // This is only used once, so *could* be moved below, but it only saves 4 bytes and makes things unreadble\r",
									"          var temp2 = (rightRotate(a, 2) ^ rightRotate(a, 13) ^ rightRotate(a, 22)) // S0\r",
									"            + ((a&hash[1])^(a&hash[2])^(hash[1]&hash[2])); // maj\r",
									"          \r",
									"          hash = [(temp1 + temp2)|0].concat(hash); // We don't bother trimming off the extra ones, they're harmless as long as we're truncating when we do the slice()\r",
									"          hash[4] = (hash[4] + temp1)|0;\r",
									"        }\r",
									"        \r",
									"        for (i = 0; i < 8; i++) {\r",
									"          hash[i] = (hash[i] + oldHash[i])|0;\r",
									"        }\r",
									"      }\r",
									"      \r",
									"      for (i = 0; i < 8; i++) {\r",
									"        for (j = 3; j + 1; j--) {\r",
									"          var b = (hash[i]>>(j*8))&255;\r",
									"          result += ((b < 16) ? 0 : '') + b.toString(16);\r",
									"        }\r",
									"      }\r",
									"      return result;\r",
									"    };\r",
									"    let nonce = '';\r",
									"    const possible = 'ABCDEFGHIJKLMNOPQRSTUVWXYZabcdefghijklmnopqrstuvwxyz0123456789';\r",
									"    for (let i = 0; i < 11; i++) {\r",
									"      nonce += possible.charAt(Math.floor(Math.random() * possible.length));\r",
									"    }\r",
									"    const created = Math.floor(Date.now() / 1000);\r",
									"    const passwordDigest = sha256(nonce + created + passwordEncrypted);\r",
									"    return `/UsernameToken Email=\"${email}\", PasswordDigest=\"${passwordDigest}\", Nonce=\"${nonce}\", Created=\"${created}\"/`;\r",
									"  }\r",
									"\r",
									"const responseJson = pm.response.json();\r",
									"\r",
									"if (typeof (responseJson.error) != 'undefined') {\r",
									"    return;\r",
									"}\r",
									"pm.environment.set(\"auth\", generateJWT(responseJson.email, responseJson.password));"
								],
								"type": "text/javascript"
							}
						}
					],
					"request": {
						"method": "POST",
						"header": [],
						"body": {
							"mode": "raw",
							"raw": "{\r\n    \"email\": \"admin\",\r\n    \"password\": \"silk@455\"\r\n}",
							"options": {
								"raw": {
									"language": "json"
								}
							}
						},
						"url": {
							"raw": "{{apiUrl}}/auth",
							"host": [
								"{{apiUrl}}"
							],
							"path": [
								"auth"
							]
						}
					},
					"response": []
				},
				{
					"name": "Register",
					"request": {
						"method": "POST",
						"header": [],
						"body": {
							"mode": "raw",
							"raw": "{\r\n    \"email\": \"hailie_aue0@yahoo.com\",\r\n    \"password\": \"123456789\",\r\n    \"firstName\": \"Alyssa\",\r\n    \"lastName\": \"C Johnson\",\r\n    \"phone\": \"770-231-4077\",\r\n    \"city\": \"Atlanta\",\r\n    \"state\": \"Georgia\",\r\n    \"country\": \"US\",\r\n    \"languages\": [4,20],\r\n    \"feUrl\": \"http://localhoseet:8081\"\r\n}",
							"options": {
								"raw": {
									"language": "json"
								}
							}
						},
						"url": {
							"raw": "{{apiUrl}}/register",
							"host": [
								"{{apiUrl}}"
							],
							"path": [
								"register"
							]
						}
					},
					"response": []
				}
			]
		}
	]
}