{
  "name": "artist",
  "base": "PersistedModel",
  "idInjection": true,
  "options": {
    "validateUpsert": true,
    "mysql": {
      "table": "artist"
    }
  },
  "properties": {
    "artistName": {
      "type": "string",
      "required": true,
      "mysql": {
        "columnName": "artistName",
        "dataType": "VARCHAR",
        "dataLength": 255,
        "dataPrecision": null,
        "dataScale": 0,
        "nullable": "N"
      }
    }
  },
  "validations": [],
  "relations": {},
  "acls": [],
  "methods": {}
}
