{
  "name": "genre",
  "base": "PersistedModel",
  "idInjection": true,
  "options": {
    "validateUpsert": true
  },
  "mysql": {
    "table": "genre"
  },
  "properties": {
    "genreType": {
      "type": "string",
      "required": true,
      "mysql": {
        "columnName": "genreType",
        "dataType": "VARCHAR",
        "dataLength": 255,
        "dataPrecision": null,
        "dataScale": 0,
        "nullable": "N"
      }
    }
  },
  "validations": [],
  "relations": {},
  "acls": [],
  "methods": {}
}
