[
  {
    "id": 1,
    "name": "Michael Scott",
    "email": "mscott@dundermifflin.com"
  },
  {
    "id": 2,
    "name": "Pam Beesly",
    "email": "pbeesly@dundermifflin.com"
  },
  {
    "id": 3,
    "name": "Dwight Schrute",
    "email": "dschrute@dundermifflin.com"
  },
  {
    "id": 4,
    "name": "Jim Halpert",
    "email": "jhalpert@dundermifflin.com"
  },
  {
    "id": 5,
    "name": "Creed Bratton",
    "email": "cbratton@dundermifflin.com"
  }
]