<svg xmlns="http://www.w3.org/2000/svg" xmlns:xlink="http://www.w3.org/1999/xlink" width="44.145" height="31.329" viewBox="0 0 44.145 31.329">
  <defs>
    <clipPath id="clip-path">
      <rect id="Rectangle_1029" data-name="Rectangle 1029" width="9.968" height="31.329" fill="#fff" stroke="#707070" stroke-width="1"/>
    </clipPath>
  </defs>
  <g id="ic_images" transform="translate(-372.427 -265)">
    <g id="Group_923" data-name="Group 923" transform="translate(-1035.573 726)">
      <g id="ic_images-2" data-name="ic_images">
        <g id="Group_852" data-name="Group 852" transform="translate(1423.664 -440.673)">
          <path id="Path_1398" data-name="Path 1398" d="M227.03,567.22h-7.28a.619.619,0,1,1,0-1.239h7.28a.619.619,0,1,1,0,1.239Z" transform="translate(-219.131 -565.981)" fill="#24a6e2"/>
          <path id="Path_1399" data-name="Path 1399" d="M228.834,569.637H219.6a.642.642,0,0,1,0-1.239h9.23a.642.642,0,0,1,0,1.239Z" transform="translate(-219.131 -565.398)" fill="#24a6e2"/>
          <path id="Path_1400" data-name="Path 1400" d="M224.809,574.471h-5.058a.62.62,0,1,1,0-1.239h5.058a.62.62,0,1,1,0,1.239Z" transform="translate(-219.131 -567.615)" fill="#24a6e2"/>
        </g>
        <g id="Group_851" data-name="Group 851" transform="translate(1423.664 -456.984)">
          <g id="Layer_2" data-name="Layer 2" transform="translate(0.001 0)">
            <rect id="Rectangle_996" data-name="Rectangle 996" width="12.788" height="12.788" rx="4" transform="translate(0)" fill="#24a6e2"/>
          </g>
          <g id="Layer_3" data-name="Layer 3" transform="translate(0 2.023)">
            <g id="Group_848" data-name="Group 848" transform="translate(0 2.419)">
              <path id="Path_1395" data-name="Path 1395" d="M66.885,811.965" transform="translate(-54.381 -806.981)" fill="none" stroke="#35424b" stroke-width="1"/>
              <path id="Path_1396" data-name="Path 1396" d="M50.09,804.706l-3.261-2.726-2.815,1.876-3.671-3.949-3.04,3.127v-1.2l3.053-3.154,3.788,4.074,2.736-1.823,3.21,2.643Z" transform="translate(-37.302 -798.68)" fill="#fff"/>
            </g>
            <g id="Group_849" data-name="Group 849" transform="translate(5.502)">
              <path id="Path_1397" data-name="Path 1397" d="M51.439,797.74a1.644,1.644,0,1,1,1.644-1.645,1.647,1.647,0,0,1-1.644,1.645Z" transform="translate(-49.794 -794.451)" fill="#fff"/>
            </g>
          </g>
        </g>
      </g>
      <g id="Rectangle_1027" data-name="Rectangle 1027" transform="translate(1420.104 -460.288)" fill="none" stroke="#24a6e2" stroke-width="2">
        <rect width="19.936" height="29.905" rx="4" stroke="none"/>
        <rect x="1" y="1" width="17.936" height="27.905" rx="3" fill="none"/>
      </g>
      <g id="Mask_Group_2" data-name="Mask Group 2" transform="translate(1408 -461)" clip-path="url(#clip-path)">
        <g id="Path_1463" data-name="Path 1463" transform="translate(-10.68 0.712)" fill="none">
          <path d="M2.848,0h14.24a2.848,2.848,0,0,1,2.848,2.848V27.057A2.848,2.848,0,0,1,17.088,29.9H2.848A2.848,2.848,0,0,1,0,27.057V2.848A2.848,2.848,0,0,1,2.848,0Z" stroke="none"/>
          <path d="M 2.848066329956055 2.000003814697266 C 2.380435943603516 2.000003814697266 1.999996185302734 2.380443572998047 1.999996185302734 2.848064422607422 L 1.999996185302734 27.05658340454102 C 1.999996185302734 27.52420425415039 2.380435943603516 27.90464401245117 2.848066329956055 27.90464401245117 L 17.08837509155273 27.90464401245117 C 17.55599594116211 27.90464401245117 17.93643569946289 27.52420425415039 17.93643569946289 27.05658340454102 L 17.93643569946289 2.848064422607422 C 17.93643569946289 2.380443572998047 17.55599594116211 2.000003814697266 17.08837509155273 2.000003814697266 L 2.848066329956055 2.000003814697266 M 2.848066329956055 3.814697265625e-06 L 17.08837509155273 3.814697265625e-06 C 18.66131591796875 3.814697265625e-06 19.93643569946289 1.275123596191406 19.93643569946289 2.848064422607422 L 19.93643569946289 27.05658340454102 C 19.93643569946289 28.62952423095703 18.66131591796875 29.90464401245117 17.08837509155273 29.90464401245117 L 2.848066329956055 29.90464401245117 C 1.275115966796875 29.90464401245117 -3.814697265625e-06 28.62952423095703 -3.814697265625e-06 27.05658340454102 L -3.814697265625e-06 2.848064422607422 C -3.814697265625e-06 1.275123596191406 1.275115966796875 3.814697265625e-06 2.848066329956055 3.814697265625e-06 Z" stroke="none" fill="#24a6e2"/>
        </g>
      </g>
      <g id="Mask_Group_3" data-name="Mask Group 3" transform="translate(1452.145 -429.671) rotate(180)" clip-path="url(#clip-path)">
        <g id="Path_1464" data-name="Path 1464" transform="translate(-10.68 0.712)" fill="none">
          <path d="M2.848,0h14.24a2.848,2.848,0,0,1,2.848,2.848V27.057A2.848,2.848,0,0,1,17.088,29.9H2.848A2.848,2.848,0,0,1,0,27.057V2.848A2.848,2.848,0,0,1,2.848,0Z" stroke="none"/>
          <path d="M 2.848066329956055 2.000003814697266 C 2.380435943603516 2.000003814697266 1.999996185302734 2.380443572998047 1.999996185302734 2.848064422607422 L 1.999996185302734 27.05658340454102 C 1.999996185302734 27.52420425415039 2.380435943603516 27.90464401245117 2.848066329956055 27.90464401245117 L 17.08837509155273 27.90464401245117 C 17.55599594116211 27.90464401245117 17.93643569946289 27.52420425415039 17.93643569946289 27.05658340454102 L 17.93643569946289 2.848064422607422 C 17.93643569946289 2.380443572998047 17.55599594116211 2.000003814697266 17.08837509155273 2.000003814697266 L 2.848066329956055 2.000003814697266 M 2.848066329956055 3.814697265625e-06 L 17.08837509155273 3.814697265625e-06 C 18.66131591796875 3.814697265625e-06 19.93643569946289 1.275123596191406 19.93643569946289 2.848064422607422 L 19.93643569946289 27.05658340454102 C 19.93643569946289 28.62952423095703 18.66131591796875 29.90464401245117 17.08837509155273 29.90464401245117 L 2.848066329956055 29.90464401245117 C 1.275125503540039 29.90464401245117 -3.814697265625e-06 28.62952423095703 -3.814697265625e-06 27.05658340454102 L -3.814697265625e-06 2.848064422607422 C -3.814697265625e-06 1.275123596191406 1.275125503540039 3.814697265625e-06 2.848066329956055 3.814697265625e-06 Z" stroke="none" fill="#24a6e2"/>
        </g>
      </g>
    </g>
  </g>
</svg>
