<svg xmlns="http://www.w3.org/2000/svg" width="17" height="17" viewBox="0 0 17 17">
  <g id="pricing" transform="translate(-5328 -1780)">
    <rect id="Rectangle_817" data-name="Rectangle 817" width="17" height="17" transform="translate(5328 1780)" fill="none"/>
    <g id="Group_3003" data-name="Group 3003" transform="translate(5329 1781)">
      <g id="Group_2839" data-name="Group 2839">
        <path id="Path_11446" data-name="Path 11446" d="M254.813,163.406a1.406,1.406,0,1,0-1.406,1.406,1.408,1.408,0,0,0,1.406-1.406Zm-1.875,0a.469.469,0,1,1,.469.469.469.469,0,0,1-.469-.469Zm0,0" transform="translate(-250.125 -160.125)" fill="#164883"/>
        <path id="Path_11447" data-name="Path 11447" d="M218.863,121.637l-7.5-7.5a.468.468,0,0,0-.331-.137h-6.562a.468.468,0,0,0-.469.469v6.563a.468.468,0,0,0,.137.331l1.447,1.447.663-.663-1.309-1.309v-5.9h5.9l7.031,7.031-5.9,5.9-2.618-2.618h-.663v.663l2.95,2.95a.469.469,0,0,0,.663,0l6.563-6.563a.468.468,0,0,0,0-.663Zm0,0" transform="translate(-204 -114)" fill="#164883"/>
      </g>
      <path id="Path_11448" data-name="Path 11448" d="M241.875,330,240,331.875h1.406v4.688h.938v-4.687h1.406Zm0,0" transform="translate(-238.594 -321.563)" fill="#164883"/>
    </g>
  </g>
</svg>
