<svg xmlns="http://www.w3.org/2000/svg" width="169.125" height="49.142" viewBox="0 0 169.125 49.142">
  <defs>
    <style>
      .cls-1, .cls-3 {
        fill: #fff;
      }

      .cls-2 {
        fill: #24a6e2;
      }

      .cls-3 {
        font-size: 10px;
        font-family: Montserrat-Regular, Montserrat;
        letter-spacing: 0.1em;
      }
    </style>
  </defs>
  <g id="Group_3000" data-name="Group 3000" transform="translate(-1398 -28.858)">
    <g id="Group_1927" data-name="Group 1927" transform="translate(1327 -5.642)">
      <g id="Group_1" data-name="Group 1" transform="translate(91.301 36.21)">
        <path id="Path_1" data-name="Path 1" class="cls-1" d="M241.368,3823.109h-.083v1.943H238.9v-19.781h2.5v7.823h.056a4.749,4.749,0,0,1,4.161-2.358,4.906,4.906,0,0,1,5.243,5.188v3.967a5.23,5.23,0,0,1-5.576,5.521A4.341,4.341,0,0,1,241.368,3823.109Zm6.935-3.051v-4.134c0-1.8-1.359-3.024-3.384-3.024a3.629,3.629,0,0,0-3.523,3.8v3.024a3.445,3.445,0,0,0,3.579,3.551A3.1,3.1,0,0,0,248.3,3820.058Z" transform="translate(-238.899 -3805.077)"/>
        <path id="Path_2" data-name="Path 2" class="cls-1" d="M316.838,3821.4v-16.256h2.525v16.312a1.411,1.411,0,0,0,1.609,1.526,12.993,12.993,0,0,0,1.526-.111v1.916a9.769,9.769,0,0,1-2.386.332C317.226,3825.122,316.838,3822.9,316.838,3821.4Z" transform="translate(-299.526 -3804.981)"/>
        <path id="Path_3" data-name="Path 3" class="cls-1" d="M362.8,3840.682v-9.432h2.525v8.628c0,2.357,1.11,3.467,2.913,3.467,2.025,0,3.579-1.442,3.579-3.995v-8.1h2.5v14.009H371.9v-2.191h-.055a4.975,4.975,0,0,1-4.383,2.5C364.411,3845.565,362.8,3843.567,362.8,3840.682Z" transform="translate(-335.281 -3825.285)"/>
        <path id="Path_4" data-name="Path 4" class="cls-1" d="M438,3838.934v-2.885c0-3.884,2.747-6.047,6.159-6.047,3.079,0,5.715,1.831,5.715,5.492v2.386H440.6v1.221c0,2.108,1.526,3.412,3.745,3.412a4.24,4.24,0,0,0,3.384-1.8l1.914,1.137a5.976,5.976,0,0,1-5.437,2.8C440.77,3844.649,438,3842.79,438,3838.934Zm9.377-2.8v-.667a3.1,3.1,0,0,0-3.3-3.356,3.342,3.342,0,0,0-3.468,3.551v.472Z" transform="translate(-393.773 -3824.314)"/>
        <path id="Path_5" data-name="Path 5" class="cls-1" d="M573.4,3839.184v-3.467c0-3.746,2.857-5.715,5.992-5.715,3.44,0,6.076,2.108,6.076,5.659v3.246c0,3.718-2.83,5.743-5.992,5.743C576.06,3844.649,573.4,3842.762,573.4,3839.184Zm9.516-.11v-3.635c0-1.969-1.276-3.3-3.523-3.3a3.176,3.176,0,0,0-3.468,3.412v3.606a3.216,3.216,0,0,0,3.551,3.356A3.124,3.124,0,0,0,582.912,3839.073Z" transform="translate(-499.098 -3824.314)"/>
        <path id="Path_6" data-name="Path 6" class="cls-1" d="M649.214,3846.88l2.33-.916a3.516,3.516,0,0,0,3.19,1.8,3.441,3.441,0,0,0,3.662-3.773v-2.275a4.589,4.589,0,0,1-4.161,2.3c-3.246,0-5.271-1.914-5.271-5.161v-3.412c0-3.69,2.5-5.577,5.3-5.577a4.581,4.581,0,0,1,4.134,2.386v-2.081h2.441v13.4c0,3.273-1.969,6.213-6.325,6.213C652.376,3849.792,650.1,3848.85,649.214,3846.88Zm9.183-8.517v-2.913a3.356,3.356,0,0,0-3.551-3.413,3.087,3.087,0,0,0-3.329,3.218v3.662c0,1.831,1.331,3.079,3.412,3.079A3.355,3.355,0,0,0,658.4,3838.363Z" transform="translate(-557.88 -3824.215)"/>
        <path id="Path_7" data-name="Path 7" class="cls-1" d="M729.153,3804.4h2.5v3.217h-2.5Zm0,5.963h2.5v14.01h-2.5Z" transform="translate(-620.258 -3804.397)"/>
        <path id="Path_8" data-name="Path 8" class="cls-1" d="M764.125,3838.961v-3a5.647,5.647,0,0,1,6.02-5.964c3.163,0,5.742,1.8,5.742,5.077v.332h-2.441V3835c0-1.666-1.276-2.886-3.273-2.886a3.272,3.272,0,0,0-3.44,3.579v3.33a3.208,3.208,0,0,0,3.5,3.495c2,0,3.218-1.192,3.218-2.885v-.305h2.441v.25c0,3.245-2.5,5.077-5.659,5.077C766.76,3844.649,764.125,3842.625,764.125,3838.961Z" transform="translate(-647.462 -3824.314)"/>
      </g>
      <path id="Path_9" data-name="Path 9" class="cls-2" d="M158.423,3829.2a1.439,1.439,0,0,1,1.253-.061,1.482,1.482,0,0,1,.445.3,1.461,1.461,0,0,1,.3.444,1.336,1.336,0,0,1,.114.551,1.4,1.4,0,0,1-.7,1.227l-8.2,4.9,8.2,4.928a1.393,1.393,0,0,1,.7,1.212,1.337,1.337,0,0,1-.411,1,1.389,1.389,0,0,1-1,.4,1.346,1.346,0,0,1-.7-.175l-10.18-6.114a1.408,1.408,0,0,1-.74-1.252,1.461,1.461,0,0,1,.74-1.239Z" transform="translate(-76.503 -3787.341)"/>
      <path id="Path_10" data-name="Path 10" class="cls-2" d="M501.147,3824.064l10.763-26.508a1.53,1.53,0,0,1,1.345-.859,1.4,1.4,0,0,1,1.038.424,1.433,1.433,0,0,1,.406,1.049,1.651,1.651,0,0,1-.129.6l-10.763,26.508a1.585,1.585,0,0,1-.323.445,1.453,1.453,0,0,1-2.466-1.046A1.486,1.486,0,0,1,501.147,3824.064Z" transform="translate(-351.495 -3762.197)"/>
      <path id="Path_11" data-name="Path 11" class="cls-2" d="M852.353,3843.928a1.449,1.449,0,0,1-1.253.061,1.519,1.519,0,0,1-.445-.3,1.489,1.489,0,0,1-.3-.444,1.344,1.344,0,0,1-.114-.552,1.4,1.4,0,0,1,.7-1.226l8.2-4.9-8.2-4.928a1.391,1.391,0,0,1-.7-1.212,1.338,1.338,0,0,1,.41-1,1.39,1.39,0,0,1,1-.4,1.347,1.347,0,0,1,.7.176l10.18,6.113a1.407,1.407,0,0,1,.74,1.252,1.46,1.46,0,0,1-.74,1.239Z" transform="translate(-623.147 -3787.341)"/>
    </g>
    <text id="pricing_analytics_tool" data-name="pricing analytics tool" class="cls-3" transform="translate(1483 75)"><tspan x="-76.965" y="0">PRICING ANALYTICS TOOL</tspan></text>
  </g>
</svg>
