<svg xmlns="http://www.w3.org/2000/svg" width="27.409" height="27.409" viewBox="0 0 27.409 27.409">
  <g id="ic_otp" transform="translate(-383.296 -663.296)">
    <path id="Path_1488" data-name="Path 1488" d="M7.28,20.985a1.071,1.071,0,0,1,1.071,1.071h0a1.071,1.071,0,0,1-2.141,0h0A1.071,1.071,0,0,1,7.28,20.985Zm3.212,1.071h0a1.071,1.071,0,1,0,2.141,0h0a1.071,1.071,0,1,0-2.141,0Zm4.283,0h0a1.071,1.071,0,0,0,2.141,0h0a1.071,1.071,0,1,0-2.141,0Zm4.283,0h0a1.071,1.071,0,0,0,2.141,0h0a1.071,1.071,0,0,0-2.141,0ZM24.732,16.7H23.447v2.141h1.285a.536.536,0,0,1,.535.535v5.353a.536.536,0,0,1-.535.535H2.677a.536.536,0,0,1-.535-.535V19.379a.536.536,0,0,1,.535-.535H3.961V16.7H2.677A2.68,2.68,0,0,0,0,19.379v5.353a2.68,2.68,0,0,0,2.677,2.677H24.732a2.68,2.68,0,0,0,2.677-2.677V19.379A2.68,2.68,0,0,0,24.732,16.7ZM19.7,18.842H7.709A1.606,1.606,0,0,1,6.1,17.236V8.243A1.606,1.606,0,0,1,7.709,6.637H9.528V4.09a4.176,4.176,0,0,1,8.351,0V6.637H19.7a1.606,1.606,0,0,1,1.606,1.606v8.993A1.606,1.606,0,0,1,19.7,18.842ZM11.669,6.637h4.068V4.09a2.036,2.036,0,0,0-4.068,0V6.637Zm.965,6.551v1.373h2.141V13.188a1.6,1.6,0,0,0,.535-1.2h0A1.606,1.606,0,0,0,13.7,10.385h0A1.606,1.606,0,0,0,12.1,11.991h0A1.6,1.6,0,0,0,12.634,13.188Z" transform="translate(383.296 663.296)" fill="#24a6e2"/>
  </g>
</svg>
