"Id","Recipient_name","Message body"
"21","Bruce","Message : 122 from sreebhargava to Bruce"
"22","Bruce","Message : 123 from sreebhargava to Bruce"
"23","Bruce","Message : 124 from sreebhargava to Bruce"
"24","Bruce","Message : 125 from sreebhargava to Bruce"
"25","Bruce","Message : 126 from sreebhargava to Bruce"
"26","Bruce","Message : 127 from sreebhargava to Bruce"
"27","Bruce","Message : 128 from sreebhargava to Bruce"
"28","Bruce","Message : 129 from sreebhargava to Bruce"
"29","Tony","Message : 130 from sreebhargava to Tony"
"30","Tony","Message : 131 from sreebhargava to Tony"
"31","Tony","Message : 132 from sreebhargava to Tony"
"32","Tony","Message : 133 from sreebhargava to Tony"
"33","Tony","Message : 134 from sreebhargava to Tony"
"34","Tony","Message : 135 from sreebhargava to Tony"
"35","Tony","Message : 136 from sreebhargava to Tony"
"36","Tony","Message : 137 from sreebhargava to Tony"
"37","Tony","Message : 138 from sreebhargava to Tony"
"38","Tony","Message : 139 from sreebhargava to Tony"
"39","Rogers","Message : 140 from sreebhargava to Rogers"
"40","Rogers","Message : 141 from sreebhargava to Rogers"
"41","Rogers","Message : 142 from sreebhargava to Rogers"
"42","Rogers","Message : 143 from sreebhargava to Rogers"
"43","Rogers","Message : 144 from sreebhargava to Rogers"
"44","Rogers","Message : 145 from sreebhargava to Rogers"
"45","Rogers","Message : 146 from sreebhargava to Rogers"
"46","Rogers","Message : 147 from sreebhargava to Rogers"
"47","Rogers","Message : 148 from sreebhargava to Rogers"
"48","Rogers","Message : 149 from sreebhargava to Rogers"
"49","Natasha","Message : 150 from sreebhargava to Natasha"
"50","Natasha","Message : 151 from sreebhargava to Natasha"
"51","Natasha","Message : 152 from sreebhargava to Natasha"
"52","Natasha","Message : 153 from sreebhargava to Natasha"
"53","Natasha","Message : 154 from sreebhargava to Natasha"
"54","Natasha","Message : 155 from sreebhargava to Natasha"
"55","Natasha","Message : 156 from sreebhargava to Natasha"
"56","Natasha","Message : 157 from sreebhargava to Natasha"
"57","Natasha","Message : 158 from sreebhargava to Natasha"
"58","Natasha","Message : 159 from sreebhargava to Natasha"
"59","Arthur","Message : 160 from sreebhargava to Arthur"
"60","Arthur","Message : 161 from sreebhargava to Arthur"
"61","Arthur","Message : 162 from sreebhargava to Arthur"
"62","Arthur","Message : 163 from sreebhargava to Arthur"
"63","Arthur","Message : 164 from sreebhargava to Arthur"
"64","Arthur","Message : 165 from sreebhargava to Arthur"
"65","Arthur","Message : 166 from sreebhargava to Arthur"
"66","Arthur","Message : 167 from sreebhargava to Arthur"
"67","Arthur","Message : 168 from sreebhargava to Arthur"
"68","Arthur","Message : 169 from sreebhargava to Arthur"
"69","Wyne","Message : 170 from sreebhargava to Wyne"
"70","Wyne","Message : 171 from sreebhargava to Wyne"
"71","Wyne","Message : 172 from sreebhargava to Wyne"
"72","Wyne","Message : 173 from sreebhargava to Wyne"
"73","Wyne","Message : 174 from sreebhargava to Wyne"
"74","Wyne","Message : 175 from sreebhargava to Wyne"
"75","Wyne","Message : 176 from sreebhargava to Wyne"
"76","Wyne","Message : 177 from sreebhargava to Wyne"
"77","Wyne","Message : 178 from sreebhargava to Wyne"
"78","Wyne","Message : 179 from sreebhargava to Wyne"
"139","Bruce","hello from localhost"
"140","Bruce","Test 2 from local host"
"141","Tony","test message from elastic search git branch"
