This directory will have all the log files generated by the project.

Basic log configurations:
- Message format will be "%(asctime)s %(levelname)s - %(name)s %(filename)s:%(lineno)d %(message)s"
- Minimum loglevel will be DEBUG
