<svg xmlns="http://www.w3.org/2000/svg" xmlns:xlink="http://www.w3.org/1999/xlink" width="16" height="17" viewBox="0 0 16 17">
    <defs>
        <path id="prefix__a" d="M5.763 1.445v.537c-2.204.538-3.856 2.57-3.856 4.98v4.482h-.01L.21 13.056c-.093.13-.136.271-.138.409v.02c.006.397.352.762.84.762h12.22c.687 0 1.082-.72.674-1.228l-1.867-1.558v-3.11h-.007c-2.138 0-3.872-1.768-3.872-3.95 0-.82.245-1.582.664-2.214-.202-.08-.41-.147-.622-.2v-.542C8.1.789 7.575.252 6.932.252c-.642 0-1.169.537-1.169 1.193z"/>
        <path id="prefix__c" d="M5.568 15.188c-.204 0-.363.168-.368.361v.02c0 .034.007.07.018.105.242.735.922 1.265 1.724 1.265.803 0 1.483-.53 1.725-1.265.012-.035.018-.07.018-.105v-.02c-.005-.193-.164-.36-.367-.36h-2.75z"/>
    </defs>
    <g fill="none" fill-rule="evenodd">
        <mask id="prefix__b" fill="#fff">
            <use xlink:href="#prefix__a"/>
        </mask>
        <path fill="#FFF" d="M-3.592 17.904L17.633 17.904 17.633 -3.405 -3.592 -3.405z" mask="url(#prefix__b)"/>
        <path fill="#3CF" d="M15.986 4.089c0 1.933-1.536 3.5-3.43 3.5-1.895 0-3.431-1.567-3.431-3.5 0-1.934 1.536-3.501 3.43-3.501 1.895 0 3.43 1.567 3.43 3.5"/>
        <mask id="prefix__d" fill="#fff">
            <use xlink:href="#prefix__c"/>
        </mask>
        <path fill="#FFF" d="M1.537 20.596L12.348 20.596 12.348 11.531 1.537 11.531z" mask="url(#prefix__d)"/>
    </g>
</svg>
