   52  +
   53  +
   54  +
   55  +
   56  +
   57  +
   58  +
   59  +
   60  +
   61  +
   62  +
   63  +
   64  +
   65  +
   66  +
   67  +
   68  +
   69  +
   70  +
   71  +
   72  +
   73  +
   74  +
   75  +
   76  +
   77  +
   78  +
   79  +
   80  +
   81  +
   82  +
   83  +
   84  +
   85  +
   86  +
   87  +
   88  +
   89  +
   90  +
   91  +
   92  +
   93  +
   94  +
   95  +
   96  +
   97  +
   98  +
   99  +
  100  +
  101  +
  102  +
  103  +
  104  +
  105  +
  106  +
  107  +
  108  +
  109  +
  110  +
  111  +
  112  +
  113  +
  114  +
  115  +
  116  +
  117  +
  118  +
  119  +
  120  +
  121  +
  122  +
  123  +
  124  +
  125  +
  126  +
  127  +
  128  +
  129  +
  130  +
  131  +
  132  +
  133  +
  134  +
  135  +
  136  +
  137  +
  138  +
  139  +
  140  +
  141  +
  142  +
  143  +
  144  +
  145  +
  146  +
  147  +
  148  +
  149  +
  150  +
  151  +
  152  +
  153  +
  154  +
  155  +
  156  +
  157  +
  158  +
  159  +
  160  +
  161  +
  162  +
  163  +
  164  +
  165  +
  166  +
  167  +
  168  +
  169  +
  170  +
  171  +
  172  +
  173  +
  174  +
  175  +
  176  +
  177  +
  178  +
  179  +
  180  +
  181  +
  182  +
  183  +
  184  +
  185  +
  186  +
  187  +
  188  +
  189  +
  190  +
  191  +
  192  +
  193  +
  194  +
  195  +
  196  +
  197  +
  198  +
  199  +
  200  +
  201  +
  202  +
  203  +
  204  +
  205  +
  206  +
  207  +
  208  +
  209  +
  210  +
  211  +
  212  +
  213  +
  214  +
  215  +
  216  +
  217  +
  218  +
  219  +
  220  +
  221  +
  222  +
  223  +
  224  +
  225  +
  226  ping 192.168.0.111
  227  ssh vijay@
  228  ssh vijay@192.168.0.111
  229  git status
  230  git add .
  231  git commit -m "cruds"
  232  git push origin master
  233  git push origin master
  234  exit
  235  git status
  236  git status
  237  exit
  238  ssh yohaan@192.168.0.111
  239  scp
  240  scp even_odd.py yohaan@192.168.0.111:/var/www/html/yohaan/dest/python_progs
  241  scp even_odd.py yohaan@192.168.0.111:/var/www/html/yohaan/dest/
  242  scp ./* yohaan@192.168.0.111:/var/www/html/yohaan/dest/
  243  exit
  244  ssh nakul@192.168.0.111
  245  ssh dhaval@192.168.0.111
  246  ll
  247  cd ..
  248  ll
  249  ls -l
  250  exit
  251  git status
  252  git add .
  253  git commit -m "constructor"
  254  git push origin master
  255  exit
  256  git status
  257  exit
  258  git status
  259  git commit -m "Exception handling"
  260  git add .
  261  git commit -m "Exception handling"
  262  git push origin master
  263  exit
  264  ssh yohaan@192.168.0.111
  265  exit
  266  git status
  267  exit
  268  ssh nakul@192.186.0.111
  269  cd /var/www/html/nakul
  270  git bash
  271  git status
  272  exit
  273  git
  274  exit;
  275  sit status
  276  git status
  277  git add .
  278  git commit -m "upd"
  279  git push origin master
  280  pip
  281  pip install gspread oauth2client
  282  pip install gspread oauth2client
  283  pip install gspread oauth2client
  284  ssh shyab@192.168.0.111
  285  git status
  286  git add .
  287  commit -m "update"
  288  git add .
  289  commit -m "update"
  290  git commit -m "update"
  291  git push origin master
  292  java
  293  javac
  294  vi Narco.java
  295  Narco.java
  296  javac.Narco
  297  javac Narco.java
  298  javac DoWhileLoop.java
  299  vi DoWhileLoop.java
  300  javac Narco.java
  301  vi Narco.java
  302  javac Narco.java
  303  vi Narco.java
  304  javac Narco.java
  305  java DoWhileLoop
  306  vi Narco.java
  307  java DowhileLoop
  308  vi Narco1.java
  309  vi Narco1.java
  310  javac Narco1.java
  311  java Table
  312  vi Narco1.java 
  313  vi Narco2.java
  314  vi Narco2.java
  315  javac Narco2.java
  316  vi Narco2.java
  317  javac Narco2.java
  318  vi Narco2.java
  319  javac Narco2.java
  320  vi Narco2.java
  321  javac Narco2.java
  322  vi Narco2.java
  323  javac Narco2.java
  324  vi Narco2.java
  325  javac Narco2.java
  326  vi Narco2.java
  327  vi Narco2.java
  328  javac Narco2.java
  329  vi Narco2.java
  330  javac Narco2.java
  331  vi Narco2.java
  332  javac Narco2.java
  333  vi Narco2.java
  334  javac Narco2.javavi
  335  vi Narco2.java
  336  javac Narco2.javavi
  337  ll
  338  vi Narco2.java
  339  javac Narco2.java
  340  vi Narco2.java
  341  javac Narco2.java
  342  java InputNumber
  343  javac Narco2.java0
  344  javac Narco2.java
  345  java InputNumber
  346  git status
  347  git add .
  348  git commit -m "revision"
  349  git push origin master
  350  exit
  351  git status
  352  git add .
  353  git commit -m "Revision1"
  354  git push origin master
  355  exit
  356  ssh anoushka@192.168.0.111
  357  exit;
  358  ssh anoushka@182.168.0.111
  359  ssh anoushka@182.168.0.111
  360  ssh anoushka@192.168.0.111
  361  exit
  362  ssh anoushka@ 192.168.0.111
  363  ssh anoushka@192.168.0.111
  364  ssh anoushka@192.168.0.111
  365  git status
  366  git add .
  367  git commit -m "msgs"
  368  git push origin master
  369  git status
  370  ssh shaileshsonare@192.168.0.111
  371  ssh anoushka@192.168.0.111
  372  ping 192.168.0.111
  373  ssh shailesh@192.168.0.111
  374  ping 192.168.0.111
  375  ssh amit@192.168.0.111
  376  ssh anoushka@192.168.0.111
  377  ssh daniel@192.168.0.111
  378  ssh anoushka@192.168.0.111
  379  ssh daniel@192.168.0.111
  380  ssh john@192.168.0.111
  381  ssh daniel@192.168.0.111
  382  ssh daniel@192.168.0.111
  383  exit
  384  ssh daniel@192.168.0.111
  385  exit
  386  ssh daniel@192.168.0.111
  387  ssh daniel@192.168.0.111
  388  ssh daniel@192.168.0.111
  389  exit
  390  ssh daniel@192.168.0.111
  391  ssh daniel@192.168.0.111
  392  ssh john192.168.0.111
  393  ssh john@192.168.0.111
  394  ssh daniel@192.168.0.111
  395  ssh john@192.168.0.111
  396  exit
  397  ssh shyab@192.168.0.111
  398  ssh shyab@192.168.0.111
  399  ssh proi
  400  ssh prince@192.168.0.111
  401  ssh prince@192.168.0.11
  402  ssh prince@192.168.0.111
  403  ssh yohaan@192.168.0.111
  404  ping -t 192.168.0.111
  405  ssh daniel@192.168.0.111
  406  exit
  407  git status
  408  git add .
  409  git commit -m "Yo"
  410  git push origin master
  411  exit
  412  ssh john@192.168.0.111
  413  exit
  414  ssh priyankabagde@192.168.0.111
  415  ssh priyankabagde@192.168.0.111
  416  ssh shaileshsonare@192.168.0.111
  417  ssh anoushka@192.168.0.111
  418  vi java_1.java
  419  javac java_1.java
  420  vi java_1.java
  421  javac java_1.java
  422  java Oe
  423  vi java_1.java
  424  javac java_1.java
  425  java Oe
  426  vi java_2.java 
  427  javac java_2.java
  428  vi java_2.java 
  429  javac java_2.java
  430  vi java_2.java 
  431  javac java_2.java
  432  java Marks
  433  vi java_2.java 
  434  javac java_2.java
  435  vi java_2.java 
  436  vi java_2.java 
  437  javac java_2.java
  438  vi java_2.java 
  439  vi java_2.java
  440  javac java_2.java
  441  java Marks
  442  vi java_2.java
  443  javac java_2.java
  444  java Marks
  445  vi java_2.java
  446  javac java_2.java
  447  java Marks
  448  javac java_2.java
  449  vi java_2.java
  450  javac java_2.java
  451  vi java_2.java
  452  javac java_2.java
  453  vi java_2.java
  454  javac java_2.java
  455  java Marks
  456  vi java_2.java
  457  javac java_2.java
  458  java Marks
  459  vi java_2.java
  460  javac java_2.java
  461  vi java_2.java
  462  javac java_2.java
  463  java Marks
  464  vi java_2.java
  465  vi java_3.java
  466  javac java_3.java
  467  vi java_3.java
  468  javac java_3.java
  469  java Loop
  470  vi java_3.java
  471  javac java_3.java
  472  java Loop
  473  vi java_3.java
  474  javac java_3.java
  475  java Loop
  476  vi java_3.java
  477  javac java_3.java
  478  java Loop
  479  vi java_3.java
  480  javac java_3.java
  481  vi java_3.java
  482  javac java_3.java
  483  java Loop
  484  vi java_3.java
  485  javac java_3.java
  486  vi java_3.java
  487  javac java_3.java
  488  java Loop
  489  vi java_3.java
  490  javac java_3.java
  491  java Loop
  492  vi java_4.java
  493  javac java_4.java
  494  java Sum
  495  vi java_5.java
  496  vi java_6.java
  497  vi java_4.java
  498  vi java_6.java
  499  vi java_4.java
  500  vi java_6.java
  501  git clone https://gitlab.com/bharat.gharge/kuchbhi.git
  502  cd kuchbhi/
  503  ls
  504  ls -.
  505  ls -la
  506  ls -/.
  507  clear
  508  ls -la
  509  touch README.md
  510  ls
  511  cat README.md 
  512  touch abc{1..3).txt
  513  ls
  514  touch abc.txt
  515  ls
  516  clear
  517  ls
  518  pwd
  519  cat >> abc.txt I love git
  520  cat >> abc.txt 
  521  cat  abc.txt 
  522  cat >> abc.txt 
  523  git config -l
  524  git config user.name "bharat gharge"
  525  git config -l
  526  git config user.email "bgharge11@gmail.com"
  527  git config -l
  528  git config -l | grep user.name
  529  git config -l | grep user.email
  530  git config -l
  531  clear
  532  git config -l | grep user.email
  533  git config -l | grep user.name
  534  clear
  535  git status 
  536  git add README.md 
  537  git status 
  538  git add . 
  539  git status 
  540  git commit -m "add anything"
  541  git status 
  542  git push -u origin master
  543  git push -u origin master
  544  git status 
  545  git commit -m "add anything"
  546  git status 
  547  git add . 
  548  git status 
  549  git commit -m "add anything"
  550  git push -u origin master
  551  history >> histroy.txt
