module gitlab.com/bf86/scripts/toolbox

go 1.17

require github.com/urfave/cli/v2 v2.3.0

require (
	github.com/cpuguy83/go-md2man/v2 v2.0.1 // indirect
	github.com/russross/blackfriday/v2 v2.1.0 // indirect
)
