; Engine configuration file.
; It's best edited using the editor UI and not directly,
; since the parameters that go here are not all obvious.
;
; Format:
;   [section] ; section goes between []
;   param=value ; assign values to parameters

config_version=5

[application]

config/name="Ancient Aetherium Virtual Player Mat"
run/main_scene="res://application/character-selector/character-selector.tscn"
config/features=PackedStringArray("4.0", "GL Compatibility")
config/icon="res://icon.svg"

[autoload]

global="*res://application/autoload.gd"

[rendering]

renderer/rendering_method="gl_compatibility"
renderer/rendering_method.mobile="gl_compatibility"
