<?xml version="1.0" encoding="UTF-8" standalone="no"?>
<svg
   version="1.1"
   height="100"
   width="100"
   id="svg22"
   sodipodi:docname="editor.svg"
   inkscape:version="1.2.2 (b0a8486541, 2022-12-01)"
   xmlns:inkscape="http://www.inkscape.org/namespaces/inkscape"
   xmlns:sodipodi="http://sodipodi.sourceforge.net/DTD/sodipodi-0.dtd"
   xmlns="http://www.w3.org/2000/svg"
   xmlns:svg="http://www.w3.org/2000/svg">
  <defs
     id="defs26" />
  <sodipodi:namedview
     id="namedview24"
     pagecolor="#ffffff"
     bordercolor="#000000"
     borderopacity="0.25"
     inkscape:showpageshadow="2"
     inkscape:pageopacity="0.0"
     inkscape:pagecheckerboard="0"
     inkscape:deskcolor="#d1d1d1"
     showgrid="false"
     inkscape:zoom="6.3144636"
     inkscape:cx="39.354095"
     inkscape:cy="58.595634"
     inkscape:window-width="1920"
     inkscape:window-height="1013"
     inkscape:window-x="900"
     inkscape:window-y="124"
     inkscape:window-maximized="1"
     inkscape:current-layer="svg22" />
  <path
     style="fill:#ffffff;fill-opacity:1;stroke:#000000;stroke-width:1.715;stroke-linecap:round;stroke-linejoin:round;stroke-dasharray:none;stroke-opacity:1"
     d="m 85.676319,92.486082 c 8.003394,-1.676366 8.454459,-5.516338 9.185262,-10.135461 l 0.316733,-59.7042 C 94.535741,17.2329 97.694283,9.7830677 85.993053,10.293828 L 33.890448,11.402393 C 31.695369,36.086767 32.774012,56.562069 33.415347,77.599624 L 65.880496,82.667355 51.944238,65.563764 43.867542,73.16536"
     id="path1283"
     sodipodi:nodetypes="ccccccccc" />
  <g
     id="g1057"
     transform="matrix(0.59059976,0.22225782,-0.22225782,0.59059976,45.211762,1.6842495)">
    <path
       d="M 89.702571,51.094689 Q 50,99.017339 10.297428,51.094689"
       stroke="#000000"
       stroke-width="3.88639"
       fill="none"
       id="path2" />
    <polygon
       points="10,30 -10,30 -10,40 10,40 "
       transform="translate(50,45)"
       stroke="#000000"
       stroke-width="4"
       fill="none"
       id="polygon4" />
    <polygon
       points="10,30 -10,30 -10,40 10,40 "
       transform="rotate(35,-46.689288,89.689288)"
       stroke="#000000"
       stroke-width="4"
       fill="none"
       id="polygon6" />
    <polygon
       points="10,30 -10,30 -10,40 10,40 "
       transform="rotate(-35,96.689288,-68.890452)"
       stroke="#000000"
       stroke-width="4"
       fill="none"
       id="polygon8" />
    <polygon
       points="40,45 50,55 60,45 50,35 "
       stroke="#000000"
       stroke-width="4"
       fill="none"
       id="polygon10"
       transform="matrix(1.0960214,0,0,1.0960214,-4.8010676,-4.3209608)" />
    <circle
       cx="74"
       cy="23.104143"
       r="5"
       stroke="#000000"
       stroke-width="4"
       fill="none"
       id="circle12" />
    <circle
       cx="26"
       cy="23.104143"
       r="5"
       stroke="#000000"
       stroke-width="4"
       fill="none"
       id="circle14" />
    <circle
       cx="77"
       cy="43"
       r="15"
       stroke="#000000"
       stroke-width="4"
       fill="none"
       id="circle16" />
    <circle
       cx="23"
       cy="43"
       r="15"
       stroke="#000000"
       stroke-width="4"
       fill="none"
       id="circle18" />
    <circle
       cx="50"
       cy="43"
       r="25"
       stroke="#000000"
       stroke-width="4"
       fill="none"
       id="circle20" />
  </g>
  <path
     style="fill:none;fill-opacity:1;stroke:#000000;stroke-width:1.715;stroke-linecap:round;stroke-linejoin:round;stroke-dasharray:none;stroke-opacity:1"
     d="m 26.288852,82.825721 c 0,4.710579 18.96366,9.37377 25.019221,1.735259 7.977329,-10.062637 24.784375,9.93251 34.368246,7.925102 8.003394,-1.676366 8.454459,-5.516338 9.185262,-10.135461 l 0.316733,-59.7042 C 94.535741,17.2329 97.694283,9.7830677 85.993053,10.293828 L 33.890448,11.402393 C 31.695369,36.086767 32.774012,56.562069 33.415347,77.599624 L 65.880496,82.667355 51.944238,65.563764 43.867542,73.16536"
     id="path1121"
     sodipodi:nodetypes="csscccccccc" />
  <path
     style="fill:#ffffff;fill-opacity:1;stroke:#000000;stroke-width:1.715;stroke-linecap:round;stroke-linejoin:round;stroke-dasharray:none;stroke-opacity:1"
     d="m 23.852231,67.618819 2.23448,14.980157 4.016169,-11.288501 -5.291274,-11.135521 -0.781105,-4.249348 c 0,0 -1.334107,-14.507676 -2.409206,-21.708429 C 20.013389,23.447805 15.583889,2.1137148 15.583889,2.1137148 c 0,0 -5.412024,7.6438283 -6.1268222,12.1112712 -1.4884556,9.302757 1.8733332,18.825752 4.2522542,27.941537 1.292125,4.951292 5.401024,14.36986 5.401024,14.36986 l 4.909343,-0.652527 -4.90985,0.682312 0.76849,4.148177 -1.02624,12.798853 7.138493,9.169499 z"
     id="path1183"
     sodipodi:nodetypes="cccccscssccccccc" />
  <path
     style="fill:#000000;fill-opacity:1;stroke:#000000;stroke-width:1.715;stroke-linecap:round;stroke-linejoin:round;stroke-dasharray:none;stroke-opacity:1"
     d="m 24.030501,55.925606 c 0,0 -1.334107,-14.507676 -2.409206,-21.708429 C 20.013389,23.447805 15.583889,2.1137148 15.583889,2.1137148 c 0,0 -5.412024,7.6438283 -6.1268222,12.1112712 -1.4884556,9.302757 1.8733332,18.825752 4.2522542,27.941537 1.292125,4.951292 5.401024,14.36986 5.401024,14.36986 z"
     id="path1217"
     sodipodi:nodetypes="cscsscc" />
</svg>
