<svg width="45" height="49" viewBox="0 0 45 49" fill="none"
  xmlns="http://www.w3.org/2000/svg"
  xmlns:rdf="http://www.w3.org/1999/02/22-rdf-syntax-ns#"
  xmlns:cc="http://creativecommons.org/ns#"
  xmlns:dc="http://purl.org/dc/elements/1.1/">
<metadata>
<rdf:RDF>
<cc:Work rdf:about="">
<cc:license rdf:resource="http://creativecommons.org/publicdomain/zero/1.0/" />
<dc:creator>
<cc:Agent>
<dc:title>AdriaanTV</dc:title>
</cc:Agent>
</dc:creator>
</cc:Work>
<cc:License rdf:about="http://creativecommons.org/publicdomain/zero/1.0/">
<cc:permits rdf:resource="http://creativecommons.org/ns#Reproduction" />
<cc:permits rdf:resource="http://creativecommons.org/ns#Distribution" />
<cc:permits rdf:resource="http://creativecommons.org/ns#DerivativeWorks" />
</cc:License>
</rdf:RDF>
</metadata>
<path d="M13.2308 17.76C11.3795 19.4567 8 21.5 8 21.5H0V42.1199H5.5C5.5 42.1199 9 48.5 14.5 48.5C29 48.5 41.0833 50 43 38.5C44.9167 27 46 20 43 18.5C40 17 26.4615 17.76 26.4615 17.76C26.4615 17.76 29.3984 10.7184 30.5962 5.99996C32.5 -1.49999 23 -1 21.5 2.50001C20 6.00002 18.2275 13.1801 13.2308 17.76Z" fill="black"/>
</svg>
