{
  "AppSyncApiName": "songAPI",
  "DynamoDBBillingMode": "PAY_PER_REQUEST",
  "DynamoDBEnableServerSideEncryption": false,
  "AuthCognitoUserPoolId": {
    "Fn::GetAtt": [
      "authamplifyreactappd7b37122",
      "Outputs.UserPoolId"
    ]
  }
}