#TAG,NAME IN REPO (or git url),PURPOSE (should be a verb phrase to sound right while installing),,
,,,,
G,https://gitlab.com/besonia.ma13/dotfiles.git,''My dotfiles'',,
G,https://gitlab.com/besonia.ma13/dwm.git,''My build of dwm'',,
G,https://gitlab.com/besonia.ma13/dwmblocks.git,''My build of dwmblocks'',,
G,https://gitlab.com/besonia.ma13/st.git,''My build of st'',,
G,https://gitlab.com/besonia.ma13/dmenu..git,''My build of dmenu'',,
G,https://gitlab.com/besonia.ma13/slock.git,''My build of slock'',,
G,https://gitlab.com/besonia.ma13/surf.git,''Not my build'',,
