+------------+--------------+------------------------------+----------------------------------------------------------------------------+---------------------------+
| website_id | website_type | website_url                  | status_url                                                                 | category                  |
+------------+--------------+------------------------------+----------------------------------------------------------------------------+---------------------------+
|          1 | App          | bitbucket.org                | http://status.bitbucket.org/history#                                       | Project_Management        |
|          2 | App          | www.lifesize.com             | http://status.lifesizecloud.com/history#                                   | Communication_Services    |
|          3 | App          | www.kickstarter.com          | http://status.kickstarter.com/history#                                     | Project_Management        |
|          4 | App          | support.talkdesk.com         | http://status.talkdesk.com/history#                                        | Help_Desk                 |
|          5 | App          | airbrake.io                  | http://status.airbrake.io/history#                                         | Development_Tools         |
|          6 | App          | www.mindbodyonline.com       | http://status.mindbodyonline.com/history#                                  | Business_Management       |
|          7 | App          | vimeo.com                    | http://www.vimeostatus.com/history#                                        | Social_Networking            |
|          8 | App          | www.docker.com               | https://status.docker.com/pages/history/533c6539221ae15e3f000031           | Project_Management        |
|          9 | App          | www.appcelerator.com         | http://status.appcelerator.com/pages/history/5422d89d9b83329803000067      | Development_Tools         |
|         14 | App          | www.cloudamqp.com            | http://status.cloudamqp.com/history                                        | Project_Management        |
|         16 | App          | pivotal.io                   | https://status.run.pivotal.io/history                                      | Project_Management        |
|         17 | App          | www.iron.io                  | https://status.iron.io/history                                             | Project_Management        |
|         18 | App          | apigee.com                   | http://status.apigee.com/history                                           | Development_Tools         |
|         19 | App          | www.one.com                  | http://status.one.com/history                                              | Development_Tools         |
|         20 | App          | electricimp.com              | http://status.electricimp.com/history                                      | Project_Management        |
|         21 | Prov         | modxcloud.com                | http://status.modxcloud.com/history                                        | IaaS                      |
|         22 | App          | c9.io                        | https://status.c9.io/history                                               | Collaborative_Tools       |
|         23 | Prov         | www.servint.net              | https://servint.statuspage.io/history                                      | IaaS                      |
|         25 | App          | pagodabox.io                 | http://status.pagodabox.io/history                                         | Project_Management        |
|         26 | App          | www.particle.io              | http://status.particle.io/history                                          | Development_Tools         |
|         27 | App          | www.braintreepayments.com    | https://status.braintreepayments.com/history                               | E-Commerce                |
|         28 | App          | www.librato.com              | https://status.librato.com/history                                         | Monitoring_Tools          |
|         29 | App          | litmus.com                   | https://status.litmus.com/history                                          | Communication_Services    |
|         30 | App          | www.newrelic.com             | https://status.newrelic.com/history                                        | Development_Tools         |
|         31 | App          | www.shopify.com              | https://status.shopify.com/history                                         | E-Commerce                |
|         33 | App          | www.box.com                  | https://status.box.com/history                                             | Storage                   |
|         34 | App          | www.gotomeeting.com          | http://status.gotomeeting.com/history                                      | Collaborative_Tools       |
|         35 | App          | www.gotoassist.com           | http://status.gotoassist.com/history                                       | Help_Desk                 |
|         37 | App          | www.showmyhomework.co.uk     | http://status.showmyhomework.co.uk/history                                 | Education                 |
|         39 | App          | www.xero.com                 | http://status.developer.xero.com/history                                   | Accounting                |
|         42 | App          | quickbooks.intuit.com        | http://status.developer.intuit.com/history                                 | Accounting                |
|         43 | App          | bluejeans.com                | http://status.bluejeans.com/history                                        | Communication_Services    |
|         44 | App          | www.marketcircle.com         | http://status.marketcircle.com/history                                     | Project_Management        |
|         45 | App          | www.idera.com                | http://status.copperegg.com/history                                        | Business_Management       |
|         46 | App          | www.lifx.com                 | http://status.lifx.com/history                                             | Collaborative_Tools       |
|         48 | App          | www.mailgun.com              | http://status.mailgun.com/history                                          | E-mail                    |
|         50 | App          | www.aweber.com               | http://status.aweber.com/history                                           | Marketing_and_Advertising |
|         52 | App          | www.hirezstudios.com         | http://status.hirezstudios.com/history                                     | Entertainment             |
|         53 | App          | www.intercom.io              | https://status.intercom.io/history                                         | Help_Desk                 |
|         54 | App          | www.hipchat.com              | https://status.hipchat.com/history                                         | Collaborative_Tools       |
|         57 | App          | mackerel.io                  | http://status.mackerel.io/pages/history/5344e2be5cf8a32665000009           | Development_Tools         |
|         58 | App          | www.haskell.org              | https://status.haskell.org/pages/history/537c07b0cf1fad5830000093          | Development_Tools         |
|         59 | App          | uservoice.com                | https://status.uservoice.com/history                                       | Help_Desk                 |
|         60 | App          | smugmug.com                  | http://status.smugmug.com/history                                          | Social_Networking         |
|         61 | App          | disquis.com                  | https://status.disqus.com/history                                          | Collaborative_Tools       |
|         62 | App          | www.cloudways.com            | http://status.cloudways.com/history                                        | Project_Management        |
|         63 | Prov         | www.upcloud.com              | http://status.upcloud.com/history                                          | IaaS                      |
|         64 | Prov         | www.cloudsigma.com           | http://status.cloudsigma.com/history                                       | IaaS                      |
|         65 | Prov         | www.blueboxcloud.com         | https://blueboxstatus.com/history                                          | IaaS                      |
|         67 | App          | www.atlassian.com            | http://status.atlassian.com/history                                        | Development_Tools         |
|         68 | Prov         | cloud.dimensiondata.com      | http://cloud-status.dimensiondata.com/history                              | IaaS                      |
|         70 | App          | www.twilio.com               | http://status.twilio.com/history                                           | Communication_Services    |
|         71 | Prov         | www.cloudflare.com           | https://www.cloudflarestatus.com/history                                   | IaaS                      |
|         73 | App          | www.acquia.com               | https://status.acquia.com/history                                          | Project_Management        |
|         74 | Prov         | www.linode.com               | http://status.linode.com/history                                           | IaaS                      |
|         76 | App          | www.qualys.com               | https://status.qualys.com/history                                          | Security_Tools            |
|         77 | App          | kissmetrics.com              | https://kmstatus.com/history                                               | Analytics                 |
|         78 | App          | desk.com                     | https://status.desk.com/history                                            | Help_Desk                 |
|         79 | App          | www.statuspage.io            | http://metastatuspage.com/history                                          | Monitoring_Tools          |
|         80 | App          | www.customer.io              | http://status.customer.io/history                                          | Communication_Services    |
|         81 | App          | www.engineyard.com           | https://engineyard.statuspage.io/history                                   | Project_Management        |
|         82 | App          | cloud66.com                  | http://status.cloud66.com/pages/history/55a770a50a54eb8c710005a9           | Project_Management        |
|         83 | App          | chartio.com                  | http://www.chartiostatus.com/history                                       | Business_Management       |
|         84 | App          | discordapp.com               | https://status.discordapp.com/history                                      | Communication_Services    |
|         87 | App          | close.io                     | http://status.close.io/history                                             | E-Commerce                |
|         88 | App          | www.pagerduty.com            | https://status.pagerduty.com/history                                       | Help_Desk                 |
|         89 | App          | sendgrid.com                 | http://status.sendgrid.com/history                                         | E-mail                    |
|         90 | App          | parse.com                    | https://status.parse.com/history                                           | Development_Tools         |
|         92 | App          | www.phaxio.com               | http://status.phaxio.com/history                                           | Collaborative_Tools       |
|         93 | App          | popcorntime.sh               | http://status.popcorntime.sh/history                                       | Entertainment             |
|         94 | App          | www.reddit.com               | http://www.redditstatus.com/history                                        | Social_Networking         |
|         97 | App          | auth0.com                    | http://status.auth0.com/history                                            | Security_Tools            |
|         98 | App          | iwantmyname.com              | http://status.iwantmyname.com/history                                      | Development_Tools         |
|         99 | App          | waffle.io                    | http://status.waffle.io/history                                            | Business_Management       |
|        100 | App          | codeship.com                 | http://codeshipstatus.com/history                                          | Development_Tools         |
|        102 | App          | datadoghq.com                | http://status.datadoghq.com/history                                        | Monitoring_Tools          |
|        103 | App          | ns1.com                      | http://www.nsonestatus.net/history                                         | Development_Tools         |
|        105 | App          | avatarnewyork.com            | http://status.avatarnewyork.com/history                                    | Development_Tools         |
|        106 | App          | ifttt.com                    | http://status.ifttt.com/history                                            | Collaborative_Tools       |
|        107 | App          | stormpath.com                | http://status.stormpath.com/history                                        | Security_Tools            |
|        108 | App          | getharvest.com               | http://www.harveststatus.com/history                                       | Accounting                |
|        109 | App          | influitive.com               | http://status.influitive.com/history                                       | Accounting                |
|        111 | App          | skylight.io                  | http://status.skylight.io/history                                          | Monitoring_Tools          |
|        112 | App          | context.io                   | http://status.context.io/                                                  | E-mail                    |
|        114 | App          | autopilothq.com              | http://status.autopilothq.com/history                                      | Marketing                 |
|        116 | App          | sharefile.com                | status.sharefile.com/history                                               | Storage                   |
|        117 | App          | simplereach.com              | http://status.simplereach.com/history                                      | Analytics                 |
|        118 | App          | itservices.uchicago.edu      | http://it-status.uchicago.edu/history                                      | Education                 |
|        120 | App          | appgyver.com                 | status.appgyver.com/history                                                | Development_Tools         |
|        121 | App          | podio.com                    | http://status.podio.com/history                                            | Project_Management        |
|        125 | App          | objectrocket.com             | http://status.objectrocket.com/pages/history/53cd83d756bbe4a329000456      | Storage                   |
|        132 | App          | openmrs.org                  | http://status.openmrs.org/pages/history/534decd528328a247100004b           | Health_Care               |
|        138 | App          | bamboohr.com                 | http://status.bamboohr.com/pages/history/54f0de009d6f51e7140002b7          | Business_Management       |
|        141 | App          | authentic8.com               | http://status.authentic8.com/pages/history/53979231f2385e505000033b        | Security_Tools            |
|        142 | App          | linaro.org                   | http://dash.linaro.org/pages/history/52418f83293c8abf7b00000d              | Collaborative_Tools       |
|        177 | Prov         | cloud.google.com             | https://status.cloud.google.com/                                           | IaaS                      |
|        178 | App          | bintray.com                  | http://status.bintray.com/history                                          | Collaborative_Tools       |
|        181 | App          | elastic.co                   | https://found-status.elastic.co/history                                    | Development_Tools         |
|        183 | Prov         | dataexpress.net.au           | http://status.dataexpress.net.au/pages/history/55cabe04019347db5a0009d8    | IaaS                      |
|        185 | Prov         | m5hosting.com                | http://status.m5hosting.com/pages/history/5407b8e2b002442510000272         | IaaS                      |
|        208 | Prov         | www.openshift.com            | http://status.openshift.com/history                                        | IaaS                      |
|        209 | App          | chef.io                      | http://status.chef.io/history                                              | Project_Management        |
|        212 | Prov         | fastly.com                   | https://status.fastly.com/history                                          | IaaS                      |
|        217 | Prov         | azure.microsoft.com          | https://azure.microsoft.com/en-us/status/#history                          | IaaS                      |
|        223 | App          | https://www.dropbox.com/home | https://status.dropbox.com/history                                         | Storage                   |
|        224 | Prov         | https://www.amazon.com       | http://status.aws.amazon.com                                               | IaaS                      |
+------------+--------------+------------------------------+----------------------------------------------------------------------------+---------------------------+