{
    "menu": [
        {
            "url": "admin",
            "name": "Dashboard",
            "i18n": "Dashboard",
            "icon": "desktop",
            "route": "home."
        },
        {
            "url": "admin/users",
            "name": "Users",
            "i18n": "Users",
            "icon": "user",
            "route": "users."
        },
        {
            "url": "admin/questions",
            "name": "Questions",
            "i18n": "Questions",
            "icon": "question-alt",
            "route": "questions."
        },
        {
            "url": "admin/orders",
            "name": "Orders",
            "i18n": "Orders",
            "icon": "notebook",
            "route": "orders."
        },
        {
            "url": "admin/coupons",
            "name": "Coupons",
            "i18n": "Coupons",
            "icon": "coins",
            "route": "coupons."
        },
        {
            "url": "admin/types/order-status",
            "name": "Order Status",
            "i18n": "Order Status",
            "icon": "morph-radio-4",
            "route": "types.order_status"
        },
        {
            "url": "admin/types/business-types",
            "name": "Business Types",
            "i18n": "Business Types",
            "icon": "morph-radio-3",
            "route": "types.business_types"
        },
        {
            "url": "admin/settings",
            "name": "Settings",
            "i18n": "Settings",
            "icon": "settings",
            "route": "settings."
        }
    ]
}
