1. Aula Timur
152
15
2
90
154
2. CC Timur
93
288
2
50
140
3. Labtek 8
142
420
4
70
240
4. Labtek 7
142
520
4
70
240
5. Gedung PLN
92
693
1
55
100
6. Gedung Comlabs
92
793
2
85
120
7. Gedung Perpus
102
955
4
130
115
8. Gedung CAS
242
970
8
170
110
9. Gedung CRCS
372
1040
7
140
120
10. Gedung FFTM
442
848
4
291
220
11. Gedung Kimia
422
716
4
175
55
12. Gedung Lab Kimia Organik
412
620
4
200
50
13. Gedung Bengkok
397
596
1
200
30
14. Gedung Hidrologi
406
550
1
160
60
15. Gedung GKU Timur
422
490
4
125
60
16. Kompleks Gedung Lab Geodesi
456
386
3
130
70
17. Gedung Sipil
-308
135
3
30
220
18. Gedung Sipil2 (Bawahnya sipil)
-290
84
2
33
195
19. Kompleks sebelah barat himafi (ga tau apa)
-488
257
2
155
105
20. Gedung Kompleks Arsi dan KMSR dan tekling
322
161
6
255
250
21. Gedung Lab Sipil
212
716
4
200
100
22. Gedung Doping
437
492
4
90
100
23. Aula Barat
-152
15
2
90
154
24. CC Barat
-93
288
2
50
140
25. Labtek 5
-142
420
4
70
240
26. Labtek 6
-142
520
4
70
240
27. Gedung TVST
-80
682
2
95
95
28. Gedung Oktagon
-80
794
2
95
95
29. Gedung PAU
-83
955
6
150
85
30. Gedung SBM
-378
1005
7
30
225
31. Gedung UPT Bahasa
-198
940
5
110
105
32. Gedung Himatek1
-236
690
3
65
175
33. Gedung Himatek2
-254
740
4
34
95
34. Gedung Himatek3
-236
788
3
65
175
35. GKU Barat
-391
488
4
95
95
36. Gedung Fisika
-303
275
2
105
227
37. Gedung Mesin
-443
610
5
100
165
38. Kompleks Penerbangan (atas mesin)
-438
715
4
90
165