_______________________________________________________________________________________________________________
Facture numero : -
						Date : -
														
Client :

Nom : -
Prenom : -
Adresse : -
Telephone : -


Total HT : -
Total TVA : -
Total TTC : -
_______________________________________________________________________________________________________________


