<?xml version="1.0" encoding="UTF-8" standalone="no"?>
<!-- Created with Inkscape (http://www.inkscape.org/) -->

<svg
   xmlns:dc="http://purl.org/dc/elements/1.1/"
   xmlns:cc="http://creativecommons.org/ns#"
   xmlns:rdf="http://www.w3.org/1999/02/22-rdf-syntax-ns#"
   xmlns:svg="http://www.w3.org/2000/svg"
   xmlns="http://www.w3.org/2000/svg"
   xmlns:xlink="http://www.w3.org/1999/xlink"
   xmlns:sodipodi="http://sodipodi.sourceforge.net/DTD/sodipodi-0.dtd"
   xmlns:inkscape="http://www.inkscape.org/namespaces/inkscape"
   id="svg5042"
   version="1.1"
   inkscape:version="0.48.1 r9760"
   width="640.09534"
   height="480.056"
   sodipodi:docname="carteDeVisite2.svg">
  <metadata
     id="metadata5048">
    <rdf:RDF>
      <cc:Work
         rdf:about="">
        <dc:format>image/svg+xml</dc:format>
        <dc:type
           rdf:resource="http://purl.org/dc/dcmitype/StillImage" />
        <dc:title />
      </cc:Work>
    </rdf:RDF>
  </metadata>
  <defs
     id="defs5046">
    <inkscape:perspective
       sodipodi:type="inkscape:persp3d"
       inkscape:vp_x="0 : 0.5 : 1"
       inkscape:vp_y="0 : 1000 : 0"
       inkscape:vp_z="1 : 0.5 : 1"
       inkscape:persp3d-origin="0.5 : 0.33333333 : 1"
       id="perspective5050" />
    <inkscape:perspective
       id="perspective5081"
       inkscape:persp3d-origin="0.5 : 0.33333333 : 1"
       inkscape:vp_z="1 : 0.5 : 1"
       inkscape:vp_y="0 : 1000 : 0"
       inkscape:vp_x="0 : 0.5 : 1"
       sodipodi:type="inkscape:persp3d" />
    <inkscape:perspective
       id="perspective3209"
       inkscape:persp3d-origin="0.5 : 0.33333333 : 1"
       inkscape:vp_z="1 : 0.5 : 1"
       inkscape:vp_y="0 : 1000 : 0"
       inkscape:vp_x="0 : 0.5 : 1"
       sodipodi:type="inkscape:persp3d" />
    <inkscape:perspective
       id="perspective4035"
       inkscape:persp3d-origin="0.5 : 0.33333333 : 1"
       inkscape:vp_z="1 : 0.5 : 1"
       inkscape:vp_y="0 : 1000 : 0"
       inkscape:vp_x="0 : 0.5 : 1"
       sodipodi:type="inkscape:persp3d" />
    <inkscape:perspective
       id="perspective4707"
       inkscape:persp3d-origin="0.5 : 0.33333333 : 1"
       inkscape:vp_z="1 : 0.5 : 1"
       inkscape:vp_y="0 : 1000 : 0"
       inkscape:vp_x="0 : 0.5 : 1"
       sodipodi:type="inkscape:persp3d" />
    <radialGradient
       inkscape:collect="always"
       xlink:href="#linearGradient3418-1"
       id="radialGradient5080"
       gradientUnits="userSpaceOnUse"
       gradientTransform="matrix(4.0381539,-0.03345501,0.02015937,2.4333167,4206.1745,-2414.7867)"
       cx="-1395.4137"
       cy="1652.1842"
       fx="-1395.4137"
       fy="1652.1842"
       r="503.13419" />
    <linearGradient
       id="linearGradient3418-1">
      <stop
         id="stop3420-7"
         offset="0"
         style="stop-color:#ffffff;stop-opacity:1;" />
      <stop
         id="stop3422-7"
         offset="1"
         style="stop-color:#d1d1ff;stop-opacity:1;" />
    </linearGradient>
    <inkscape:perspective
       id="perspective5470"
       inkscape:persp3d-origin="0.5 : 0.33333333 : 1"
       inkscape:vp_z="1 : 0.5 : 1"
       inkscape:vp_y="0 : 1000 : 0"
       inkscape:vp_x="0 : 0.5 : 1"
       sodipodi:type="inkscape:persp3d" />
  </defs>
  <sodipodi:namedview
     pagecolor="#ffffff"
     bordercolor="#666666"
     borderopacity="1"
     objecttolerance="10"
     gridtolerance="10"
     guidetolerance="10"
     inkscape:pageopacity="0"
     inkscape:pageshadow="2"
     inkscape:window-width="1680"
     inkscape:window-height="975"
     id="namedview5044"
     showgrid="false"
     inkscape:zoom="0.9833333"
     inkscape:cx="316.94459"
     inkscape:cy="334.94288"
     inkscape:window-x="0"
     inkscape:window-y="24"
     inkscape:window-maximized="1"
     inkscape:current-layer="g5054" />
  <g
     id="g5054"
     transform="translate(0.77899969,263.24355)">
    <g
       id="g2835"
       inkscape:export-filename="/home/bcdlog/Images/Voyage/favicon1.png"
       inkscape:export-xdpi="6.7492127"
       inkscape:export-ydpi="6.7492127"
       transform="translate(-167.79662,-102.71187)">
      <image
         y="-263.18756"
         x="-0.71909189"
         id="image5052"
         height="480"
         width="640"
         xlink:href="file:///media/nfs/bclarke/media/PhotosVideos/2003/05/Image050.jpg" />
      <path
         id="path5070"
         d="m -0.71909191,-23.18755 0,-240 320.00000191,0 320,0 0,240 0,240 -320,0 -320.00000191,0 0,-240 z"
         style="fill:#e9d6bb"
         inkscape:connector-curvature="0" />
      <path
         sodipodi:nodetypes="cccsssssssssssssssssssssssssssssssssssssssssssssssssscccssssssssssssssssssssssssssssssssscccsssssssssssssssssssssssssssssssssssssscccssssssssssssssssssccccccccssccssccssccsssccssccssssssssccssccssccsssccsssccsssccsssccsssc"
         id="path5068"
         d="m -0.71909191,-23.18755 0,-240 116.03518191,0 c 112.29477,0 116.00349,0.0592 115.05202,1.83706 -0.54074,1.01039 -0.80856,3.74463 -0.59515,6.07609 0.36822,4.0228 0.21256,4.31233 -3.05202,5.67635 -1.89202,0.79054 -3.44003,1.5991 -3.44003,1.7968 0,0.19771 0.93621,2.47592 2.08046,5.06269 1.36876,3.0943 2.54856,4.52361 3.44881,4.17815 1.16672,-0.44771 3.3415,3.07566 2.31204,3.74574 -2.41916,1.57464 -6.40408,2.41005 -9.27426,1.94429 -4.47237,-0.72577 -4.7729,1.23532 -0.95615,6.23935 1.436,1.88269 2.36635,4.06038 2.06744,4.83932 -0.84997,2.21499 5.46988,6.59182 9.55809,6.61947 1.24496,0.008 2.92596,0.43422 3.73554,0.94621 1.29597,0.81958 1.29597,0.99082 0,1.43208 -4.98931,1.69881 -11.86644,3.37859 -12.25233,2.99271 -0.94135,-0.94135 -10.30093,1.8103 -12.21924,3.59236 -1.10022,1.02209 -3.5754,2.25911 -5.5004,2.74894 -2.61501,0.66541 -3.58815,1.50065 -3.84861,3.30324 -0.19173,1.32694 -0.97923,3.31297 -1.75,4.4134 -0.77076,1.10042 -1.40139,3.16064 -1.40139,4.57826 0,1.41762 -0.50079,3.07828 -1.11287,3.69036 -1.43039,1.43039 -0.28788,3.28713 2.02266,3.28713 5.62456,0 10.3299,3.80134 8.07238,6.52149 -0.57879,0.69739 -0.92405,1.82962 -0.76726,2.51607 0.35755,1.56528 -8.94722,4.20459 -9.82365,2.78649 -0.33004,-0.53401 -1.21017,-0.0999 -1.95584,0.96469 -0.74567,1.06459 -2.83619,2.49306 -4.64559,3.17436 -4.2638,1.60548 -7.94365,3.1019 -9.65279,3.92533 -0.74962,0.36116 -2.36198,2.44651 -3.58302,4.63411 -2.00083,3.58469 -2.65623,4.00872 -6.63704,4.29399 -5.46228,0.39144 -9.14869,3.41207 -8.29845,6.79971 0.44789,1.78453 -0.26552,3.07844 -3.15863,5.72888 -2.62885,2.40834 -3.81319,4.38994 -3.99348,6.6817 -0.17885,2.27357 -1.19449,3.99223 -3.36135,5.68806 -1.70779,1.33654 -3.10507,3.07246 -3.10507,3.8576 0,0.85602 -1.00086,1.42752 -2.5,1.42752 -5.43777,0 -7.86332,5.79074 -5.39335,12.87608 1.0131,2.9062 1.38341,3.12261 4.38098,2.56026 2.54749,-0.47791 3.57824,-0.18653 4.64335,1.31263 1.52515,2.14665 8.62269,3.70035 10.35107,2.26593 1.65549,-1.37394 7.65942,1.02412 11.91174,4.75771 4.21583,3.70154 7.04756,4.09479 8.83828,1.22739 0.68696,-1.1 2.19426,-2 3.34955,-2 1.15528,0 4.1098,-0.6047 6.56558,-1.34379 5.6392,-1.69715 8.93991,-0.70534 8.1176,2.4392 -0.323,1.23515 -0.17297,1.96587 0.3387,1.64964 0.50521,-0.31224 1.73674,0.0306 2.73674,0.76179 1.66665,1.21868 1.44347,1.49524 -2.67759,3.31819 -2.47268,1.09378 -7.84525,2.30256 -11.93904,2.68618 -4.0938,0.38362 -8.01661,1.05184 -8.71736,1.48493 -0.70075,0.43309 -2.48444,0.44031 -3.96376,0.0161 -1.67551,-0.48053 -3.57102,-0.2997 -5.02716,0.47961 l -2.33751,1.25099 2.41109,1.55644 c 1.3261,0.85604 4.43609,1.80119 6.91109,2.10032 2.475,0.29913 7.2,0.97908 10.5,1.51098 3.3,0.53191 8.025,1.15835 10.5,1.39209 4.41298,0.41676 4.49806,0.49225 4.39991,3.90363 -0.0979,3.40122 0.0543,3.5387 6.83475,6.17669 3.81416,1.48392 7.68421,2.46872 8.60009,2.18844 0.91589,-0.28028 3.24025,-0.52067 5.16525,-0.53419 1.925,-0.0135 5.59935,-0.0462 8.16522,-0.0726 2.56587,-0.0264 4.94582,0.40602 5.28877,0.96094 0.89381,1.44621 6.67807,0.13842 9.11046,-2.05983 1.13545,-1.02617 2.78295,-1.86575 3.66111,-1.86575 1.56752,0 6.77444,5.36165 6.77444,6.97576 0,1.12652 7.65527,5.03564 8.40099,4.28992 0.32946,-0.32946 0.59901,-1.42401 0.59901,-2.43235 0,-2.38234 1.13501,-2.32445 3.26797,0.16667 2.31689,2.70593 3.90471,2.53619 3.18277,-0.34023 -0.84112,-3.35132 2.7287,-5.36364 9.04926,-5.10109 3.94818,0.164 5.59839,0.791 7.84455,2.98054 2.29695,2.23906 3.0159,2.50218 3.73469,1.36681 0.48957,-0.77331 0.89703,-1.74353 0.90545,-2.15603 0.0246,-1.20583 5.50343,-0.86188 6.79168,0.42637 0.90183,0.90183 1.5903,0.82515 2.95,-0.32855 1.83983,-1.5611 10.64435,-3.84782 14.81519,-3.84782 1.31394,0 4.51771,1.35 7.11949,3 5.61603,3.56158 7.14373,3.65797 14.35307,0.90563 5.81501,-2.22002 12.44442,-3.87563 17.63096,-4.40311 5.10081,-0.51875 7.16073,-2.06752 6.60644,-4.96711 -0.39177,-2.04942 -0.0903,-2.53541 1.57289,-2.53541 2.65651,0 3.67714,1.69074 2.13924,3.5438 -0.69032,0.83178 -0.77974,1.4562 -0.20854,1.4562 0.55,0 1.50796,-0.61205 2.1288,-1.36011 0.6422,-0.77381 2.20373,-1.15463 3.62244,-0.88343 1.80235,0.34454 2.49365,0.0411 2.49365,-1.09443 0,-0.86412 1.20743,-2.77855 2.68317,-4.25429 l 2.68317,-2.68317 2.17343,2.52676 c 1.19538,1.38972 3.58796,2.83745 5.31683,3.21717 2.82256,0.61994 3.14337,0.45265 3.14311,-1.63904 -2.7e-4,-2.27453 0.20259,-2.32467 8.60313,-2.12634 5.17954,0.12229 10.25372,-0.34509 12.75028,-1.17443 2.28079,-0.75766 6.84688,-1.69389 10.14688,-2.08052 3.3,-0.38663 7.125,-1.29118 8.5,-2.01011 3.43663,-1.79688 8.15016,-6.38608 7.55244,-7.35321 -0.26994,-0.43677 0.62033,-1.83798 1.97838,-3.1138 2.9682,-2.78848 3.40119,-8.35009 0.76495,-9.82541 -1.43923,-0.80543 -1.52032,-1.3574 -0.52144,-3.54969 0.91525,-2.00877 1.9079,-2.59595 4.38851,-2.59595 1.76314,0 5.19275,-0.96191 7.62134,-2.13757 4.20069,-2.03352 4.5828,-2.05786 7.84965,-0.5 6.46968,3.08517 6.84877,2.69378 7.01213,-7.23984 0.10679,-6.49346 0.60421,-9.57477 1.85347,-11.48138 1.82857,-2.79075 6.43397,-5.93685 10.50057,-7.17328 1.375,-0.41806 4.17856,-1.81937 6.23013,-3.11402 4.21727,-2.66132 4.83043,-2.74255 9.95629,-1.31888 2.9547,0.82064 3.74866,1.56387 4,3.74442 0.49832,4.32331 3.25308,3.45753 3.6306,-1.14105 0.31151,-3.79455 0.37227,-3.84826 3.5,-3.09381 5.5134,1.32992 8.66878,0.84035 11.481,-1.78131 2.51015,-2.34008 6.37443,-4.76328 7.59598,-4.76328 0.28902,0 0.50488,1.2375 0.47971,2.75 -0.0516,3.09793 1.44028,10.331 2.4767,12.00796 0.37522,0.60712 0.22487,1.3865 -0.3341,1.73196 -1.99668,1.23402 -1.09742,3.66072 1.23369,3.32915 1.3752,-0.19561 2.20112,-0.9695 2.12429,-1.99047 -0.0808,-1.07402 0.39283,-1.47146 1.3266,-1.11314 0.79877,0.30652 3.86029,-0.26119 6.80336,-1.26157 4.30149,-1.46212 5.64393,-1.5758 6.84429,-0.57959 1.3197,1.09525 1.29905,1.58357 -0.17765,4.20154 -1.47404,2.61327 -1.49417,3.07602 -0.17089,3.9279 2.57594,1.65828 7.56826,1.13081 9.5,-1.00374 1.72608,-1.9073 1.72871,-2.08979 0.0567,-3.9373 -1.52857,-1.68905 -1.5958,-2.42587 -0.52466,-5.75 0.67571,-2.09699 1.63545,-4.32752 2.13276,-4.95675 0.56137,-0.71029 0.41717,-1.66394 -0.38032,-2.51526 -0.70649,-0.75416 -2.16111,-3.08568 -3.23249,-5.18115 l -1.94798,-3.80996 -5.82384,0.67593 c -7.26757,0.84349 -9.44962,-0.41456 -12.67939,-7.31025 -2.90107,-6.19391 -2.34291,-9.58661 1.81567,-11.03631 4.08555,-1.42422 5.559,-4.40091 2.97671,-6.01357 -1.08161,-0.67548 -2.38414,-2.32645 -2.89451,-3.66883 -0.5684,-1.495 -2.00719,-2.67206 -3.71332,-3.03783 -2.84092,-0.60904 -4.51468,-1.32395 -9.73855,-4.15957 -1.62426,-0.88168 -4.76761,-2.01072 -6.98523,-2.50899 -2.21762,-0.49827 -4.82809,-1.62635 -5.80103,-2.50685 -2.52773,-2.28756 -4.11246,-8.75726 -2.7628,-11.27913 0.76449,-1.42846 0.76246,-2.5837 -0.007,-4.0216 -0.82578,-1.54299 -0.71647,-2.53597 0.46482,-4.2225 0.84947,-1.2128 1.5445,-3.25231 1.5445,-4.53225 0,-3.4082 -2.61397,-7.89362 -4.95729,-8.50641 -1.12056,-0.29303 -2.37608,-1.4058 -2.79004,-2.47281 -0.41401,-1.06701 -3.22771,-3.94599 -6.25271,-6.39774 -5.51907,-4.47317 -7.14343,-7.76819 -5.06443,-10.27323 1.39481,-1.68065 -0.23997,-3.09105 -4.68429,-4.04134 -3.69123,-0.78927 -14.92498,-6.19932 -15.7947,-7.60656 -0.35241,-0.5702 32.31802,-0.92974 84.4844,-0.92974 l 85.05902,0 0,240 0,240 -320,0 -320.00000191,0 0,-240 z M 303.29318,-52.16463 c -1.29314,-2.41625 -5.01227,-4.63659 -5.01227,-2.99236 0,2.33379 2.1588,4.96944 4.07037,4.96944 1.68239,0 1.83197,-0.31397 0.9419,-1.97708 z m 2.98773,-4.02292 c 0,-1.33333 -0.66667,-2 -2,-2 -1.92719,0 -2.7099,1.95677 -1.33333,3.33333 1.37656,1.37657 3.33333,0.59386 3.33333,-1.33333 z m -47.89166,-1.05827 c -1.31542,-1.09546 -2.61704,-1.76636 -2.8925,-1.4909 -0.85757,0.85757 1.94357,3.55092 3.6566,3.5159 1.25888,-0.0257 1.0858,-0.48444 -0.7641,-2.025 z m -83.10834,-16.44173 c 0,-0.825 -0.675,-1.5 -1.5,-1.5 -0.825,0 -1.5,0.675 -1.5,1.5 0,0.825 0.675,1.5 1.5,1.5 0.825,0 1.5,-0.675 1.5,-1.5 z m 371.26644,-52.09977 c 0.86701,-0.86701 -1.29419,-5.1969 -2.90189,-5.81383 -1.71048,-0.65637 -1.77865,1.77766 -0.124,4.42717 1.29203,2.06887 2.01319,2.39935 3.02589,1.38666 z m -17.58057,-95.02399 c 0.42156,-1.09858 -0.70834,-2.85317 -3.49348,-5.42487 -2.26412,-2.09061 -4.39897,-4.84742 -4.74412,-6.12624 -1.30295,-4.82757 -11.51914,-9.42814 -15.3692,-6.92109 -1.21069,0.78837 -1.17029,1.3078 0.27305,3.51062 0.93169,1.42194 2.36975,2.58534 3.19568,2.58534 1.68465,0 3.4522,3.87339 3.4522,7.5651 0,2.00453 0.49869,2.4349 2.82144,2.4349 1.55179,0 4.58929,0.88207 6.75,1.96015 4.84317,2.4165 6.31379,2.50251 7.11443,0.41609 z m -305.32095,-37.59481 c -0.85882,-1.3896 -2.31138,0.19452 -1.68208,1.83444 0.46515,1.21217 0.76946,1.27033 1.39034,0.26572 0.43717,-0.70735 0.56845,-1.65242 0.29174,-2.10016 z M 215.83299,-80.13 c -1.53085,-1.69158 -1.48854,-1.83493 0.65573,-2.22153 5.31428,-0.95813 7.69148,1.54732 3.08496,3.25138 -1.48798,0.55044 -2.5835,0.24883 -3.74069,-1.02985 z m 25.94792,-182.05755 c -0.33992,-0.55 -0.14148,-1 0.44098,-1 0.58246,0 1.05902,0.45 1.05902,1 0,0.55 -0.19844,1 -0.44098,1 -0.24254,0 -0.7191,-0.45 -1.05902,-1 z m 43.5,-0.059 c 0,-0.58246 0.45,-0.7809 1,-0.44098 0.55,0.33992 1,0.81648 1,1.05902 0,0.24254 -0.45,0.44098 -1,0.44098 -0.55,0 -1,-0.47656 -1,-1.05902 z m 3.5,0.059 c -0.33992,-0.55 0.0835,-1 0.94098,-1 0.85746,0 1.55902,0.45 1.55902,1 0,0.55 -0.42344,1 -0.94098,1 -0.51754,0 -1.2191,-0.45 -1.55902,-1 z m 6,0 c -0.33992,-0.55 0.0835,-1 0.94098,-1 0.85746,0 1.55902,0.45 1.55902,1 0,0.55 -0.42344,1 -0.94098,1 -0.51754,0 -1.2191,-0.45 -1.55902,-1 z m 4.10301,0.16667 c -0.28327,-0.45834 0.79538,-0.83334 2.39699,-0.83334 1.60161,0 2.68026,0.375 2.39699,0.83334 -0.28326,0.45833 -1.36191,0.83333 -2.39699,0.83333 -1.03508,0 -2.11373,-0.375 -2.39699,-0.83333 z"
         style="fill:#c4b8b9"
         inkscape:connector-curvature="0" />
      <path
         id="path5066"
         d="m -0.71909191,-23.18755 c 0,-80 0,-160 0,-240 60.66427891,0.2702 121.36700191,-0.72828 182.00000191,0.9288 -11.40233,11.3402 -29.90209,24.01862 -3.42622,19.46114 21.53174,-7.65639 26.14598,24.94309 3.41554,28.78679 -12.4885,12.06545 -25.46374,24.82954 -0.0569,29.74053 -20.45047,10.59598 -40.02916,26.39579 -56.35755,42.02395 -8.08633,7.49119 -42.447033,16.77017 -13.2717,20.714 7.34852,5.20021 -14.810808,15.05293 5.46415,15.03649 14.15418,5.97938 -13.82555,7.34344 0.13617,16.65526 -5.36303,18.66209 -38.691854,10.5494 -43.903492,30.65304 11.064077,20.45192 36.975072,22.20327 57.621592,31.87792 10.19866,-16.843 3.15665,15.74432 12.16955,-4.27652 18.91569,-9.86157 43.67217,-21.8761 63.42377,-12.52169 17.29993,-2.19924 33.0083,-26.29653 47.03983,-24.62882 7.06799,11.06534 10.51013,7.39716 0.74528,10.08507 2.25303,8.91072 22.28952,6.32318 14.19143,-3.05592 8.34017,1.41104 9.85794,-12.47623 22.32427,-1.6297 4.38436,5.04537 13.36423,27.00013 24.32834,10.77491 -7.84915,-9.41217 -19.84702,-15.52925 1.0978,-16.77595 19.71962,7.50218 33.2885,30.02627 51.44898,13.66618 24.30805,-11.47948 49.92569,-16.60358 76.03984,-22.71924 13.74684,1.79141 20.77305,-1.52858 29.69219,6.91411 10.12678,-3.57575 28.19202,-34.08079 3.71575,-22.78535 -9.08671,-6.93354 -41.01471,27.17371 -32.43569,-0.0745 2.07651,-22.92793 38.24864,-12.89999 28.16124,-39.61686 13.20924,-25.32109 20.79253,21.46691 32.84867,-2.80765 7.65575,-11.23213 23.95275,-6.27339 10.31753,4.1722 -8.74451,15.34432 24.82701,12.9886 6.83225,18.60508 -24.54957,-1.43071 -28.61689,40.65309 -3.56262,26.32486 12.53034,-11.04803 29.72583,-18.75844 47.3552,-19.90181 -7.13418,-14.42407 -6.9335,-24.75587 -3.50057,-40.93379 -5.47796,-16.37063 -45.44836,-13.07786 -20.01657,-34.0738 -9.24546,-12.9802 -52.24174,-19.51545 -25.3416,-36.32507 30.06498,8.95617 4.70431,-30.51559 -13.15525,-29.95891 -3.2787,-13.89602 -49.0975,-12.63303 -16.20181,-14.10287 50.28598,-0.37224 100.57373,-0.18634 150.8606,-0.23188 0,160 0,320 0,480 -213.33333,0 -426.66667,0 -640.00000191,0 0,-80 0,-160 0,-240 z M 217.28091,-28.62853 c -2.3337,-3.43479 -2.88022,1.90558 0,0 z m 9.85014,-2.13613 c -4.53272,-7.82561 -11.74513,4.89256 0,0 z m 62.14986,-9.24858 c -7.17302,-9.61671 -36.39748,-7.14247 -10.65899,-0.17875 3.48187,-0.0238 7.25498,1.8471 10.65899,0.17875 z m 28,-3.17431 c -5.24284,-3.68475 -5.24284,3.68475 0,0 z M 69.677164,-45.77779 c -4.478455,-10.71009 -10.756709,3.70119 0,0 z m 212.603746,-7.85306 c -7.08944,-12.80954 -5.99403,7.10472 0,0 z m 10,-1.93426 c -4.80631,-10.66848 -4.3068,6.43058 0,0 z M 157.69912,-192.79454 c 4.05066,-7.49857 0.0695,-11.9185 -4.97708,-0.88544 l 2.4462,1.39438 2.53088,-0.50894 z"
         style="fill:#b2b1c1"
         inkscape:connector-curvature="0" />
      <path
         inkscape:export-ydpi="2.25"
         inkscape:export-xdpi="2.25"
         inkscape:export-filename="/home/bcdlog/Images/Voyage/icon.png"
         id="path5064"
         d="m -0.71495143,-23.18755 9.5352e-4,-240 71.24745291,0.0153 c 39.186105,0.008 70.750415,0.34592 70.142915,0.75 -0.60749,0.40408 -1.13909,2.16904 -1.18133,3.92214 -0.0868,3.60419 -2.31042,8.52368 -2.96502,6.55989 -0.61218,-1.83656 -2.32501,-1.52466 -4.89717,0.89176 -2.51666,2.36427 -5.09368,3.94095 -10.35194,6.33353 -1.925,0.8759 -4.00692,2.26287 -4.62648,3.08217 -0.87148,1.15241 -1.72444,1.26228 -3.76794,0.48534 -2.16994,-0.82501 -3.00719,-0.63853 -4.69043,1.04471 -1.46127,1.46127 -2.40324,1.75496 -3.2841,1.02391 -0.67932,-0.56378 -2.18107,-0.77769 -3.33724,-0.47534 -1.603722,0.41938 -2.065562,0.1131 -1.947962,-1.29185 0.13009,-1.55412 -0.457542,-1.78733 -3.764755,-1.49409 -2.155397,0.19111 -4.55004,0.97861 -5.321428,1.75 -0.771388,0.77138 -2.382881,1.43695 -3.581096,1.47903 -1.198214,0.0421 -2.966071,0.22727 -3.928571,0.41152 -0.9625,0.18425 -1.75,-0.0752 -1.75,-0.57651 0,-1.89038 -2.715248,-0.8121 -4,1.58848 -0.735878,1.375 -1.888774,2.5 -2.561991,2.5 -1.665786,0 -2.452772,2.36575 -1.360802,4.09068 1.498456,2.36705 1.030717,3.90932 -1.185615,3.90932 -1.735495,0 -2.00015,-0.43133 -1.49633,-2.43871 0.702492,-2.79895 -0.854442,-4.25502 -2.812319,-2.63013 -0.731195,0.60684 -2.015966,0.8399 -2.855044,0.51792 -0.839079,-0.32198 -1.822673,-0.10475 -2.185765,0.48275 -0.363093,0.58749 -1.110168,1.06817 -1.660168,1.06817 -0.55,0 -0.753397,-0.39901 -0.451993,-0.88669 0.301403,-0.48768 -0.07167,-1.40098 -0.82906,-2.02956 -2.00545,-1.66437 -6.938811,0.67911 -5.987791,2.84437 0.379719,0.86453 0.773918,2.69688 0.875999,4.07188 0.102081,1.375 0.708789,2.55625 1.34824,2.625 0.639452,0.0687 1.558045,0.18125 2.041319,0.25 0.483273,0.0687 1.438036,1.47541 2.121694,3.1259 0.940636,2.2709 0.962926,3.33839 0.09163,4.38824 -1.716895,2.06873 -0.207208,9.61047 2.599623,12.98657 2.094991,2.5199 2.214748,3.07669 0.967872,4.5 -2.165251,2.47164 -2.887806,5.82918 -1.722889,8.00585 0.770774,1.4402 0.719377,2.07188 -0.194601,2.39167 -0.879081,0.30758 -0.660945,1.08865 0.746502,2.67296 l 1.988512,2.2384 -3.256964,2.91009 c -2.585115,2.3098 -3.128137,3.42339 -2.632443,5.39839 0.463132,1.84526 0.16037,2.66641 -1.171578,3.17752 -1.05224,0.40379 -1.958986,0.20057 -2.189402,-0.49068 -0.216316,-0.64895 -1.061169,-1.17991 -1.87745,-1.17991 -1.127313,0 -1.407815,1.01146 -1.166667,4.20686 0.339761,4.5021 0.01852,4.77513 -7.362592,6.25779 -3.317775,0.66645 -6.111295,3.33367 -5.408822,5.16429 0.304863,0.79446 -0.119437,1.37106 -1.008912,1.37106 -1.084628,0 -1.442193,0.8069 -1.218615,2.75 0.277012,2.40749 0.752492,2.75464 3.817659,2.78724 5.044789,0.0537 5.959389,0.93054 5.287702,5.06966 -0.539163,3.32247 -0.413138,3.54676 1.815844,3.23168 1.918365,-0.27117 2.395979,-0.93584 2.399045,-3.33858 0.005,-3.91639 1.108636,-5.50513 3.805189,-5.47776 2.151804,0.0218 2.146395,0.0565 -0.302492,1.93795 -2.297852,1.76542 -2.348775,1.97125 -0.649075,2.62348 1.01442,0.38927 2.141466,0.2271 2.504548,-0.36038 0.395365,-0.63971 3.363108,-0.94334 7.399075,-0.75699 6.524646,0.30125 6.738927,0.23519 6.738927,-2.07758 0,-1.45664 0.5853,-2.38872 1.5,-2.38872 0.933333,0 1.5,0.94444 1.5,2.5 0,2.90311 1.439352,3.26901 2.95031,0.75 0.955661,-1.59324 1.137009,-1.60523 2.024473,-0.13385 0.636877,1.05591 1.84706,1.4494 3.491108,1.13512 1.383978,-0.26456 4.517086,-0.18099 6.962462,0.18571 3.565583,0.5347 4.508078,1.10208 4.758892,2.86488 0.220632,1.55067 0.975497,2.17475 2.562755,2.11874 1.821894,-0.0643 2.25,0.45895 2.25,2.75 0,2.68064 -1.264706,3.50052 -4.446259,2.8824 -1.322696,-0.25697 -8.528291,3.28329 -8.542268,4.197 -0.0063,0.4125 -1.980223,0.75 -4.386473,0.75 -6.960498,0 -10.836219,1.0917 -11.3897,3.20821 -0.273979,1.0477 -1.058597,1.68984 -1.743595,1.42698 -0.684999,-0.26286 -3.213359,0.002 -5.618579,0.58941 -4.95267,1.20879 -10.212187,1.73217 -17.092023,1.70085 -4.237413,-0.0193 -4.78448,0.23983 -5.361667,2.53952 -0.362963,1.44616 -0.133853,3.17421 0.526308,3.96966 0.794001,0.95671 0.858153,1.99524 0.199956,3.23701 -0.533017,1.0056 -1.518753,4.36596 -2.190524,7.46747 l -1.221402,5.63911 -3.866887,-0.19743 c -2.526127,-0.12897 -3.866887,0.23465 -3.866887,1.04874 0,0.6854 0.7875,1.18812 1.75,1.11717 2.632807,-0.19408 12.965462,4.82482 14.285848,6.93909 0.947604,1.51736 1.996471,1.75427 5.81025,1.31236 5.101102,-0.59108 11.13761,-3.73935 11.147579,-5.81389 0.01189,-2.47513 -2.062624,-5.18426 -3.969844,-5.18426 -1.048189,0 -2.201069,-0.47776 -2.561955,-1.06168 -0.360886,-0.58393 -1.71478,-1.46417 -3.008652,-1.9561 -1.613651,-0.61351 -2.703922,-2.19952 -3.471444,-5.04987 -0.720955,-2.67743 -1.805922,-4.33511 -3.050365,-4.66054 -3.315041,-0.8669 -2.159938,-2.53583 1.318583,-1.90512 1.7875,0.3241 5.95,0.8401 9.25,1.14666 3.3,0.30657 8.7,1.00366 12,1.54909 3.3,0.54543 6.9,1.12931 8,1.29751 3.02848,0.46307 2.393085,3.0511 -0.891271,3.63023 -2.373971,0.4186 -3.112467,1.25996 -4.127567,4.70247 -0.679962,2.30596 -2.512714,5.29059 -4.072782,6.6325 -2.596382,2.23331 -2.731102,2.67114 -1.591516,5.17225 0.684734,1.50283 0.990783,3.53329 0.680109,4.51214 -0.310673,0.97884 0.125414,2.46999 0.969083,3.31366 1.703867,1.70387 2.068045,4.6768 0.572899,4.6768 -1.788585,0 -4.896797,4.20536 -4.330945,5.85969 0.395404,1.15601 0.09833,1.04981 -1.006157,-0.35969 -1.256186,-1.60308 -1.818722,-1.75193 -2.834532,-0.75 -0.985694,0.97222 -1.000654,1.51667 -0.06732,2.45 1.599515,1.59952 1.532839,4.8 -0.1,4.8 -0.715,0 -1.84,-0.54 -2.5,-1.2 -0.933333,-0.93333 -1.2,-0.79845 -1.2,0.60699 0,1.0733 -0.528684,1.60411 -1.302094,1.30733 -0.716151,-0.27482 -2.346891,0.58588 -3.623867,1.91265 -1.705537,1.77205 -2.658901,2.13253 -3.59196,1.35816 -1.605244,-1.33224 -4.48208,1.29057 -4.48208,4.0863 0,1.06071 -0.45,1.92857 -1,1.92857 -0.55,0 -1,-1.09844 -1,-2.44098 0,-3.15819 -1.425524,-3.99064 -3.41938,-1.99678 -1.865235,1.86523 -1.960111,2.65827 -0.493488,4.12489 0.782843,0.78285 0.782843,1.2752 0,1.75902 -0.597922,0.36954 -1.087132,1.54533 -1.087132,2.61287 0,1.30019 -0.687782,1.94098 -2.083333,1.94098 -3.563183,0 -1.530215,2.36448 3.616006,4.20566 3.69196,1.32088 5.05934,1.45448 5.618968,0.54898 0.406787,-0.6582 1.084546,-0.85179 1.506131,-0.4302 0.421585,0.42158 0.221053,1.63995 -0.445627,2.70747 -0.66668,1.06752 -1.212145,2.11957 -1.212145,2.33789 0,0.61962 4.347521,1.86683 5.837692,1.67471 0.841468,-0.10848 1.149119,0.50045 0.829347,1.64152 -0.27959,0.99768 -0.787356,2.7886 -1.128369,3.97981 -0.69151,2.41556 -0.336063,2.7531 3.96133,3.76184 2.837608,0.66608 2.891739,0.62308 1,-0.79442 -1.574731,-1.17996 -1.741178,-1.76112 -0.782783,-2.73316 0.963896,-0.97761 1.350364,-0.88756 1.856989,0.43268 0.825573,2.15141 2.357555,2.12009 4.049117,-0.0828 1.254652,-1.63389 1.38581,-1.60072 1.976874,0.5 0.408826,1.45302 1.406442,2.25 2.816434,2.25 1.200853,0 2.704297,0.52093 3.340987,1.15762 0.876825,0.87682 1.5342,0.84508 2.710136,-0.13086 2.728234,-2.26423 15.278779,-0.83381 21.263458,2.42346 2.89074,1.57334 5.627004,2.44642 6.321655,2.01711 0.673633,-0.41633 4.199815,-0.90181 7.835965,-1.07885 3.63614,-0.17703 8.6038,-0.74109 11.03924,-1.25347 3.71833,-0.78227 4.84029,-0.62952 7,0.95305 1.41456,1.03655 4.01978,2.1691 5.78938,2.51678 2.79511,0.54916 3.37406,0.28842 4.41052,-1.98635 0.65618,-1.44017 1.81166,-2.61849 2.56773,-2.61849 1.04922,0 1.12959,0.45793 0.33948,1.93426 -1.11832,2.0896 -1.40263,7.36495 -0.44836,8.31923 1.12585,1.12584 9.28225,-5.68584 8.81572,-7.36231 -0.61047,-2.19373 1.11036,-3.36681 7.71664,-5.26036 3.09054,-0.88585 6.18314,-2.29017 6.87244,-3.12072 0.71139,-0.85717 2.8801,-1.5101 5.01581,-1.5101 2.89993,0 4.1344,-0.56752 5.3845,-2.4754 1.43256,-2.18637 1.9162,-2.34133 4.14213,-1.32713 1.90856,0.8696 2.80484,0.86363 3.69307,-0.0246 0.64508,-0.64508 2.12943,-1.17287 3.29856,-1.17287 1.16912,0 3.12544,-1.06419 4.34737,-2.36488 1.71723,-1.8279 3.12752,-2.31376 6.21107,-2.13978 4.48663,0.25315 9.69643,4.1241 7.92911,5.89142 -1.83212,1.83212 -1.06581,2.61324 2.56368,2.61324 3.44975,0 5.52304,-1.49537 10.14748,-7.3189 0.94732,-1.19295 2.46742,-1.41359 6.71718,-0.97497 6.21166,0.6411 9.81932,-0.98988 11.79864,-5.33402 1.32991,-2.91883 5.5359,-5.37211 9.21012,-5.37211 2.03719,0 2.54966,-0.49109 2.54966,-2.4433 0,-1.34381 0.86724,-3.05073 1.92719,-3.79315 1.05996,-0.74242 2.48219,-2.56794 3.16052,-4.05671 1.41184,-3.09864 2.53676,-3.35666 4.98293,-1.14292 1.39217,1.2599 1.62647,2.68489 1.20524,7.33028 -0.49338,5.44106 -0.36079,5.89385 2.35031,8.0264 2.13275,1.67762 3.71081,2.12412 6.1235,1.73259 3.71407,-0.60271 4.58289,1.43888 1.25285,2.944 -1.80674,0.81661 -1.4732,1.30761 3.49314,5.14227 5.11805,3.95178 6.11134,4.30977 14.6384,5.27573 5.03128,0.56995 9.39981,0.78425 9.70784,0.47623 0.30802,-0.30803 -1.2179,-2.32114 -3.39094,-4.47359 -3.86057,-3.82398 -4.0439,-3.88828 -8.0114,-2.80969 -4.33186,1.17763 -7.80759,0.65073 -10.76708,-1.63222 -1.73578,-1.33899 -1.7415,-1.54098 -0.11405,-4.02479 1.50934,-2.30354 1.90571,-2.44553 3.3275,-1.19195 0.88773,0.78269 3.43501,1.72116 5.66062,2.08548 3.29451,0.53929 4.3788,0.29528 5.8342,-1.31291 1.73014,-1.91179 1.70123,-2.03191 -0.89899,-3.73565 -3.24317,-2.125 -7.80625,-9.06208 -6.91231,-10.5085 0.39344,-0.6366 1.55741,-0.17758 3.00993,1.18699 2.43251,2.28522 2.41505,2.295 3.70494,-2.07459 0.28703,-0.97234 1.08359,-0.18086 2.26444,2.25 1.0019,2.0625 2.24078,3.75 2.75306,3.75 0.51228,0 0.68824,0.92992 0.39102,2.06649 -1.19852,4.58316 5.20846,12.73326 9.05244,11.51529 0.96508,-0.30579 3.04364,0.11321 4.61901,0.93112 1.57537,0.8179 3.75439,1.4871 4.84227,1.4871 1.08788,0 3.12213,0.9 4.52055,2 3.27303,2.57456 8.56312,2.74566 8.08471,0.26148 -0.18414,-0.95618 -1.22964,-1.88253 -2.32332,-2.05855 -4.51085,-0.72597 -4.86635,-1.12795 -2.90968,-3.29005 1.72928,-1.91083 1.93358,-1.93259 3.10486,-0.33076 1.01269,1.38493 1.53888,1.47805 2.73635,0.48423 1.27473,-1.05793 0.99875,-1.71421 -1.96875,-4.68171 -4.00211,-4.00212 -4.28341,-5.07419 -1.30251,-4.96404 3.03154,0.11202 3.48515,-2.22908 0.6414,-3.31027 -3.20303,-1.21779 -4.95815,-3.50905 -4.20045,-5.48358 0.86252,-2.24769 1.98028,-2.05488 6.51167,1.12325 3.03127,2.12601 3.80517,3.2425 3.41067,4.92054 -0.28066,1.19379 -0.23755,2.88129 0.0958,3.75 0.90615,2.36137 3.39212,1.9066 3.39212,-0.62054 0,-2.56408 1.43572,-1.42369 2.45499,1.95 0.50318,1.66546 0.27259,2.25 -0.8876,2.25 -2.08437,0 -1.98161,1.31516 0.26135,3.34501 2.54809,2.30599 3.46051,2.06397 2.06305,-0.54721 -0.87806,-1.64065 -0.88703,-2.29939 -0.0352,-2.58333 0.62887,-0.20963 1.1434,-1.24364 1.1434,-2.2978 0,-2.56321 0.91715,-2.43654 7.8438,1.08333 3.24698,1.65 6.30373,3 6.79278,3 0.48904,0 1.33337,0.99787 1.87629,2.21749 1.12929,2.53683 8.1402,4.52944 9.86566,2.80398 1.31459,-1.31456 5.62148,-1.33101 5.62148,-0.02145 0,1.80939 1.75558,1.04267 2.28975,-1 0.71177,-2.72182 2.56249,-2.51884 3.67332,0.40286 0.50246,1.32157 1.3945,2.7001 1.98231,3.06338 1.58961,0.98243 2.3699,-2.00862 1.12892,-4.32741 -0.67026,-1.25239 -0.71849,-2.2407 -0.12718,-2.60615 0.52389,-0.32378 1.44094,0.32391 2.03789,1.43931 1.4395,2.68973 4.32704,2.57105 6.45711,-0.26538 0.94724,-1.26136 2.59187,-2.35889 3.65473,-2.43895 1.06287,-0.0801 3.10377,-1.06691 4.53535,-2.19299 1.43158,-1.12608 2.99998,-1.80199 3.48534,-1.50203 0.48535,0.29997 0.88246,0.10634 0.88246,-0.43029 0,-0.53663 -0.5625,-1.17165 -1.25,-1.41117 -0.6875,-0.23951 0.325,-0.48796 2.25,-0.55211 7.1768,-0.23914 8,-0.4228 8,-1.78486 0,-0.76681 0.81,-1.39421 1.8,-1.39421 0.99,0 2.40602,-0.5625 3.1467,-1.25 1.08875,-1.01057 1.19437,-0.9828 0.55138,0.14499 -0.63494,1.11367 -0.21078,1.25375 2.1033,0.69464 1.59424,-0.3852 3.97701,-0.67503 5.29505,-0.64408 1.31804,0.031 3.00666,-0.45015 3.75248,-1.06914 0.74583,-0.61898 2.66423,-0.86378 4.26312,-0.544 2.10192,0.42038 3.07387,0.14671 3.50935,-0.98812 0.50608,-1.31882 0.85729,-1.3579 2.19867,-0.24466 1.33624,1.10898 1.78244,1.07649 2.73816,-0.19935 0.62799,-0.83832 1.92929,-1.81971 2.89179,-2.18087 0.9625,-0.36115 1.75,-1.12076 1.75,-1.68803 0,-0.56726 1.74752,-1.03138 3.88337,-1.03138 3.04236,0 3.99663,-0.43313 4.40638,-2 0.56295,-2.15272 4.52635,-2.7839 6.306,-1.00425 1.5035,1.5035 7.48162,1.92612 10.13628,0.71658 2.04114,-0.93001 2.72826,-0.6541 5.25181,2.10883 2.92641,3.20401 5.37629,4.02319 6.51616,2.17884 0.33992,-0.55 1.92373,-1 3.51959,-1 3.12214,0 3.13828,-0.0139 8.73941,-7.5 5.72932,-7.65748 7.2403,-10.92055 7.2488,-15.65429 0.006,-3.52248 0.43256,-4.54248 2.25,-5.3844 2.19644,-1.01749 2.23957,-0.91545 2.11354,5 -0.10839,5.0871 -0.46574,6.21219 -2.26771,7.13973 -3.20411,1.64927 -3.50901,2.20558 -2.12369,3.87479 1.3716,1.65268 6.03654,2.05718 7.57006,0.65641 1.84461,-1.68493 6.91744,-2.00157 8.89113,-0.55497 2.73518,2.00472 9.14554,1.76689 15.55887,-0.57727 3.00947,-1.1 5.6394,-2 5.84429,-2 0.20489,0 0.0812,-1.16091 -0.27496,-2.57979 -0.57412,-2.28749 -0.40638,-2.50327 1.48048,-1.9044 1.53179,0.48617 2.5392,0.0883 3.59578,-1.42021 0.8073,-1.15258 2.08516,-2.0956 2.83969,-2.0956 0.75452,0 2.10135,-0.72948 2.99294,-1.62108 1.49477,-1.49476 1.46007,-1.73384 -0.4453,-3.06842 -3.08969,-2.1641 -1.82705,-2.94949 5.89568,-3.66725 3.84542,-0.35739 8.14682,-1.17612 9.55867,-1.8194 1.961,-0.89349 2.84386,-0.89272 3.73986,0.003 1.63067,1.63067 4.28629,1.46409 5.80351,-0.36405 0.70155,-0.84531 2.17305,-1.40781 3.27,-1.25 2.80412,0.4034 5.74875,-7.24372 3.72722,-9.67951 -0.73372,-0.88408 -2.25937,-1.4783 -3.39034,-1.32049 -1.66244,0.23196 -2.08776,-0.29998 -2.22055,-2.77727 -0.26371,-4.91976 -1.28681,-7.05547 -3.96426,-8.2754 -3.8785,-1.76717 -3.99982,-3.77326 -0.47122,-7.79211 2.86534,-3.26344 3.13853,-4.11127 2.65924,-8.2527 -1.16138,-10.03519 -1.83726,-12.23967 -4.00824,-13.07355 -1.17287,-0.45049 -3.41073,-2.26108 -4.97303,-4.02352 -2.15178,-2.42745 -3.36415,-3.04803 -5,-2.55937 -9.10166,2.71885 -11.93174,1.69865 -15.16246,-5.46582 -1.4508,-3.2173 -1.54625,-4.22907 -0.51607,-5.47036 0.69518,-0.83736 1.86803,-1.5227 2.60633,-1.5227 0.73831,0 1.8739,-1.0125 2.52354,-2.25 0.64964,-1.2375 1.79048,-2.60986 2.53518,-3.04969 2.29213,-1.35374 1.50404,-3.75205 -1.58701,-4.8296 -2.09648,-0.73083 -3.02976,-1.78063 -3.25,-3.65573 -0.25808,-2.19723 -1.03482,-2.8063 -4.71585,-3.69789 -4.58278,-1.11001 -5.57864,-2.14095 -6.55814,-6.78912 -0.4983,-2.36467 -0.86477,-2.62184 -2.49382,-1.75 -2.39017,1.27918 -8.12593,1.3205 -11.38343,0.082 -3.83188,-1.45687 -4.3467,-5.95589 -1.21039,-10.57751 1.40396,-2.06884 2.55266,-4.34719 2.55266,-5.06298 0,-2.89899 2.39256,-2.44204 6.08325,1.16182 l 3.90271,3.8109 2.04598,-2.19609 c 1.12528,-1.20786 3.04094,-2.21024 4.25702,-2.22752 1.21607,-0.0173 3.02504,-1.14956 4.01992,-2.51617 1.55989,-2.14272 1.64623,-2.99871 0.62725,-6.21858 -0.6499,-2.05361 -1.5764,-4.51522 -2.05889,-5.47026 -0.48248,-0.95504 -0.87724,-2.39592 -0.87724,-3.20196 0,-1.39437 -7.91957,-7.56161 -9.71013,-7.56161 -0.46738,0 -2.33536,-1.575 -4.15107,-3.5 -1.81571,-1.925 -4.12826,-3.5 -5.139,-3.5 -3.46959,0 -7.82843,-3.26839 -7.65851,-5.74258 0.22624,-3.29407 -8.80934,-6.87631 -19.11263,-7.5774 -4.25077,-0.28924 -8.85366,-0.98204 -10.22866,-1.53957 -1.72048,-0.6976 23.30219,-1.03344 80.25,-1.07706 l 82.75,-0.0634 0,240 0,240 -319.99841,0 -319.99840494,0 9.5351e-4,-240 z m 102.79586143,7.8 c 1.86216,-1.86216 1.42211,-2.97079 -1.03978,-2.61955 -1.231892,0.17575 -2.389884,1.10705 -2.57333,2.06955 -0.382322,2.00595 1.82166,2.34145 3.61311,0.55 z m 119.7,-11.8 c 0.99549,-1.1 2.83971,-2 4.09828,-2 2.43759,0 5.90368,-3.89804 4.6134,-5.18832 -0.42338,-0.42338 -3.11921,-0.49153 -5.99073,-0.15144 -4.93782,0.58481 -5.22095,0.77394 -5.22095,3.48752 0,2.59661 -0.18568,2.75323 -1.95452,1.64857 -2.40009,-1.49888 -3.44572,-0.63275 -2.5694,2.12831 0.85226,2.68522 4.62539,2.7257 7.02392,0.0754 z m 205.5,-5.04573 c 0,-1.15923 -9.40149,-2.79465 -16.75,-2.91371 -4.9881,-0.0808 -6.25,0.20772 -6.25,1.42909 0,1.52375 0.88635,1.64884 14.20315,2.00444 2.03673,0.0544 3.97529,0.37102 4.30791,0.70363 0.80848,0.80848 4.48894,-0.19462 4.48894,-1.22345 z m -182.63524,-4.98951 c -1.33167,-1.33167 -3.86028,1.42446 -2.83253,3.0874 0.49971,0.80854 1.16614,0.67804 2.29324,-0.44906 1.10919,-1.10919 1.27199,-1.90564 0.53929,-2.63834 z m 103.02409,0.0908 c -0.25599,-0.256 -2.22742,-0.50966 -4.38095,-0.56368 -2.15538,-0.0541 -4.75833,-0.861 -5.79044,-1.79504 -2.36042,-2.13615 -3.45699,-2.16291 -3.04078,-0.0742 0.49808,2.49965 8.56074,5.31314 11.39411,3.976 1.25593,-0.5927 2.07406,-1.28709 1.81806,-1.54309 z M 40.280908,-38.62245 c 0,-1.51445 -2.11376,-5.5651 -2.904047,-5.5651 -0.524452,0 -2.593224,-1.54641 -4.597272,-3.43647 -3.906523,-3.68433 -9.016559,-5.44565 -10.755136,-3.70708 -1.403994,1.404 0.830004,4.14355 3.3789,4.14355 1.032655,0 2.777555,0.9 3.877555,2 1.1,1.1 2.684647,2 3.521439,2 0.836791,0 2.034023,1.125 2.660515,2.5 0.626492,1.375 1.966844,2.5 2.978561,2.5 1.011717,0 1.839485,-0.19571 1.839485,-0.4349 z m 209.500002,-2.5651 c 0.33992,-0.55 0.35207,-1.43035 0.027,-1.95633 -0.82258,-1.33094 -3.527,-0.13222 -3.527,1.56332 0,1.5989 2.57595,1.88815 3.5,0.39301 z m 50.94423,0.0902 c 0.86297,-1.39627 -0.48801,-4.0902 -2.05122,-4.0902 -0.76615,0 -1.39301,0.825 -1.39301,1.83333 0,2.8474 2.19169,4.28356 3.44423,2.25691 z m 32.90085,-3.63337 c -0.32569,-0.84872 -0.80663,-1.32866 -1.06875,-1.06653 -0.26213,0.26213 -0.17998,0.95654 0.18255,1.54313 0.98605,1.59546 1.56238,1.28551 0.8862,-0.4766 z m -298.740915,-15.186 c -1.016516,-1.01651 -1.855248,0.51389 -1.021218,1.86338 0.630035,1.01942 0.865577,1.02021 1.204302,0.004 0.231595,-0.69479 0.149207,-1.53513 -0.183084,-1.86742 z m -4.285152,0.28666 c 1.741137,-1.31987 1.730817,-1.4069 -0.241051,-2.03275 -2.444604,-0.77588 -4.077964,0.03891 -4.077964,2.03428 0,1.80413 1.937933,1.80345 4.319015,-0.002 z m -1.193443,-9.93375 c 0.856174,-1.87909 0.723016,-2.92519 -0.636449,-5 -1.388348,-2.11888 -1.446869,-2.62374 -0.304133,-2.62374 0.778256,0 1.95501,0.54 2.61501,1.2 0.66,0.66 1.2,0.8299 1.2,0.37756 0,-0.45235 0.633335,-0.29683 1.40741,0.3456 0.774076,0.64242 5.049076,1.35927 9.5,1.59298 7.824807,0.41088 8.092102,0.35146 8.077848,-1.7956 -0.04003,-6.02989 -6.11058,-10.15826 -12.738957,-8.66332 -1.791325,0.40401 -3.457514,0.41005 -3.702644,0.0134 -0.505545,-0.81799 -16.570882,-1.17185 -17.831472,-0.39276 -0.451472,0.27902 -0.126409,1.56718 0.722363,2.86257 1.028789,1.57013 1.19114,2.57285 0.487029,3.00802 -0.580906,0.35902 -1.303389,-0.29252 -1.605516,-1.44785 -0.729962,-2.79136 -4.316061,-2.83174 -4.316061,-0.04858 0,1.38095 0.981081,2.39403 3,3.09782 2.240426,0.78102 3,1.67067 3,3.51373 0,4.54089 1.716253,6.33643 6.056623,6.33643 3.226228,0 4.192683,-0.45306 5.068949,-2.37626 z m -7.487198,-8.12374 c -0.614152,-1.60045 0.228034,-1.87223 2.774095,-0.89522 0.866824,0.33264 1.327071,1.00764 1.02277,1.5 -0.87167,1.4104 -3.163664,1.04532 -3.796865,-0.60478 z m 483.361628,9.69113 c 0,-0.44488 -0.64471,-1.68238 -1.43268,-2.75 -1.12177,-1.51989 -1.6985,-1.67906 -2.65762,-0.73351 -0.9664,0.95273 -0.95476,1.53316 0.0551,2.75 1.3474,1.62352 4.03517,2.1121 4.03517,0.73351 z M 64.964022,-89.37505 c -0.319226,-0.79773 -0.556183,-0.56078 -0.604167,0.60417 -0.04342,1.05416 0.192928,1.64479 0.52522,1.3125 0.332291,-0.3323 0.367818,-1.1948 0.07895,-1.91667 z m 228.710388,36.4375 c -0.29904,-0.9625 -1.13703,-3.40773 -1.86218,-5.43385 -1.15029,-3.21398 -1.11902,-3.76039 0.24516,-4.28387 1.69895,-0.65195 3.18388,1.01096 3.20821,3.59272 0.008,0.89375 0.29656,3.03125 0.64031,4.75 0.67403,3.37013 -1.24434,4.55218 -2.2315,1.375 z m -22.35832,-4.18426 c -2.25851,-4.22006 -0.44975,-5.48031 2.96482,-2.06574 1.1,1.1 2,2.45 2,3 0,1.78811 -3.90068,1.0541 -4.96482,-0.93426 z m -12.47294,-2.64636 c -2.24535,-2.24535 -0.81013,-3.95369 1.53704,-1.82954 1.04539,0.94608 1.90072,2.10039 1.90072,2.56515 0,1.3489 -1.72165,0.9805 -3.43776,-0.73561 z m 69.01076,-0.94085 c -1.05985,-0.80183 -1.6521,-1.73276 -1.31611,-2.06875 0.33598,-0.33598 1.62548,0.33437 2.86556,1.48967 2.5492,2.37495 1.39466,2.80644 -1.54945,0.57908 z m -23.03336,-2.82589 c -1.32691,-0.97026 -1.50808,-1.55411 -0.64733,-2.08609 1.24012,-0.76643 4.10769,1.01783 4.10769,2.55589 0,1.2631 -1.33912,1.08129 -3.46036,-0.4698 z M 521.92039,-86.8814 c -1.19516,-1.19516 -0.64571,-3.30615 0.86052,-3.30615 0.825,0 1.5,0.64844 1.5,1.44098 0,1.67065 -1.42728,2.79841 -2.36052,1.86517 z m -75.60788,-3.05615 c 0.0395,-0.93792 4.66756,-6.25 5.44518,-6.25 0.315,0 1.00045,1.125 1.52322,2.5 1.14553,3.01297 2.63488,3.22574 3.5,0.5 0.8105,-2.55366 1.68919,-2.52796 3.32874,0.0974 1.5468,2.47682 1.57284,2.44381 -2.54663,3.22756 -2.42611,0.46158 -3.45168,0.19447 -4.16802,-1.08555 -0.89194,-1.59381 -1.0671,-1.59189 -2.86084,0.0314 -1.96218,1.77575 -4.27784,2.31285 -4.22165,0.97919 z M 69.947575,-91.85422 c -0.366667,-0.36666 -0.666667,-1.13166 -0.666667,-1.7 0,-0.6266 0.465771,-0.56756 1.183333,0.15 0.650834,0.65084 0.950834,1.41584 0.666667,1.7 -0.284167,0.28417 -0.816667,0.21667 -1.183333,-0.15 z m 406.727645,-4.78695 c -1.66274,-1.21583 -1.64191,-1.33302 0.34925,-1.96499 3.72544,-1.18241 3.83283,-10.55593 0.13505,-11.78852 -0.89051,-0.29684 -1.26906,-3.4728 -1.31462,-11.02959 -0.0562,-9.31722 0.19482,-10.95759 2.05623,-13.43799 2.34997,-3.13144 5.95283,-3.3803 8.12978,-0.56155 1.65275,2.14 1.59656,5.23626 -0.095,5.23626 -1.96454,0 -4.65499,3.32849 -4.65499,5.75894 0,1.83213 0.3632,1.99728 2.83408,1.28865 1.58707,-0.45517 3.56126,-0.40585 4.48675,0.11208 1.81406,1.0152 4.50692,-0.0423 6.63386,-2.60507 1.74105,-2.09784 3.04531,-1.95952 3.04531,0.32296 0,1.03265 0.7237,2.47816 1.60821,3.21225 1.36818,1.13549 1.8226,1.04182 3.04459,-0.62756 0.81366,-1.11154 1.18498,-2.96577 0.8565,-4.27696 -0.44319,-1.76906 0.28873,-3.18332 3.10494,-5.99953 l 3.68482,-3.68482 1.34829,3.89444 c 0.74156,2.14195 1.86393,4.51575 2.49416,5.27513 0.87869,1.05875 0.70432,2.20728 -0.74782,4.92578 -1.86658,3.49434 -1.86552,3.56584 0.0735,4.99344 1.90766,1.40453 1.9135,1.54796 0.19293,4.74286 -2.33794,4.34128 -8.25183,8.06412 -16.249,10.22885 -3.56931,0.96617 -6.72354,2.13509 -7.00939,2.59761 -0.28589,0.46252 -1.59166,0.84095 -2.90174,0.84095 -1.31008,0 -2.6327,0.40569 -2.93914,0.90153 -1.20445,1.94883 -6.33706,2.9826 -8.16655,1.64485 z m -401.239815,-5.09835 c 0.190026,-0.98026 0.95098,-1.98391 1.691006,-2.23033 0.860627,-0.28658 1.220995,0.19425 1,1.33427 -0.190026,0.98026 -0.95098,1.98391 -1.691006,2.23033 -0.860627,0.28658 -1.220995,-0.19425 -1,-1.33427 z m 394.041395,0.34786 c -0.66226,-0.66226 -3.01453,-1.24953 -5.22726,-1.30504 -4.10079,-0.10288 -9.18985,-3.60295 -7.57976,-5.21307 0.42777,-0.42778 4.22777,-0.77778 8.44445,-0.77778 l 7.66668,0 -0.15934,3.35934 c -0.19051,4.01644 -1.467,5.61432 -3.14477,3.93655 z M 65.280908,-151.74657 c 0,-0.85746 0.45,-1.2809 1,-0.94098 0.55,0.33992 1,1.04148 1,1.55902 0,0.51754 -0.45,0.94098 -1,0.94098 -0.55,0 -1,-0.70156 -1,-1.55902 z m 31.660333,-0.19098 c -1.638927,-6.04524 -1.668736,-7.25 -0.179385,-7.25 1.569334,0 1.66501,0.29154 1.886926,5.74979 0.141048,3.46924 -0.920795,4.40216 -1.707541,1.50021 z m 6.577839,-4.85797 c 0.27517,-1.15938 0.0527,-2.95938 -0.49439,-4 -0.813,-1.54641 -0.56657,-1.48175 1.34901,0.354 2.27525,2.18042 2.28969,2.29728 0.49439,4 -1.7707,1.67941 -1.82805,1.66436 -1.34901,-0.354 z m -12.238172,-3.31643 c 0,-0.47389 0.675,-1.12064 1.5,-1.43723 0.825,-0.31658 1.5,-0.18787 1.5,0.28603 0,0.47389 -0.675,1.12064 -1.5,1.43723 -0.825,0.31658 -1.5,0.18787 -1.5,-0.28603 z m -34.541119,-3.14213 c -1.172628,-1.89735 0.537618,-2.36554 2.279214,-0.62395 1.558942,1.55895 1.561681,1.69048 0.03521,1.69048 -0.910398,0 -1.951888,-0.47994 -2.314422,-1.06653 z m 36.541119,-6.93347 c 0,-0.55 0.45,-1 1,-1 0.55,0 1,0.45 1,1 0,0.55 -0.45,1 -1,1 -0.55,0 -1,-0.45 -1,-1 z m -31,-3.94098 c 0,-0.51754 0.45,-1.2191 1,-1.55902 0.55,-0.33992 1,0.0835 1,0.94098 0,0.85746 -0.45,1.55902 -1,1.55902 -0.55,0 -1,-0.42344 -1,-0.94098 z m 34.710251,-13.05902 c 0.287656,-1.1 0.695528,-2 0.90638,-2 0.210853,0 0.383369,0.9 0.383369,2 0,1.1 -0.407871,2 -0.90638,2 -0.49851,0 -0.671025,-0.9 -0.383369,-2 z m -11.710251,-8.56574 c 0,-1.57407 2.222687,-4.41467 3.052878,-3.90158 1.132321,0.69981 -0.628642,4.46732 -2.088062,4.46732 -0.530649,0 -0.964816,-0.25458 -0.964816,-0.56574 z m 19.729172,-0.0384 c -0.40104,-0.40104 -0.72917,-1.41916 -0.72917,-2.2625 0,-1.12559 0.29583,-1.2375 1.1125,-0.42083 0.61187,0.61188 0.94,1.63 0.72917,2.2625 -0.21084,0.6325 -0.71146,0.82188 -1.1125,0.42083 z m -27.154966,-10.06305 c -0.351874,-0.91697 -0.175019,-2.13197 0.393011,-2.7 0.710377,-0.71037 1.032783,-0.18992 1.032783,1.66722 0,3.08485 -0.4995,3.44667 -1.425794,1.03278 z m 6.425794,-4.77376 c 0,-0.85746 0.45,-1.55902 1,-1.55902 0.55,0 1,0.42344 1,0.94098 0,0.51754 -0.45,1.2191 -1,1.55902 -0.55,0.33992 -1,-0.0835 -1,-0.94098 z m -3.119713,-25.20327 c -1.21305,-1.46163 -1.115588,-1.56521 0.877555,-0.93261 1.417031,0.44975 2.242158,0.29711 2.242158,-0.41477 0,-0.61952 0.471851,-0.83478 1.048558,-0.47836 0.716805,0.44301 0.678065,1.09446 -0.122444,2.05902 -1.517843,1.82889 -2.375421,1.77944 -4.045827,-0.23328 z"
         style="fill:#a19eb6"
         inkscape:connector-curvature="0" />
      <path
         id="path5062"
         d="m -0.71909191,109.31245 0,-107.5 2.37755531,0 c 3.4212187,0 5.3525986,-2.60119 3.7896337,-5.1039 -0.9846959,-1.57674 -0.9374,-2.04705 0.251751,-2.50337 2.6382327,-1.01238 5.0837499,0.0826 5.0169399,2.24625 -0.04601,1.49023 0.424132,1.94888 1.665078,1.62437 1.092598,-0.28572 2.376287,0.53538 3.486884,2.23037 1.872205,2.85735 1.400475,2.83367 11.728977,0.58869 6.047276,-1.31442 6.111283,-1.35745 8.028611,-5.39792 1.331267,-2.80544 2.039471,-3.28857 4.371598,-2.98225 3.268076,0.42925 9.954285,-3.38166 18.526038,-10.55923 7.919016,-6.63099 15.19646,-10.16008 20.771287,-10.07272 5.810687,0.091 6.867085,0.61074 11.301077,5.55957 l 3.700221,4.12987 -2.757826,1.81117 c -3.461983,2.27362 -5.971358,2.11371 -8.441752,-0.53795 l -1.930608,-2.07226 -3.108307,3.10831 c -2.501378,2.50137 -2.831902,3.28326 -1.692733,4.00434 2.074187,1.31293 9.320616,1.12162 10.725387,-0.28315 0.946415,-0.94642 1.818627,-0.85018 4.00618,0.44204 1.788884,1.05672 5.11797,1.66868 9.24019,1.69854 9.47357,0.0686 10.93674,0.17594 16.57478,1.21552 4.32788,0.798 5.65828,0.6516 8.5,-0.9354 4.49469,-2.51011 4.66052,-4.50413 0.68392,-8.2241 -1.82319,-1.70552 -2.41488,-2.63944 -1.31488,-2.07538 3.27526,1.67949 11.40605,4.08887 13.78495,4.08485 1.21828,-0.002 3.68843,-0.90205 5.48922,-2 3.93803,-2.40101 5.14918,-2.48334 6.63524,-0.45104 1.01868,1.39313 1.49705,1.39181 4.86024,-0.0134 3.12652,-1.30636 3.73035,-2.0421 3.73035,-4.54524 l 0,-2.98658 6.37756,0 c 4.44898,0 6.754,-0.4536 7.62244,-1.5 1.7201,-2.0726 5.3482,-1.87772 7.4076,0.3979 3.05301,3.37354 12.57825,3.23514 12.6002,-0.18308 0.004,-0.66815 1.13738,-1.7388 2.51797,-2.37921 3.1915,-1.48045 7.62384,0.50258 9.28825,4.15555 0.6287,1.37986 1.60275,2.50884 2.16454,2.50884 0.56179,0 1.02144,1.0882 1.02144,2.41821 0,4.17141 1.05088,5.58179 4.15901,5.58179 2.31341,0 3.15088,-0.58979 3.90483,-2.75 0.70248,-2.01273 3.23594,-4.02347 9.44967,-7.5 4.66943,-2.6125 8.71411,-4.75 8.98818,-4.75 0.27407,0 0.49831,1.40625 0.49831,3.125 0,2.93606 0.18065,3.08887 2.98783,2.52743 2.57598,-0.51519 3.07338,-0.25674 3.60841,1.875 0.76075,3.03107 2.0905,3.051 10.40376,0.15592 5.07916,-1.76881 6.56985,-2.74667 6.81955,-4.47348 0.28489,-1.97016 -0.12189,-2.20987 -3.75,-2.20987 -2.23825,0 -4.06955,-0.36581 -4.06955,-0.81291 0,-3.38721 14.19376,-10.42144 17.23538,-8.54162 0.65508,0.40486 5.25761,1.11328 10.22784,1.57426 10.76103,0.99806 10.99618,1.00094 15.78678,0.19351 3.34792,-0.56428 3.75,-0.40588 3.75,1.47735 0,1.16018 0.3375,2.14691 0.75,2.19274 0.4125,0.0458 1.875,0.3224 3.25,0.6146 3.96225,0.84199 12.76071,0.87572 13.58382,0.0521 1.34454,-1.34542 -0.44501,-2.04117 -6.81785,-2.6507 -5.55538,-0.53134 -6.22814,-0.82611 -5.9324,-2.5993 0.60267,-3.61336 1.96097,-3.99835 6.43602,-1.82421 3.198,1.55371 5.5213,1.95482 9.25049,1.59704 3.93082,-0.37712 7.26487,0.28689 15.82627,3.15194 7.82324,2.61803 11.76585,3.45721 14.14531,3.01082 2.28574,-0.42881 4.10917,-0.088 5.93697,1.10961 2.50472,1.64115 2.83847,1.6381 6.6047,-0.0602 2.18167,-0.98379 3.96667,-2.3443 3.96667,-3.02334 0,-1.12275 3.2627,-2.18039 8.5,-2.75537 1.1,-0.12076 2.60171,-0.60486 3.33713,-1.07578 0.79437,-0.50866 1.78886,-0.40449 2.45,0.25665 1.75913,1.75913 2.90674,1.29905 2.21287,-0.88713 -0.41135,-1.29606 -0.17109,-2.02615 0.68261,-2.07431 0.72457,-0.0409 2.39658,-0.27323 3.7156,-0.51634 2.74189,-0.50538 15.10179,7.09031 15.10179,9.2807 0,1.75192 -1.46535,1.65909 -3,-0.19005 -2.11299,-2.546 -9,-1.65986 -9,1.15802 0,0.79422 1.56055,2.09607 3.46788,2.89301 3.82098,1.5965 7.53212,1.90592 7.53212,0.62798 0,-0.45155 2.7,-0.89541 6,-0.98636 3.38977,-0.0934 6,0.26374 6,0.82099 0,0.5425 -1.125,0.98636 -2.5,0.98636 -1.55556,0 -2.5,0.56667 -2.5,1.5 0,1 1,1.5 3,1.5 1.88764,0 3,-0.51295 3,-1.38342 0,-1.95253 4.84801,-2.7106 5.85277,-0.91518 1.34177,2.39762 8.47339,3.48538 12.30057,1.87617 2.38017,-1.00078 3.85913,-1.10608 5.2301,-0.37236 2.90142,1.5528 9.61656,-0.71339 9.61656,-3.24535 0,-1.36467 0.6833,-1.961 2.25,-1.9636 1.2375,-0.002 3.73955,-0.91189 5.56012,-2.02186 1.82056,-1.10997 3.73569,-1.75511 4.25583,-1.43364 1.58112,0.97719 8.03886,-1.82525 7.49169,-3.25114 -0.36051,-0.93948 0.78628,-1.29333 4.22374,-1.30327 2.59524,-0.008 5.61862,-0.25003 6.71862,-0.53893 1.44945,-0.38068 2.41543,0.22813 3.50914,2.21162 1.24797,2.26325 2.22598,2.75487 5.65143,2.84081 2.6925,0.0675 5.56929,1.04826 8.21942,2.80204 4.95601,3.27973 8.62823,3.48552 10.18807,0.57094 0.76748,-1.43404 0.80391,-2.33392 0.11181,-2.76166 -0.56463,-0.34897 -0.94859,-2.20424 -0.85324,-4.12283 0.1638,-3.29586 0.008,-3.47506 -2.82663,-3.24771 -4.92017,0.39465 -6.08088,-0.50066 -3.36746,-2.59748 1.8184,-1.40518 3.99089,-1.80334 9.36746,-1.71683 3.85,0.062 7.56557,0.46983 8.25682,0.9064 0.74603,0.47115 2.42024,-0.0347 4.1194,-1.24458 4.80325,-3.42022 7.63746,-4.14589 9.38133,-2.40202 1.37627,1.37627 1.86331,1.21578 4.78564,-1.57696 1.78939,-1.71004 4.07632,-3.10916 5.08207,-3.10916 1.00575,0 2.56576,-1.125 3.4667,-2.5 0.97324,-1.48536 2.58586,-2.5 3.97336,-2.5 1.28441,0 2.69516,-0.5625 3.13499,-1.25 0.43983,-0.6875 4.10361,-2.81947 8.14173,-4.73772 4.03812,-1.91824 7.75014,-4.25026 8.24894,-5.18227 0.49879,-0.93201 1.91815,-2.01552 3.15412,-2.4078 1.23597,-0.39228 2.72625,-1.36835 3.31172,-2.16903 0.69699,-0.9532 3.28758,-1.55222 7.50384,-1.73513 8.94866,-0.38821 12.77377,-1.42102 13.47776,-3.63911 0.46185,-1.45514 1.18451,-1.7356 3.181,-1.23451 3.38061,0.84848 11.0785,-3.23921 11.48801,-6.10029 0.24513,-1.71273 1.02226,-2.0442 4.79257,-2.0442 5.49819,0 7,-0.87757 7,-4.0904 0,-1.44461 0.72747,-2.73793 1.75,-3.1112 2.55782,-0.93373 5.79544,-3.64349 5.7331,-4.7984 -0.0297,-0.55 -0.63446,-2.04632 -1.34394,-3.32516 -1.09555,-1.9747 -1.84382,-2.24063 -4.96457,-1.76436 -2.02102,0.30843 -5.24959,0.21002 -7.17459,-0.21869 -3.97164,-0.88452 -10.30356,0.87752 -13.5,3.75676 -4.81801,4.33989 -10.99892,5.37315 -13.7671,2.30145 -2.05035,-2.27516 -3.10691,-6.6237 -2.34598,-9.65547 0.54318,-2.16421 1.00539,-2.3516 4.60841,-1.86833 3.2038,0.42972 4.00467,0.22245 4.00467,-1.03641 0,-1.01716 -1.64171,-2.03723 -4.64307,-2.88493 -5.08534,-1.43629 -5.95436,-2.4584 -6.84845,-8.05486 -0.66174,-4.14203 -3.4596,-5.31472 -3.57877,-1.5 -0.0667,2.13408 -0.1115,2.14696 -0.8704,0.25 -0.76133,-1.90305 -0.57441,-5.02723 0.51797,-8.65746 0.28051,-0.93218 -0.60364,-2.84696 -2.02053,-4.3758 -1.3856,-1.4951 -2.23234,-3.18263 -1.88164,-3.75007 0.39743,-0.64306 -0.17469,-0.81929 -1.51874,-0.46781 -1.90002,0.49686 -2.15637,0.15476 -2.15637,-2.87766 0,-1.89286 -0.72461,-4.54746 -1.61024,-5.8991 -1.6608,-2.53471 -1.24498,-7.4721 0.62929,-7.4721 0.53952,0 0.98095,-0.675 0.98095,-1.5 0,-0.825 -0.6737,-1.5 -1.49712,-1.5 -0.82341,0 -3.28036,-1.61105 -5.45988,-3.58012 -2.80506,-2.5342 -4.5342,-3.39876 -5.91873,-2.95932 -1.07577,0.34144 -2.25392,0.13868 -2.61809,-0.45057 -0.39104,-0.63271 -2.02796,-0.81513 -3.99806,-0.44553 -2.73767,0.51359 -3.53791,0.24839 -4.46226,-1.47877 -0.97859,-1.8285 -0.79268,-2.23145 1.41712,-3.07161 1.3989,-0.53187 4.54232,-1.87761 6.98538,-2.99055 2.44305,-1.11294 5.3291,-2.02353 6.41344,-2.02353 2.6801,0 3.09223,-1.77251 1.48483,-6.38607 -1.71467,-4.92147 -2.03878,-15.45971 -0.5603,-18.21797 0.96612,-1.8024 0.69108,-2.51921 -1.91854,-5 -3.76705,-3.58109 -6.06264,-7.84343 -5.77176,-10.71675 0.32672,-3.22725 -1.12378,-9.86524 -2.70827,-12.39403 -0.76327,-1.21815 -1.38776,-3.13065 -1.38776,-4.25 0,-2.19162 -3.34375,-2.90603 -4.54026,-0.97004 -0.44223,0.71554 -1.2001,0.59101 -2.30902,-0.37941 -0.90789,-0.7945 -3.22572,-2.2224 -5.15072,-3.1731 -1.925,-0.9507 -4.23085,-2.65145 -5.12412,-3.77944 -0.89327,-1.12799 -3.13383,-2.54191 -4.97902,-3.14204 -2.54551,-0.8279 -4.25594,-2.58258 -7.08975,-7.27311 -2.05417,-3.40009 -4.0249,-7.33759 -4.37939,-8.75001 l -0.64454,-2.56803 62.10841,0 62.10841,0 0,51.36668 0,51.36667 -4.86802,2.02306 c -4.32679,1.79813 -4.94765,2.44748 -5.58416,5.8404 -0.65666,3.5003 -0.43923,4.04483 2.61802,6.55657 2.9211,2.39987 3.18306,2.98595 2.11451,4.73076 -1.53983,2.51433 -0.0427,7.49784 3.35571,11.17058 l 2.36394,2.55472 0,172.19528 0,172.19528 -320,0 -320.00000191,0 0,-107.5 z M 196.28091,-5.62853 c 0,-1.59263 -1.81436,-3.07799 -2.69007,-2.20228 -0.82264,0.82264 0.46152,3.64326 1.65869,3.64326 0.56726,0 1.03138,-0.64844 1.03138,-1.44098 z M 68.280908,-9.68755 c 0.684689,-0.825 1.864789,-1.5 2.622445,-1.5 0.757655,0 1.377555,-0.65917 1.377555,-1.46482 0,-1.76158 -3.216516,-3.671 -4.574236,-2.7154 -0.874722,0.61564 -3.425764,5.6252 -3.425764,6.72727 0,1.07335 2.861972,0.32419 4,-1.04705 z m 120.000002,0.5 c 0,-0.55 -0.675,-1 -1.5,-1 -0.825,0 -1.5,0.45 -1.5,1 0,0.55 0.675,1 1.5,1 0.825,0 1.5,-0.45 1.5,-1 z m 342.01003,-21.48792 c -0.67918,-0.81835 -2.77198,-2.43791 -4.65068,-3.59901 -2.73943,-1.69305 -3.70597,-1.87029 -4.88107,-0.89505 -1.1608,0.96339 -2.14186,0.89609 -4.72176,-0.32387 -4.44363,-2.10128 -8.75652,-3.09869 -8.75652,-2.02506 0,2.06247 3.28426,5.33091 5.3567,5.33091 1.23382,0 2.79453,0.55123 3.46826,1.22496 0.96661,0.96661 1.68589,0.93711 3.41046,-0.13991 1.89472,-1.18327 2.32312,-1.14668 3.21992,0.27504 0.66868,1.06008 2.40543,1.63991 4.91199,1.63991 3.31934,0 3.69979,-0.2142 2.6427,-1.48792 z m 38.98997,-137.51208 c 0,-0.55 -0.45,-1 -1,-1 -0.55,0 -1,0.45 -1,1 0,0.55 0.45,1 1,1 0.55,0 1,-0.45 1,-1 z m -21.88302,-29.58229 c -1.31067,-1.30422 -2.77317,-2.1302 -3.25,-1.8355 -1.67111,1.0328 -0.84402,-0.69426 1.58914,-3.31832 2.1819,-2.35307 2.71751,-2.50892 4.7972,-1.39591 3.50551,1.87609 5.01338,4.76518 3.73435,7.15505 -1.3772,2.57332 -3.89969,2.35108 -6.87069,-0.60532 z"
         style="fill:#6a6e92"
         inkscape:connector-curvature="0" />
      <path
         id="path5060"
         d="m -0.4990458,120.56245 0.27995389,-96.25 4.20942641,-0.10841 c 2.3151846,-0.0596 5.3313386,-0.84351 6.7025635,-1.74197 3.496021,-2.29068 14.64719,-1.17243 13.110065,1.31469 -0.280812,0.45437 0.149946,1.07958 0.957242,1.38937 0.807295,0.30979 1.841088,-0.10376 2.297317,-0.91899 0.806751,-1.44159 4.470401,-1.52101 5.864283,-0.12713 1.129918,1.12992 6.359103,0.78704 6.359103,-0.41697 0,-0.72573 1.296871,-0.89459 3.75,-0.48827 2.0625,0.34163 4.9875,0.60871 6.5,0.59352 1.5125,-0.0152 2.75,0.42954 2.75,0.98828 0,0.55873 0.803096,1.01588 1.784659,1.01588 2.869411,0 13.37215,-3.97819 16.037181,-6.0745 2.772487,-2.18084 9.755771,-2.63163 10.464173,-0.6755 0.361196,0.99738 0.885716,0.99414 2.595416,-0.016 1.240143,-0.73273 3.253559,-0.98722 4.779806,-0.60416 1.655534,0.41552 2.407123,0.2898 2.019275,-0.33775 -1.929152,-3.12143 10.873812,-3.91036 14.226062,-0.87662 1.225,1.10861 3.55034,1.68825 6.73239,1.67821 8.5443,-0.027 11.73324,0.54789 12.81172,2.3095 0.80708,1.31831 0.63152,2.02457 -0.76052,3.05941 -1.22844,0.91322 -1.448,1.56906 -0.68347,2.04157 0.61951,0.38287 1.72214,-0.11862 2.4503,-1.11443 1.13474,-1.55185 1.70352,-1.63761 3.98052,-0.60014 2.98235,1.35885 6.56249,1.60488 6.56249,0.45098 0,-0.4177 0.94889,-1.35205 2.10864,-2.07632 1.69871,-1.06087 2.68869,-1.07661 5.09236,-0.081 2.40303,0.99537 3.13947,0.98388 3.78403,-0.059 0.98283,-1.59026 5.70571,-0.59778 8.3055,1.74535 1.64901,1.4862 2.01688,1.48005 4.65429,-0.0779 1.59671,-0.94321 5.00771,-1.70574 7.70947,-1.72347 2.66514,-0.0175 5.70597,-0.68281 6.7574,-1.47847 1.13486,-0.85881 2.89456,-1.19999 4.33043,-0.83961 1.59136,0.39941 3.33192,-0.0626 5.08831,-1.35055 4.74695,-3.48098 17.6992,-9.29926 20.72612,-9.31039 1.6189,-0.006 5.07212,-0.65678 7.67383,-1.44627 4.31128,-1.30826 4.81476,-1.28515 5.68275,0.26083 0.8902,1.58553 0.99638,1.58202 1.62661,-0.0537 0.4605,-1.19524 1.761,-1.75 4.10243,-1.75 3.39851,0 7.78682,-2.07892 10.01534,-4.74467 1.81686,-2.17333 17.03535,-1.71962 16.59249,0.49467 -0.1375,0.6875 0.2,1.25 0.75,1.25 0.55,0 1,-0.9 1,-2 0,-1.1 0.6382,-2 1.41821,-2 0.78002,0 2.09523,-0.25979 2.92268,-0.57732 0.83681,-0.32111 2.46876,0.38697 3.67734,1.59555 l 2.17287,2.17287 -2.77265,2.89402 c -1.52495,1.59171 -2.48891,3.17776 -2.14212,3.52455 0.88655,0.88655 4.84734,-0.23597 7.22367,-2.04724 1.70208,-1.29734 1.78087,-1.66812 0.52896,-2.48905 -0.80907,-0.53055 -1.25907,-1.13684 -1,-1.34731 4.76073,-3.86769 8.20952,-5.55493 12.22049,-5.9786 2.6122,-0.27592 5.48876,-1.11524 6.39234,-1.86515 2.2398,-1.85886 27.41766,-6.77994 34.97794,-6.83652 3.49086,-0.0261 8.80909,0.81335 12.38027,1.9542 7.57953,2.42137 8.77913,2.45576 12.95708,0.37152 2.34334,-1.16901 4.76867,-1.47321 8.59609,-1.07819 3.88191,0.40065 5.64675,0.1707 6.49024,-0.84564 2.35053,-2.83221 19.49685,0.11782 23.78261,4.09181 2.32209,2.15316 2.75536,2.24433 4.24769,0.89379 1.15021,-1.04093 4.85815,-1.67808 12.04406,-2.06957 9.04193,-0.49262 11.06476,-0.29442 15.66925,1.53532 2.90786,1.15553 5.94926,2.10096 6.75866,2.10096 0.8094,0 3.33526,1.35 5.61302,3 2.44481,1.77101 5.41132,3.009 7.24134,3.02196 1.70498,0.0121 5.0616,0.91208 7.45916,2 5.34409,2.42494 8.89195,2.51322 11.35677,0.28259 1.5955,-1.44391 2.49733,-1.53013 6.07874,-0.58117 2.31291,0.61286 6.00529,1.00191 8.20529,0.86456 2.2,-0.13735 5.1586,0.31993 6.57466,1.01618 2.18435,1.07399 2.97681,1.00209 5.22743,-0.47429 2.10862,-1.38324 3.83684,-1.60625 8.42533,-1.08721 4.7291,0.53494 6.19764,0.32371 8.12403,-1.16854 2.17618,-1.68575 6.69595,-2.97741 11.61596,-3.31961 2.43522,-0.16937 14.642,-5.78413 18.41345,-8.46964 2.00043,-1.42442 3.13617,-1.6548 4.47216,-0.90715 1.29576,0.72515 2.25463,0.5998 3.46887,-0.45345 0.92296,-0.80059 3.02811,-1.77315 4.67811,-2.16124 1.65,-0.3881 4.125,-1.7661 5.5,-3.06222 1.375,-1.29611 4.84795,-3.27672 7.71767,-4.40134 2.86972,-1.12462 7.77057,-3.40706 10.89077,-5.0721 4.10781,-2.19205 7.03197,-3.02733 10.59807,-3.02733 2.70874,0 5.89963,-0.52162 7.09088,-1.15916 1.19125,-0.63754 4.96036,-1.28723 8.37581,-1.44375 4.79461,-0.21974 8.18224,-1.21297 14.86404,-4.35805 4.75978,-2.2404 10.52358,-4.50102 12.80845,-5.0236 2.28487,-0.52257 6.62931,-1.8246 9.65431,-2.8934 3.025,-1.06879 7.6375,-2.25958 10.25,-2.6462 l 4.75,-0.703 0,131.61355 0,131.61354 -320.02995,0 -320.02995969,0 0.27995389,-96.25 z M 634.84405,-197.06545 c -0.81852,-1.58284 -3.93901,-4.50464 -6.93443,-6.49288 -2.99542,-1.98825 -7.32765,-5.7557 -9.62718,-8.37211 -2.29952,-2.61641 -5.04058,-5.08011 -6.09124,-5.47489 -1.05066,-0.39477 -1.91029,-1.53214 -1.91029,-2.52749 0,-2.88699 -2.75949,-6.04299 -5.88375,-6.7292 -1.58469,-0.34805 -4.09749,-1.99784 -5.584,-3.66619 -2.09948,-2.35631 -3.24766,-2.8966 -5.14411,-2.42062 -1.82408,0.45782 -3.44603,-0.19461 -6.41476,-2.58035 -2.18536,-1.7562 -3.97338,-3.82281 -3.97338,-4.59246 0,-0.76964 -1.125,-2.8743 -2.5,-4.67702 -1.375,-1.80272 -2.5,-3.99237 -2.5,-4.86589 0,-0.87352 -0.9,-1.87387 -2,-2.223 -1.1,-0.34913 -2,-1.27945 -2,-2.06739 0,-0.78793 -0.91412,-1.43261 -2.03138,-1.43261 -2.52749,0 -3.46356,-2.20668 -2.05361,-4.84119 0.79417,-1.48393 0.74969,-2.12646 -0.173,-2.49919 -0.68311,-0.27595 14.62846,-0.53725 34.0257,-0.58067 l 35.26771,-0.0789 -0.0868,34.5 c -0.0727,28.92524 -0.31383,34.5 -1.49203,34.5 -0.7729,0 -2.07497,-1.29505 -2.89349,-2.8779 z"
         style="fill:#495065"
         inkscape:connector-curvature="0" />
      <path
         id="path5058"
         d="m -0.71909191,145.01684 0,-71.79562 3.75000001,-0.23527 c 2.0625,-0.1294 4.4547193,-0.45043 5.316043,-0.71339 0.8613236,-0.26296 3.9786129,-0.0206 6.9273089,0.53863 4.684502,0.8884 5.622905,0.78428 7.433957,-0.82484 4.898623,-4.3524 11.543834,-7.30185 15.157437,-6.72756 1.942774,0.30876 4.398512,0.0978 5.457195,-0.46879 2.634288,-1.40982 18.015706,-1.97879 20.346335,-0.75262 1.038552,0.54639 3.156297,1.08123 4.706099,1.18853 2.129329,0.14741 2.917442,-0.30685 3.225541,-1.85919 0.303118,-1.52724 0.442658,-1.34875 0.543902,0.69573 0.136755,2.76157 2.371944,3.79558 3.668806,1.69721 0.357862,-0.57903 1.171919,-0.86484 1.809017,-0.63512 0.637097,0.22971 1.983293,-0.007 2.991546,-0.52692 1.312231,-0.67615 2.331619,-0.4935 3.587114,0.6427 1.826322,1.6528 7.539868,1.25461 8.689536,-0.60559 0.333291,-0.53928 1.102411,-0.47606 1.860269,0.15291 2.396299,1.98875 11.894886,3.90319 15.535606,3.13119 1.92186,-0.40751 4.16929,-0.40601 4.99429,0.003 0.825,0.40936 2.2875,0.98801 3.25,1.2859 0.9625,0.29788 1.75,1.45573 1.75,2.573 0,2.95975 3.4311,2.57539 4.85219,-0.54356 0.64527,-1.41621 0.91594,-2.99121 0.6015,-3.5 -0.31445,-0.50878 -0.20767,-0.96256 0.23729,-1.00839 4.57402,-0.47115 5.58207,-0.7265 6.1509,-1.55808 0.94154,-1.37645 10.0711,-7.35859 11.23021,-7.35859 1.71269,0 13.63061,-5.70995 14.35108,-6.87569 0.38218,-0.61837 1.60045,-1.12431 2.70728,-1.12431 1.10682,0 2.66505,-0.65264 3.46272,-1.45031 1.07155,-1.07156 2.79129,-1.29149 6.58513,-0.84217 3.45321,0.40899 4.92349,0.2662 4.48951,-0.436 -1.28934,-2.08619 10.3163,-3.20577 13.33219,-1.28613 1.17678,0.74902 0.7952,1.09678 -1.77081,1.61384 -1.79894,0.3625 -3.48689,1.00872 -3.751,1.43605 -0.2641,0.42733 -1.37973,0.54172 -2.47919,0.25421 -3.00328,-0.78538 -2.41432,0.29071 1.47458,2.69418 2.76858,1.71108 4.3538,2.0148 7.81041,1.49645 3.45162,-0.5176 5.65123,-0.0984 10.77642,2.0537 4.28029,1.79733 8.54735,2.7768 12.7255,2.92102 3.45724,0.11933 6.80974,0.74081 7.45,1.38107 1.63482,1.63482 4.76409,1.45143 4.76409,-0.27921 0,-0.79381 -0.89862,-2.07271 -1.99694,-2.84201 -1.09832,-0.76929 -2.47202,-2.7615 -3.05267,-4.42714 -0.7448,-2.13655 -1.99532,-3.29791 -4.24618,-3.94345 -4.38427,-1.25739 -4.9388,-4.3441 -0.78041,-4.3441 2.10449,0 4.28921,1.10109 6.94452,3.5 4.14806,3.74753 6.13168,4.4007 6.13168,2.01905 0,-1.87622 4.16085,-2.95663 7.75,-2.01239 1.5125,0.39792 6.59391,0.8153 11.29201,0.92753 6.7072,0.16022 9.39219,0.68078 12.5,2.42347 3.6609,2.05283 4.25823,2.11555 7.95799,0.83561 2.81706,-0.97456 4.09674,-2.03808 4.3271,-3.59617 0.17991,-1.2168 0.62991,-2.04585 1,-1.84232 0.3701,0.20352 2.58082,1.24195 4.91273,2.30763 2.33191,1.06567 4.24441,2.21884 4.25,2.56259 0.006,0.34375 -1.33983,0.895 -2.98983,1.225 -2.39959,0.47992 -3,1.11441 -3,3.17031 0,2.42382 0.21373,2.53173 3.75,1.89338 2.0625,-0.37232 4.428,-1.02494 5.25667,-1.45028 2.59858,-1.33377 20.35474,-0.0706 21.57483,1.53487 0.59482,0.7827 2.23723,1.8625 3.64979,2.39956 2.60558,0.99064 3.45999,0.85373 15.53422,-2.48919 4.73164,-1.31002 7.05734,-1.49234 9.5,-0.74475 3.8252,1.17074 6.83337,0.15035 11.7044,-3.97023 2.32956,-1.97065 3.63199,-2.49177 4.37376,-1.75 1.89706,1.89706 2.91781,1.11371 2.33645,-1.79306 -0.51853,-2.59266 -0.31044,-2.85676 2.30961,-2.93125 1.58372,-0.045 3.40417,0.55034 4.04546,1.32305 0.998,1.20251 1.60026,1.18035 4.1803,-0.15384 2.00545,-1.03706 3.34832,-1.22476 4.01228,-0.5608 1.48113,1.48113 -0.004,3.17223 -2.78679,3.17223 -3.34464,0 -3.12755,2.6356 0.2706,3.2852 1.82546,0.34896 3.10591,-0.0209 3.91824,-1.13185 1.95264,-2.6704 2.80323,-0.46321 0.92574,2.40221 -2.21929,3.38705 -1.44866,4.05506 2.10768,1.827 1.56022,-0.97748 2.93141,-1.82059 3.0471,-1.87357 0.11568,-0.053 -0.0493,-1.08918 -0.36663,-2.30266 -0.3218,-1.23021 -1.3626,-2.20599 -2.35335,-2.20599 -1.47273,0 -2.99036,-1.81779 -2.99036,-3.58179 0,-0.23001 1.37958,-0.41821 3.06574,-0.41821 3.07276,0 6.92991,-1.53071 8.01164,-3.17941 0.31755,-0.484 1.73459,0.0303 3.14897,1.14282 2.3637,1.85928 2.80207,1.9026 5.42262,0.53586 1.56807,-0.81782 4.98853,-1.48972 7.60103,-1.49311 3.55282,-0.005 4.75,-0.38422 4.75,-1.50616 0,-1.6482 5.46694,-2.17153 6.42869,-0.61539 0.30069,0.48654 2.68975,1.20365 5.30901,1.59359 2.61927,0.38993 5.2316,1.09461 5.80518,1.56594 1.06345,0.87387 8.54907,-1.11659 13.78816,-3.66634 1.55707,-0.75779 5.15707,-1.36283 8,-1.34453 l 5.16896,0.0333 -2.39166,1.99173 c -1.31542,1.09546 -2.13683,2.24657 -1.82536,2.55804 0.94604,0.94605 4.06433,-0.45256 6.92338,-3.10527 1.48849,-1.38107 3.64834,-2.51104 4.79966,-2.51104 1.15131,0 3.46157,-0.70756 5.1339,-1.57235 1.67233,-0.8648 3.60881,-1.35431 4.30328,-1.08782 0.69448,0.2665 1.99946,-0.37594 2.89996,-1.42764 0.9005,-1.05171 2.48671,-1.91219 3.52493,-1.91219 1.76241,0 6.69103,-1.89898 10.13191,-3.9038 0.825,-0.48069 3.975,-2.11265 7,-3.6266 3.025,-1.51394 6.85,-3.72717 8.5,-4.91828 1.65,-1.19112 5.25,-3.32337 8,-4.73834 2.75,-1.41497 7.81305,-4.44163 11.25121,-6.72591 6.70563,-4.45515 26.10376,-14.08656 28.37364,-14.08786 0.75633,-4.3e-4 4.22805,-1.35043 7.71494,-3 3.48688,-1.6496 6.81941,-2.99924 7.40561,-2.99924 0.5862,0 2.45829,-1.05365 4.16021,-2.34145 1.70191,-1.2878 4.25229,-2.62639 5.66749,-2.97465 1.41521,-0.34827 4.24769,-1.76961 6.29441,-3.15855 2.04672,-1.38894 4.26382,-2.54062 4.9269,-2.55928 0.66307,-0.0187 3.00559,-0.90339 5.20559,-1.96607 2.2,-1.06268 4.58424,-1.94741 5.29831,-1.96607 1.27528,-0.0333 2.45527,-0.57923 14.8956,-6.89125 3.40665,-1.72847 6.84026,-3.14268 7.63024,-3.14268 1.19678,0 11.43174,-2.97342 23.92585,-6.95083 l 2.75,-0.87544 0,130.91313 0,130.91314 -320,0 -320.00000191,0 0,-71.79561 z M 610.75975,143.64014 c 2.88993,-1.31674 2.82752,-3.49484 -0.0865,-3.01808 -1.0408,0.17029 -3.46737,0.29059 -5.39237,0.26735 -1.925,-0.0232 -5.075,-0.0594 -7,-0.0803 -1.925,-0.0209 -4.69667,-0.51641 -6.15927,-1.10109 -1.93321,-0.7728 -3.25942,-0.74186 -4.85736,0.11333 -3.57333,1.91239 -0.9865,3.00122 7.75736,3.26516 4.46134,0.13467 8.44477,0.5781 8.85206,0.9854 1.08469,1.08469 3.95244,0.90487 6.88605,-0.43177 z m -112.97884,-4.77093 c 1.68257,-0.67528 1.314,-0.99076 -2.32217,-1.98769 -4.83058,-1.32442 -10.67783,-1.09381 -10.67783,0.42111 0,1.89403 9.3705,3.02323 13,1.56658 z m -19.5,-2.05676 c 0,-0.55 -0.675,-1 -1.5,-1 -0.825,0 -1.5,0.45 -1.5,1 0,0.55 0.675,1 1.5,1 0.825,0 1.5,-0.45 1.5,-1 z m -338,-45 c 0,-0.55 1.125,-1 2.5,-1 4.15953,0 2.80604,-1.77276 -2.16256,-2.83246 -5.15523,-1.0995 -9.33744,-0.097 -9.33744,2.23816 0,0.80036 1.0125,1.65021 2.25,1.88857 4.2338,0.81546 6.75,0.70577 6.75,-0.29427 z m 257.41247,-0.60478 c 0.86682,-0.33264 1.37344,-0.93261 1.12581,-1.33327 -0.61858,-1.0009 -6.53828,-0.04883 -6.53828,1.05155 0,1.01559 3.08199,1.176 5.41247,0.28172 z m -238.9081,-1.40228 c 0.34231,-0.55389 -0.10054,-1.28448 -0.98412,-1.62354 -1.91464,-0.73472 -2.98171,0.0749 -2.06137,1.56407 0.83038,1.34358 2.23491,1.37101 3.04549,0.0595 z m -36.78033,-2.38364 c 1.0725,-1.07251 -1.01808,-2.60841 -3.53306,-2.59565 -5.87753,0.0298 -9.416,2.20251 -5.44098,3.34086 1.90568,0.54574 8.20629,0.0225 8.97404,-0.74521 z m 102.04679,-2.7968 c -0.61807,-1.85422 -2.77083,-2.16176 -2.77083,-0.39583 0,0.87083 0.7125,1.58333 1.58333,1.58333 0.87084,0 1.40521,-0.53438 1.1875,-1.1875 z m 78.72917,-1.8125 c 0.33992,-0.55 -0.0835,-1 -0.94098,-1 -0.85746,0 -1.55902,0.45 -1.55902,1 0,0.55 0.42344,1 0.94098,1 0.51754,0 1.2191,-0.45 1.55902,-1 z m 9.93524,0.10478 c 0.3043,-0.49236 -0.15595,-1.16736 -1.02277,-1.5 -2.22879,-0.85526 -2.41247,-0.7871 -2.41247,0.89522 0,1.62192 2.53121,2.06754 3.43524,0.60478 z M 193.28091,81.41944 c 0,-0.76616 -0.675,-1.65203 -1.5,-1.96862 -1.67693,-0.64349 -1.75966,-0.4786 -0.89301,1.77984 0.7497,1.95369 2.39301,2.08332 2.39301,0.18878 z m 59.72917,-0.21116 c -0.3323,-0.33229 -1.1948,-0.36781 -1.91667,-0.0789 -0.79773,0.31922 -0.56078,0.55618 0.60417,0.60416 1.05416,0.0434 1.64479,-0.19293 1.3125,-0.52522 z m -60.72917,-6.00282 c 0,-2.07843 -1.69117,-1.68199 -2.27018,0.53217 -0.35318,1.35055 -0.0895,1.76634 0.88336,1.39301 0.76275,-0.29269 1.38682,-1.15902 1.38682,-1.92518 z m 80.72917,-17.99718 c -0.33229,-0.33229 -1.1948,-0.36781 -1.91667,-0.0789 -0.79773,0.31922 -0.56078,0.55618 0.60417,0.60416 1.05416,0.0434 1.64479,-0.19293 1.3125,-0.52522 z m 118.27083,-4.39583 c 0,-0.55 -0.675,-1 -1.5,-1 -0.825,0 -1.5,0.45 -1.5,1 0,0.55 0.675,1 1.5,1 0.825,0 1.5,-0.45 1.5,-1 z m 21,-6 c 0,-0.55 -0.45,-1 -1,-1 -0.55,0 -1,0.45 -1,1 0,0.55 0.45,1 1,1 0.55,0 1,-0.45 1,-1 z m -307.75,17.33772 c -0.6875,-0.27741 -1.25,-0.91689 -1.25,-1.42105 0,-1.45023 2.63069,-1.06658 4,0.58333 1.00425,1.21005 0.9796,1.48474 -0.12756,1.42105 -0.75484,-0.0434 -1.93494,-0.30592 -2.62244,-0.58333 z m 225.91464,-12.66247 -2.18536,-2.3262 2.26036,-1.12149 c 2.67609,-1.32776 14.97128,-1.21516 15.91784,0.14577 0.36161,0.51992 0.42597,1.54861 0.14301,2.28599 -0.62112,1.6186 -7.42762,1.81355 -8.98386,0.25731 -0.77783,-0.77783 -1.63097,-0.4956 -3.02501,1.00072 l -1.94163,2.0841 -2.18535,-2.3262 z m -34.61218,-0.21174 c -1.07115,-0.81009 -2.75865,-1.21545 -3.75,-0.90081 -3.06809,0.97377 -1.98629,-0.38163 1.70119,-2.13146 1.92701,-0.91442 4.40677,-1.42642 5.51058,-1.13777 1.1038,0.28865 3.2965,0.0381 4.87266,-0.55688 2.14913,-0.8112 3.64686,-0.75815 5.98943,0.21218 3.66334,1.5174 4.05625,2.81797 0.87368,2.89197 -5.3175,0.12363 -9.97171,0.98097 -11.02086,2.03012 -1.42865,1.42865 -1.79644,1.39277 -4.17668,-0.40735 z m -12.21913,-1.87893 c 0,-1.28485 4.46954,-4.11505 5.25623,-3.32835 0.18211,0.18211 0.0715,1.32396 -0.24585,2.53744 -0.65008,2.48589 -5.01038,3.17418 -5.01038,0.79091 z M 197.3486,48.85428 c -0.62449,-0.38595 -0.85533,-1.43166 -0.51299,-2.32379 0.62909,-1.63937 7.49967,-3.24155 10.99502,-2.56398 2.68942,0.52135 2.84309,2.52193 0.24209,3.15179 -1.2605,0.30525 -3.93361,0.97861 -5.94025,1.49636 -2.00664,0.51775 -4.15939,0.62558 -4.78387,0.23962 z m 67.93231,-0.4585 c 0,-0.87083 0.7125,-1.58333 1.58333,-1.58333 0.87084,0 1.40521,0.53437 1.1875,1.1875 -0.61807,1.85422 -2.77083,2.16176 -2.77083,0.39583 z m 55,-0.15288 c 0,-1.04234 0.72946,-1.46221 2.17167,-1.25 3.2015,0.47108 3.54438,2.81955 0.41166,2.81955 -1.6805,0 -2.58333,-0.54853 -2.58333,-1.56955 z m 27,-1.36306 c 0,-1.95192 3.20759,-3.67516 4.89717,-2.63094 0.50329,0.31105 0.67983,1.46509 0.39232,2.56455 -0.71461,2.73266 -5.28949,2.79008 -5.28949,0.06639 z M 170.47258,44.73745 c 0.19708,-0.59125 0.78583,-1.075 1.30833,-1.075 0.5225,0 1.11125,0.48375 1.30833,1.075 0.19709,0.59125 -0.39166,1.075 -1.30833,1.075 -0.91667,0 -1.50542,-0.48375 -1.30833,-1.075 z"
         style="fill:#3c434b"
         inkscape:connector-curvature="0" />
      <path
         id="path5056"
         d="m -0.71909191,145.96435 0,-70.8481 9.75000001,0.29933 c 5.3624999,0.16463 10.6499999,0.35545 11.7499999,0.42405 3.957521,0.24679 13.439787,-0.92459 15.226944,-1.88104 1.124041,-0.60157 2.454057,-0.62435 3.463707,-0.0593 0.901452,0.50448 5.839832,1.14456 10.974177,1.4224 6.287131,0.34023 13.579821,1.66784 22.335172,4.06605 7.15,1.95848 15.829553,3.96487 19.287896,4.45865 3.458342,0.49378 7.508344,1.51 9.000006,2.25827 16.47806,8.26597 21.86038,11.26063 24.95528,13.88482 2.93413,2.48787 3.79177,2.70137 9,2.24049 3.16625,-0.28019 7.33182,-0.607 9.25682,-0.72625 1.925,-0.11924 4.50327,-0.78445 5.72948,-1.47823 1.22621,-0.69378 3.28414,-0.99672 4.57317,-0.6732 1.28903,0.32353 6.81076,0.73559 12.27052,0.91569 14.08467,0.46462 31.04955,2.27221 33.46674,3.56585 1.1307,0.60513 2.47315,2.19788 2.98321,3.53944 0.60557,1.59277 1.71674,2.44296 3.20213,2.45002 2.46761,0.0117 10.38944,2.24039 13.40311,3.7707 1.0294,0.52271 3.33414,1.46071 5.12164,2.08444 1.7875,0.62372 4.61145,1.68702 6.27544,2.36288 3.41673,1.38777 5.77267,0.4564 7.5136,-2.97034 2.94883,-5.80432 7.08986,-7.00001 9.8188,-2.83512 1.40637,2.1464 1.9137,2.3004 4.43866,1.34733 3.99494,-1.50792 7.41179,-0.34511 9.40699,3.20134 1.20309,2.13849 2.45551,3.02795 4.26357,3.02795 1.40804,0 3.34147,0.39645 4.29651,0.881 2.84438,1.44313 14.40222,3.84886 19.23643,4.00401 2.475,0.0794 6.56596,0.65454 9.09103,1.27801 5.12234,1.26478 9.90897,0.51138 9.90897,-1.55963 0,-0.74717 0.64267,-1.89187 1.42817,-2.54377 1.68785,-1.4008 7.20512,1.01035 9.38791,4.10268 0.72385,1.02546 3.04282,2.74539 5.15328,3.82207 2.11045,1.07667 5.16007,3.56247 6.77693,5.524 3.27925,3.9783 9.07761,5.7126 11.73251,3.50922 0.82265,-0.68274 2.25298,-0.95076 3.17852,-0.5956 0.92553,0.35516 2.02196,0.0969 2.43651,-0.57382 0.59181,-0.95756 1.06844,-0.95838 2.21863,-0.004 1.31893,1.09462 5.08522,0.75259 10.18754,-0.92515 0.55,-0.18085 3.99706,-0.003 7.66014,0.39464 4.81452,0.52297 7.86278,0.32115 11,-0.72828 2.38692,-0.79845 8.40387,-1.68053 13.371,-1.96018 11.60845,-0.65356 14.72338,-1.76311 13.92131,-4.95883 -0.79467,-3.1662 3.75948,-5.29687 7.93138,-3.71072 3.4843,1.32473 9.50541,0.39062 12.61854,-1.95762 2.04668,-1.54381 2.20471,-2.04377 1.07589,-3.40391 -1.64426,-1.98121 -2.95704,-2.01398 -5.04335,-0.12589 -1.82351,1.65025 -6.94649,2.3223 -8.82984,1.15833 -1.98344,-1.22583 -0.63716,-2.18887 3.44418,-2.46373 2.08434,-0.14037 4.09308,-0.74609 4.46386,-1.34603 0.41187,-0.66641 1.78545,-0.81086 3.53052,-0.37127 1.571,0.39574 3.98137,0.64648 5.35637,0.5572 1.375,-0.0893 6.8875,-0.21221 12.25,-0.27318 8.68311,-0.0987 9.75,-0.30793 9.75,-1.91182 0,-0.99053 -0.9,-2.36302 -2,-3.04998 -2.63144,-1.64336 -2.5547,-2.06657 1.13714,-6.27135 4.49612,-5.12079 6.15164,-5.78995 10.84532,-4.38369 3.51375,1.05275 4.30606,1.90651 6.88633,7.42041 l 2.91574,6.23079 5.85773,1.16509 c 12.32037,2.45049 16.47371,2.8662 24.04392,2.40656 4.2976,-0.26093 12.31382,-0.55572 17.81382,-0.65508 5.83534,-0.10542 10.90967,-0.70124 12.18426,-1.43066 1.20134,-0.6875 3.52704,-1.25 5.16821,-1.25 3.90626,0 6.14753,-0.90793 6.14753,-2.49036 0,-0.70201 -0.9,-1.51173 -2,-1.79939 -2.34887,-0.61424 -2.61109,-3.37753 -0.53789,-5.66839 1.53799,-1.69929 1.05103,-6.0417 -0.67753,-6.0417 -0.54019,0 -2.28052,1.3899 -3.8674,3.08866 -3.15809,3.38074 -5.24409,3.42817 -5.73054,0.13029 -0.17234,-1.16841 -1.18484,-2.40099 -2.25,-2.73906 -2.46885,-0.78358 -2.46978,-2.1242 -0.002,-3.44471 2.47996,-1.32723 6.06574,-1.33677 6.06574,-0.0161 0,1.0651 5.09117,0.21999 6,-0.99596 0.75526,-1.0105 4.36552,-2.37568 5.5,-2.07978 0.55,0.14346 2.72141,0.4343 4.82535,0.64631 2.10394,0.21202 4.21886,0.62869 4.69983,0.92594 0.48096,0.29725 1.31963,-0.29132 1.86371,-1.30794 0.80637,-1.50673 0.46019,-2.16091 -1.8728,-3.53904 -1.7149,-1.01302 -3.12515,-2.88865 -3.51851,-4.67961 -0.36145,-1.64396 -1.29612,-2.989 -2.07742,-2.989 -1.63344,0 -1.90015,1.58555 -0.42054,2.5 1.69982,1.05054 1.10795,3.38324 -1.25,4.92658 -1.2375,0.80998 -4.78709,1.66264 -7.88798,1.8948 -3.10089,0.23217 -6.07563,0.6926 -6.61052,1.02319 -1.28134,0.79191 -2.2515,-0.25426 -2.2515,-2.4279 0,-0.9625 -0.39527,-1.9 -0.87838,-2.08334 -1.42084,-0.53919 0.66359,-4.83333 2.34616,-4.83333 0.84272,0 1.53222,-0.50008 1.53222,-1.11129 0,-0.72845 1.20576,-0.88509 3.5,-0.45469 3.0732,0.57654 3.5,0.40719 3.5,-1.38871 0,-1.12492 -0.50625,-1.93281 -1.125,-1.79531 -0.61875,0.1375 -1.32245,-0.2861 -1.56378,-0.94134 -0.37894,-1.02888 4.22612,-4.20065 6.4283,-4.42753 0.41826,-0.0431 1.54798,-0.49981 2.51048,-1.01493 1.14281,-0.61161 1.75,-0.5774 1.75,0.0986 0,0.56935 1.52686,1.03518 3.39301,1.03518 3.5718,0 4.60699,-1.24148 4.60699,-5.52508 0,-3.29705 3.42605,-5.44232 7.60778,-4.76372 2.53991,0.41217 3.39222,0.18889 3.39222,-0.88868 0,-1.03754 1.07654,-1.3842 3.85767,-1.2422 4.81749,0.24597 7.81125,1.80118 8.66889,4.50336 0.5415,1.70612 1.14544,1.95078 3.31772,1.34404 1.46065,-0.40797 3.7204,-0.82027 5.02167,-0.91623 2.4445,-0.18027 4.66428,-2.84455 3.68718,-4.42553 -0.30532,-0.49401 -1.45707,-0.66234 -2.55945,-0.37406 -1.10238,0.28828 -2.68707,-0.0425 -3.52154,-0.73502 -1.35538,-1.12487 -1.35236,-1.51075 0.0284,-3.61802 1.5087,-2.30256 1.47203,-2.35886 -1.53648,-2.35886 -2.00405,0 -2.84208,-0.38832 -2.39593,-1.11021 0.40488,-0.65511 2.09096,-0.88224 4.11311,-0.55409 4.47112,0.72556 7.1969,-1.81148 6.97629,-6.49321 -0.0866,-1.83837 -0.51816,-3.60835 -0.95895,-3.9333 -1.20349,-0.88719 5.60581,-0.47295 7.05144,0.42897 0.6875,0.42893 1.71971,0.48958 2.2938,0.13477 0.5741,-0.35481 1.74779,-0.0609 2.60822,0.65323 2.17946,1.8088 4.34798,-1.28853 4.34798,-6.2103 0,-3.87379 2.55009,-6.25188 3.64484,-3.399 0.82628,2.15332 2.35514,1.8178 2.35514,-0.51684 0,-3.56902 1.95837,-2.11251 2.60612,1.93827 1.05058,6.56994 5.39388,6.67072 5.39388,0.12516 0,-4.43448 1.93706,-6.53557 5.09988,-5.53173 1.98549,0.63017 2.14118,0.42254 1.62525,-2.16738 -0.33204,-1.66678 -0.02,-3.61541 0.74636,-4.6608 0.72433,-0.98806 1.08708,-2.67556 0.80611,-3.75 -0.28157,-1.07671 -0.01,-1.95352 0.60577,-1.95352 0.61415,0 1.11663,0.9 1.11663,2 0,1.40287 0.67177,2.00457 2.25,2.01531 1.86331,0.0127 1.99221,0.19763 0.75,1.07613 -1.12881,0.79831 -1.19068,1.18633 -0.25,1.56802 0.9706,0.39384 1.25,9.4138 1.25,40.35432 l 0,39.84712 -2.25,0.31955 c -1.2375,0.17575 -2.25,0.99455 -2.25,1.81955 0,0.825 1.0125,1.6438 2.25,1.81955 l 2.25,0.31955 0,53.93045 0,53.93045 -320,0 -320.00000191,0 0,-70.8481 z M 381.03091,163.82819 c 7.03307,-3.18527 8.84153,-5.19104 5.75,-6.37737 -0.825,-0.31658 -1.5,-1.4594 -1.5,-2.5396 0,-1.97808 -0.80262,-2.40657 -6.75,-3.60357 -3.64986,-0.73459 -4.29115,-2.41017 -1.22892,-3.21096 2.96806,-0.77617 0.861,-2.80304 -4.58582,-4.41129 -2.46566,-0.72803 -5.79137,-2.51867 -7.39045,-3.9792 l -2.90742,-2.65552 -3.27782,1.99337 -3.27783,1.99336 2.95913,1.53288 c 6.14573,3.18359 5.95438,6.0679 -0.60208,9.07574 -2.78367,1.27703 -5.28645,2.90883 -5.56173,3.62621 -0.27529,0.71739 -2.16024,1.58213 -4.18879,1.92165 -8.5715,1.43462 -7.94959,4.61856 0.90213,4.61856 4.78365,0 6.09654,0.34831 6.59622,1.75 1.29499,3.63265 2.30695,4.01187 10.08636,3.77978 6.28361,-0.18747 9.08132,-0.84389 14.97702,-3.51404 z m 26.63005,-16.82166 c 0.27395,-0.44325 -1.67463,-2.2283 -4.33018,-3.96677 -4.28809,-2.80722 -5.31614,-3.07756 -9.18906,-2.4164 -7.09839,1.21178 -5.72147,3.48531 2.89209,4.77532 3.9891,0.59743 7.5516,1.38493 7.91667,1.75 0.89926,0.89927 2.10596,0.83598 2.71048,-0.14215 z m 16.32935,-0.82087 c 0.48815,-1.4663 -2.02149,-2.4164 -3.6782,-1.39249 -0.70809,0.43762 -0.96282,1.3209 -0.56608,1.96285 0.8644,1.39862 3.71636,1.01537 4.24428,-0.57036 z m 187.74127,0.21127 c 3.88164,-1.62259 5.75689,-3.88002 4.95628,-5.96636 -0.88246,-2.29965 -4.90611,-3.06822 -8.42726,-1.60971 -2.25911,0.93576 -3.31836,0.95541 -4.37181,0.0811 -0.76467,-0.63462 -3.12676,-1.13929 -5.24909,-1.1215 -2.12234,0.0178 -4.98379,0.0162 -6.35879,-0.004 -5.86239,-0.0841 -13.88534,0.58664 -14.51159,1.21331 -1.02528,1.02595 7.39219,5.98954 12.50368,7.37315 5.95694,1.61245 17.63774,1.63069 21.45858,0.0335 z m -91.75267,-4.17709 c 0.20006,-0.60093 -1.50561,-2.38806 -3.79036,-3.9714 -4.00618,-2.77628 -4.79958,-2.91894 -22.28087,-4.00619 -9.96972,-0.62007 -18.67214,-0.92887 -19.3387,-0.68622 -1.49728,0.54506 -2.63773,3.88164 -1.7936,5.24747 0.34296,0.55492 2.32549,1.00895 4.40562,1.00895 2.08012,0 5.80858,0.6099 8.28545,1.35533 3.04304,0.91581 7.71559,1.20509 14.40893,0.89204 5.44804,-0.25481 11.48053,-3.1e-4 13.40553,0.56556 4.14173,1.21748 6.19916,1.09291 6.698,-0.40554 z m -97.13913,-7.87559 c 1.06762,-0.8075 2.95363,-1.4825 4.19113,-1.5 1.2375,-0.0175 2.25,-0.43668 2.25,-0.93153 0,-1.18458 -11.79487,-0.65883 -15,0.66862 l -2.5,1.03541 2.5,1.03446 c 3.57456,1.47911 6.32805,1.38035 8.55887,-0.30696 z m 160.1242,-24.6014 c 1.5473,-0.58829 3.56147,-1.74672 4.47595,-2.57431 1.53795,-1.39183 1.54107,-1.71658 0.0415,-4.32947 -1.29999,-2.26509 -2.5506,-2.94806 -6.31205,-3.44703 -2.66581,-0.35363 -4.92712,-1.23797 -5.23815,-2.04852 -0.7112,-1.85336 -8.56277,-4.0186 -9.86177,-2.7196 -0.60943,0.60943 -0.19185,1.49306 1.1496,2.43264 1.37168,0.96076 1.88034,2.06538 1.45795,3.16611 -0.45673,1.19021 0.72569,3.00746 3.99516,6.14016 4.95116,4.74405 5.89171,5.05294 10.29183,3.38002 z m 13.49814,-2.1804 c 4.05209,-3.23967 2.21906,-9.56925 -2.43309,-8.40163 -2.00318,0.50276 -2.44273,1.10345 -2.01219,2.74982 0.31054,1.18752 -0.0115,2.45411 -0.73825,2.90324 -1.77139,1.09478 -0.47888,3.99857 1.77981,3.99857 1.01214,0 2.54381,-0.5625 3.40372,-1.25 z m -7.18121,-13.75 c 0,-0.55 -1.125,-1 -2.5,-1 -1.375,0 -2.5,0.45 -2.5,1 0,0.55 1.125,1 2.5,1 1.375,0 2.5,-0.45 2.5,-1 z m -21.93426,-8.03518 c 1.06384,-0.56935 1.93426,-1.46935 1.93426,-2 0,-1.25296 -4.06656,-1.21873 -6,0.0505 -1.33333,0.87528 -1.33333,1.0941 0,1.96938 1.86609,1.22501 1.73849,1.22563 4.06574,-0.0199 z m 55.43426,-1.96482 c 0.33992,-0.55 -0.11008,-1 -1,-1 -0.88992,0 -1.33992,0.45 -1,1 0.33992,0.55 0.78992,1 1,1 0.21008,0 0.66008,-0.45 1,-1 z m -39.5,-6.39686 c 0,-0.75522 -1.11873,-2.10614 -2.48607,-3.00206 -2.34194,-1.53449 -2.60571,-1.5093 -4.54957,0.43456 l -2.0635,2.0635 -1.85504,-2.29088 c -1.77252,-2.18898 -1.94064,-2.21342 -3.77917,-0.54957 -1.05827,0.95772 -2.6762,1.74131 -3.59539,1.74131 -3.33984,0 -1.5705,1.88839 2.07874,2.21861 10.56768,0.95628 16.25,0.74106 16.25,-0.61547 z m -35.5,-1.60314 c 0.33992,-0.55 0.16803,-1 -0.38197,-1 -0.55,0 -1.27811,0.45 -1.61803,1 -0.33992,0.55 -0.16803,1 0.38197,1 0.55,0 1.27811,-0.45 1.61803,-1 z m 52.5,-24 c 0,-0.55 -0.45,-1 -1,-1 -0.55,0 -1,0.45 -1,1 0,0.55 0.45,1 1,1 0.55,0 1,-0.45 1,-1 z m 8.28888,-2.45614 c -0.19435,-2.64912 -1.64635,-4.49084 -3.57026,-4.52855 -1.56909,-0.0308 -1.95021,3.18344 -0.66273,5.58912 1.79908,3.36161 4.50763,2.68298 4.23299,-1.06057 z m 22.21112,-16.54386 c 0.33992,-0.55 0.14148,-1 -0.44098,-1 -0.58246,0 -1.05902,0.45 -1.05902,1 0,0.55 0.19844,1 0.44098,1 0.24254,0 0.7191,-0.45 1.05902,-1 z m -287.5,97.08333 c 0,-1.05416 0.5625,-2.11391 1.25,-2.35499 0.82531,-0.28941 0.40063,-1.1929 -1.25,-2.65931 l -2.5,-2.22097 2.5,0.60004 c 1.375,0.33003 3.7375,0.87046 5.25,1.20097 2.68825,0.58744 3.88471,2.35093 1.59501,2.35093 -0.69049,0 -0.48852,0.73643 0.50218,1.83115 2.13508,2.35923 1.23731,3.16885 -3.51386,3.16885 -3.11111,0 -3.83333,-0.36111 -3.83333,-1.91667 z m 14.66181,-0.26858 c -0.76012,-2.9067 0.006,-3.57551 1.91219,-1.66932 1.31833,1.31833 1.33173,1.68791 0.0983,2.71155 -1.1533,0.95715 -1.54011,0.75664 -2.01052,-1.04223 z m -30.08396,-5.81475 c -5.55341,-0.46887 -8.29038,-2.12886 -5.36249,-3.2524 1.65779,-0.63615 14.01669,1.17225 15.10467,2.21017 1.2123,1.15651 -3.02255,1.60956 -9.74218,1.04223 z m 70.17215,-5.39205 c -0.9625,-0.73064 -1.75,-1.61633 -1.75,-1.96819 0,-1.37953 3.90312,-0.53589 6.13922,1.32697 l 2.36078,1.96673 -2.5,0.001 c -1.375,8e-4 -3.2875,-0.59633 -4.25,-1.32698 z M 520.82055,90.46509 c -2.43919,-1.78358 -0.98793,-2.44148 4.17968,-1.89479 3.61353,0.38228 4.01861,0.64707 2.82143,1.84426 -1.76729,1.76729 -4.6251,1.78791 -7.00111,0.0505 z m 6.46036,-7.65264 c 0,-0.55 1.37656,-1 3.05902,-1 1.7847,0 2.80156,0.41658 2.44098,1 -0.33992,0.55 -1.71648,1 -3.05902,1 -1.34254,0 -2.44098,-0.45 -2.44098,-1 z"
         style="fill:#3c434b;fill-opacity:1"
         inkscape:connector-curvature="0" />
      <text
         inkscape:export-ydpi="90"
         inkscape:export-xdpi="90"
         inkscape:export-filename="/home/bcdlog/Images/Voyage/Voyage-Header.png"
         sodipodi:linespacing="125%"
         id="text4082-7"
         y="-167.12729"
         x="214.69493"
         style="font-size:31.54189682px;font-style:normal;font-variant:normal;font-weight:normal;font-stretch:normal;text-align:start;line-height:125%;writing-mode:lr-tb;text-anchor:start;fill:#1a1a1a;fill-opacity:1;stroke:none;font-family:Purisa;-inkscape-font-specification:Purisa"
         xml:space="preserve"><tspan
           y="-167.12729"
           x="214.69493"
           id="tspan5367"
           sodipodi:role="line">Carnet de voyage </tspan><tspan
           y="-127.69992"
           x="214.69493"
           id="tspan5369"
           sodipodi:role="line" /></text>
      <text
         id="text5115"
         y="155.02165"
         x="186.15585"
         style="font-size:29.59748077px;font-style:normal;font-weight:normal;fill:#fff6d5;fill-opacity:1;stroke:none;font-family:Bitstream Vera Sans"
         xml:space="preserve"><tspan
           y="155.02165"
           x="186.15585"
           id="tspan5117"
           sodipodi:role="line">voyage.bcdlog.com</tspan></text>
    </g>
  </g>
</svg>
