<?xml version="1.0" encoding="UTF-8" standalone="no"?>
<!-- Created with Inkscape (http://www.inkscape.org/) -->

<svg
   xmlns:dc="http://purl.org/dc/elements/1.1/"
   xmlns:cc="http://creativecommons.org/ns#"
   xmlns:rdf="http://www.w3.org/1999/02/22-rdf-syntax-ns#"
   xmlns:svg="http://www.w3.org/2000/svg"
   xmlns="http://www.w3.org/2000/svg"
   xmlns:xlink="http://www.w3.org/1999/xlink"
   xmlns:sodipodi="http://sodipodi.sourceforge.net/DTD/sodipodi-0.dtd"
   xmlns:inkscape="http://www.inkscape.org/namespaces/inkscape"
   width="210mm"
   height="297mm"
   id="svg2"
   version="1.1"
   inkscape:version="0.48.1 r9760"
   sodipodi:docname="logo1.svg.2011_02_20_17_34_12.0.svg">
  <defs
     id="defs4">
    <linearGradient
       id="linearGradient4183">
      <stop
         id="stop4185"
         offset="0"
         style="stop-color:#577fff;stop-opacity:1;" />
      <stop
         id="stop4187"
         offset="1"
         style="stop-color:#00196e;stop-opacity:1;" />
    </linearGradient>
    <linearGradient
       id="linearGradient4191">
      <stop
         id="stop4193"
         offset="0"
         style="stop-color:#000000;stop-opacity:1;" />
      <stop
         id="stop4195"
         offset="1"
         style="stop-color:#000000;stop-opacity:0;" />
    </linearGradient>
    <linearGradient
       id="linearGradient4199">
      <stop
         id="stop4201"
         offset="0"
         style="stop-color:#00be94;stop-opacity:1;" />
      <stop
         id="stop4203"
         offset="1"
         style="stop-color:#006952;stop-opacity:0.72164947;" />
    </linearGradient>
    <linearGradient
       id="linearGradient9224">
      <stop
         style="stop-color:#00a899;stop-opacity:1;"
         offset="0"
         id="stop9226" />
      <stop
         style="stop-color:#003433;stop-opacity:1;"
         offset="1"
         id="stop9228" />
    </linearGradient>
    <inkscape:perspective
       id="perspective3280"
       inkscape:persp3d-origin="259 : 172.66667 : 1"
       inkscape:vp_z="518 : 259 : 1"
       inkscape:vp_y="0 : 1000 : 0"
       inkscape:vp_x="0 : 259 : 1"
       sodipodi:type="inkscape:persp3d" />
    <inkscape:perspective
       sodipodi:type="inkscape:persp3d"
       inkscape:vp_x="0 : 526.18109 : 1"
       inkscape:vp_y="0 : 1000 : 0"
       inkscape:vp_z="744.09448 : 526.18109 : 1"
       inkscape:persp3d-origin="372.04724 : 350.78739 : 1"
       id="perspective3263" />
    <inkscape:perspective
       sodipodi:type="inkscape:persp3d"
       inkscape:vp_x="0 : 526.18109 : 1"
       inkscape:vp_y="0 : 1000 : 0"
       inkscape:vp_z="744.09448 : 526.18109 : 1"
       inkscape:persp3d-origin="372.04724 : 350.78739 : 1"
       id="perspective2390" />
    <inkscape:perspective
       id="perspective10"
       inkscape:persp3d-origin="372.04724 : 350.78739 : 1"
       inkscape:vp_z="744.09448 : 526.18109 : 1"
       inkscape:vp_y="0 : 1000 : 0"
       inkscape:vp_x="0 : 526.18109 : 1"
       sodipodi:type="inkscape:persp3d" />
    <radialGradient
       inkscape:collect="always"
       xlink:href="#linearGradient4183"
       id="radialGradient6248"
       gradientUnits="userSpaceOnUse"
       gradientTransform="matrix(0.9266596,1.0348884,-0.7153295,0.7607995,144.36026,364.43958)"
       cx="-304.19904"
       cy="232.99802"
       fx="-304.19904"
       fy="232.99802"
       r="173.54903" />
    <radialGradient
       inkscape:collect="always"
       xlink:href="#linearGradient4183"
       id="radialGradient4955"
       gradientUnits="userSpaceOnUse"
       gradientTransform="matrix(0.9266596,1.0348884,-0.7153295,0.7607995,144.36026,364.43958)"
       cx="-304.19904"
       cy="232.99802"
       fx="-304.19904"
       fy="232.99802"
       r="173.54903" />
  </defs>
  <sodipodi:namedview
     id="base"
     pagecolor="#ffffff"
     bordercolor="#666666"
     borderopacity="1.0"
     inkscape:pageopacity="0.0"
     inkscape:pageshadow="2"
     inkscape:zoom="2.8"
     inkscape:cx="271.17154"
     inkscape:cy="890.26333"
     inkscape:document-units="px"
     inkscape:current-layer="g6213"
     showgrid="false"
     inkscape:window-width="1680"
     inkscape:window-height="1026"
     inkscape:window-x="0"
     inkscape:window-y="24"
     inkscape:window-maximized="1" />
  <metadata
     id="metadata7">
    <rdf:RDF>
      <cc:Work
         rdf:about="">
        <dc:format>image/svg+xml</dc:format>
        <dc:type
           rdf:resource="http://purl.org/dc/dcmitype/StillImage" />
        <dc:title></dc:title>
      </cc:Work>
    </rdf:RDF>
  </metadata>
  <g
     inkscape:label="Calque 1"
     inkscape:groupmode="layer"
     id="layer1">
    <path
       id="path5148"
       d="m 186.41995,559.03555 c -2.15466,-0.38954 -4.91655,-0.89334 -6.13752,-1.11954 -2.36545,-0.43827 -11.53733,-2.05097 -14.36441,-2.52576 -0.93369,-0.15678 -2.5203,-0.45749 -3.52581,-0.66823 -1.00551,-0.21074 -2.0824,-0.43433 -2.39309,-0.49688 -0.70387,-0.14168 -5.4046,-6.02503 -5.21295,-6.52444 0.0854,-0.22268 0.002,-0.30333 -0.22296,-0.2168 -0.20819,0.0799 -0.55419,-0.17256 -0.82363,-0.60095 -0.25555,-0.40628 -0.91069,-1.2839 -1.45589,-1.95022 -0.54519,-0.66633 -0.99125,-1.27937 -0.99125,-1.3623 0,-0.17404 1.55301,0.8889 5.78998,3.96286 1.05301,0.76397 3.04335,2.18018 4.42298,3.14711 l 2.50842,1.7581 3.6291,0.32072 c 1.99601,0.17639 5.5683,0.49335 7.93843,0.70435 8.90983,0.79315 13.24049,1.17386 14.88675,1.30868 1.3711,0.1123 2.9283,-0.10672 8.0963,-1.13876 3.51928,-0.70281 6.42935,-1.25402 6.46681,-1.2249 0.0734,0.0571 -10.88728,5.57123 -13.25725,6.66953 l -1.43645,0.66567 -3.91756,-0.70824 z m -3.13406,-11.59205 c -2.72923,-0.18267 -7.01897,-0.46572 -9.53274,-0.62903 -7.78523,-0.50579 -6.65397,-0.15177 -12.12357,-3.79383 -5.84001,-3.88868 -7.31478,-4.82163 -8.50895,-5.38287 -0.50275,-0.23628 -1.56049,-0.81474 -2.35054,-1.28547 -0.79004,-0.47072 -2.04822,-1.18834 -2.79595,-1.5947 -2.12551,-1.15514 -2.51276,-1.38767 -2.89307,-1.7372 -0.19537,-0.17955 -0.46019,-0.32646 -0.58847,-0.32646 -0.12829,0 -1.10438,-0.52888 -2.16909,-1.17527 -1.0647,-0.6464 -2.00387,-1.17527 -2.08703,-1.17527 -0.0832,0 -0.57164,-0.28532 -1.0855,-0.63403 -0.51386,-0.34872 -1.04061,-0.67192 -1.17055,-0.71822 -0.32695,-0.11652 1.20845,-9.12388 1.61897,-9.49759 2.97564,-2.70887 6.85927,-6.16045 8.50939,-7.56273 1.85125,-1.5732 2.66109,-2.42011 2.65177,-2.77313 -0.008,-0.32015 -2.97133,-2.83653 -6.87142,-5.83594 -2.58239,-1.98601 -2.44707,-1.66995 -2.52903,-5.90683 -0.0955,-4.93556 -0.13571,-4.71352 0.989,-5.45697 0.53768,-0.35541 1.45982,-1.03119 2.04919,-1.50173 0.58937,-0.47054 1.14214,-0.85553 1.22839,-0.85553 0.14028,0 5.43654,-3.62486 8.97613,-6.14344 1.39443,-0.9922 3.00594,-2.34062 5.01213,-4.19389 l 1.1537,-1.06576 -2.15429,-1.2426 c -1.18486,-0.68343 -3.40515,-1.8895 -4.93399,-2.68016 -1.52883,-0.79067 -2.89134,-1.54419 -3.0278,-1.67451 -0.13647,-0.13031 -0.48905,-0.23873 -0.78352,-0.24093 -0.44136,-0.003 -0.46659,-0.0485 -0.14364,-0.25717 0.35861,-0.23175 0.18205,-0.3774 -0.34615,-0.28554 -0.11856,0.0206 -0.13014,-0.2299 -0.0257,-0.55671 0.52947,-1.65732 1.31614,-5.71827 1.13001,-5.8333 -0.19314,-0.11937 -8.73961,-1.21447 -12.24966,-1.56961 -2.54615,-0.25762 -2.41255,-0.14989 -3.77375,-3.04276 -0.6948,-1.47661 -1.65779,-3.48451 -2.13999,-4.46201 -0.48219,-0.9775 -0.87671,-1.88539 -0.87671,-2.01753 0,-0.13215 0.33187,-0.97775 0.73749,-1.87913 0.40562,-0.90137 0.89509,-2.0502 1.0877,-2.55296 0.19261,-0.50275 0.50714,-1.09964 0.69895,-1.32642 0.19181,-0.22677 0.34874,-0.61646 0.34874,-0.86597 0,-0.24951 0.12167,-0.68098 0.27036,-0.95883 0.20188,-0.3772 0.18534,-0.50761 -0.0653,-0.51479 -0.18461,-0.005 -5.1147,-10e-4 -10.95576,0.008 l -10.62012,0.0181 -0.15215,-0.72668 c -0.0837,-0.39968 -0.26708,-1.54938 -0.40755,-2.55489 -0.14048,-1.00551 -0.43238,-2.9969 -0.64868,-4.42531 l -0.39326,-2.59712 0.83941,-1.32045 c 0.46167,-0.72625 0.93264,-1.43798 1.04658,-1.58162 0.48513,-0.61159 6.98322,-10.58255 6.98322,-10.71537 0,-0.0803 0.28381,-0.45211 0.63069,-0.8262 0.34688,-0.37409 0.82312,-1.10691 1.05832,-1.62849 0.26816,-0.59468 0.73909,-1.08491 1.26281,-1.31457 0.45934,-0.20143 2.59807,-1.20866 4.75273,-2.23829 7.18093,-3.43149 8.33946,-3.98328 11.17375,-5.32184 1.54895,-0.73153 2.93829,-1.33006 3.08742,-1.33006 0.14912,0 0.44851,-0.17737 0.6653,-0.39415 0.21678,-0.21679 0.51534,-0.31926 0.66347,-0.22772 0.14812,0.0916 0.34432,0.0547 0.43599,-0.0819 0.26599,-0.39635 3.7661,-2.01354 4.27496,-1.97521 0.25422,0.0191 0.46221,-0.0762 0.46221,-0.21186 0,-0.13568 1.35543,-0.89087 3.01205,-1.67822 l 3.01206,-1.43153 -0.0739,-2.94134 -0.0739,-2.94134 -12.79738,-0.0595 c -7.03856,-0.0327 -13.32625,-0.0671 -13.97265,-0.0764 -1.09057,-0.0157 -1.25056,-0.11144 -2.21996,-1.32872 -2.05831,-2.58465 -2.90091,-3.60758 -4.81454,-5.84491 -1.80167,-2.10641 -1.91614,-2.31078 -1.58769,-2.83427 0.19469,-0.3103 0.72985,-1.26934 1.18926,-2.1312 0.81742,-1.53351 1.74554,-3.24905 3.60225,-6.65837 l 0.9237,-1.6961 3.60815,-1.62301 c 3.35882,-1.51085 5.1875,-2.34737 9.4845,-4.33868 1.71922,-0.79671 2.04006,-0.84706 8.74923,-1.37307 1.14915,-0.0901 2.26566,-0.1633 2.48113,-0.16267 0.21546,6.3e-4 1.4495,-0.1001 2.74229,-0.22384 1.2928,-0.12374 3.40829,-0.29388 4.70108,-0.3781 4.30936,-0.28072 4.3759,-0.29503 4.93375,-1.06084 0.57674,-0.79172 3.81548,-6.09339 3.81548,-6.24574 0,-0.0533 1.1089,-1.89815 2.46421,-4.09968 2.37221,-3.85337 3.31455,-5.2565 7.16098,-10.66266 0.97091,-1.36461 2.31962,-3.30381 2.99714,-4.30932 1.44199,-2.14006 1.51167,-2.24014 3.43485,-4.93384 l 1.47144,-2.06096 -0.28281,-2.82891 c -0.15555,-1.5559 -0.37357,-3.33159 -0.4845,-3.94597 -0.24434,-1.35336 -0.24746,-1.31487 0.59054,-7.2888 1.11788,-7.96916 0.81108,-7.21004 3.56258,-8.81493 l 2.35598,-1.37419 1.22747,0.77045 c 1.13619,0.71315 6.21002,3.72223 8.01792,4.7551 0.43094,0.2462 2.05411,1.18058 3.60706,2.0764 2.52937,1.45908 2.8695,1.58903 3.26464,1.2473 0.2426,-0.20981 2.82583,-1.81851 5.74051,-3.57489 5.80379,-3.49735 5.11117,-3.24833 11.93788,-4.29207 1.43644,-0.21962 3.5744,-0.57406 4.75102,-0.78765 2.17971,-0.39568 2.64502,-0.46797 6.08758,-0.9457 1.07733,-0.1495 2.37012,-0.37943 2.87288,-0.51095 0.50275,-0.13153 1.61926,-0.31734 2.48112,-0.41291 0.86187,-0.0956 1.64612,-0.22079 1.74278,-0.27825 0.0967,-0.0575 0.74306,-0.16811 1.43644,-0.24586 0.69338,-0.0777 1.49575,-0.19271 1.78304,-0.25545 2.53997,-0.55474 6.8931,-1.21476 7.96571,-1.20776 0.21547,10e-4 0.62681,-0.098 0.9141,-0.22091 0.28729,-0.12291 1.34503,-0.33378 2.35054,-0.46861 1.69735,-0.22758 2.04317,-0.18185 4.83167,0.63887 1.6519,0.4862 3.47357,1.01452 4.04815,1.17404 0.57458,0.15953 1.57356,0.44731 2.21995,0.63953 2.04901,0.60928 9.41441,2.73656 12.6668,3.65843 1.72373,0.48857 3.89798,1.11798 4.83167,1.39867 0.93368,0.28069 2.81412,0.82466 4.17873,1.20882 1.81225,0.51016 5.05103,1.96864 12.01388,5.41005 8.22568,4.06557 10.30266,5.21748 15.14792,8.40119 3.08835,2.02928 6.75655,4.42836 8.15157,5.33128 l 2.5364,1.64168 1.12,-0.86916 c 0.616,-0.47805 1.195,-0.97237 1.28668,-1.09851 0.0917,-0.12614 0.32672,-0.13667 0.52234,-0.0234 0.19561,0.11325 0.27153,0.11273 0.16869,-0.001 -0.10283,-0.11389 0.21718,-0.5147 0.71112,-0.89068 3.52963,-2.68667 6.33721,-4.89673 6.73353,-5.30047 0.25697,-0.26178 0.563,-0.47597 0.68008,-0.47597 0.11707,0 0.50838,-0.26443 0.86957,-0.58763 0.36119,-0.3232 1.87682,-1.52648 3.36807,-2.67395 1.49124,-1.14748 2.75053,-2.17584 2.79841,-2.28525 0.0479,-0.10941 0.19595,-0.19893 0.32905,-0.19893 0.20216,0 1.05876,-0.6536 4.54615,-3.46879 0.23989,-0.19366 2.49702,-1.90493 4.80193,-3.64066 1.41196,-1.06328 1.79084,-1.31072 4.20847,-2.74846 7.78209,-4.62792 9.40059,-5.60778 12.27504,-7.43148 1.26153,-0.80038 9.96927,-9.3391 16.52657,-16.20581 1.20026,-1.25688 2.31087,-2.28524 2.46801,-2.28524 0.39335,0 6.4112,2.58643 6.7145,2.88584 0.27898,0.27544 0.27091,0.28678 -5.20715,7.30231 -2.15466,2.75939 -4.79902,6.15767 -5.87635,7.55175 -1.07733,1.39407 -3.26589,4.17244 -4.86345,6.17416 l -2.90467,3.63949 -3.82411,2.15466 c -2.10327,1.18506 -3.93024,2.15466 -4.05991,2.15466 -0.12967,0 -0.27493,0.0941 -0.32283,0.20903 -0.0479,0.11496 -0.90974,0.66418 -1.91525,1.22049 -6.94936,3.84478 -9.83793,5.6326 -11.93734,7.38837 -1.19124,0.99625 -4.63876,3.79767 -7.66115,6.22537 -14.04963,11.2852 -15.81835,12.7661 -15.71457,13.15749 0.0802,0.30247 7.99162,12.01779 12.59235,18.6469 0.28664,0.41302 0.70845,1.03144 0.93735,1.37426 0.22891,0.34283 0.56379,1.2977 0.74419,2.12194 0.33918,1.54968 1.55109,6.67603 2.76225,11.6843 0.75991,3.1423 0.75351,2.49588 0.13841,13.97266 -0.14242,2.65741 -0.29173,5.47806 -0.33179,6.2681 l -0.0728,1.43645 1.30586,-0.0351 c 0.71822,-0.0193 3.65639,-0.46687 6.52928,-0.99456 2.87288,-0.52769 5.51839,-0.99924 5.87891,-1.04789 0.36053,-0.0487 1.1248,-0.21484 1.69839,-0.36929 0.57358,-0.15445 1.88366,-0.31349 2.91128,-0.35342 1.02762,-0.0399 1.84997,-0.18314 1.82744,-0.31826 -0.0225,-0.13511 0.19407,-0.29467 0.48136,-0.35457 0.28729,-0.0599 0.66384,-0.22368 0.83677,-0.36396 0.5524,-0.4481 3.99474,-2.02616 3.99889,-1.8332 0.002,0.10213 0.0903,0.0507 0.19588,-0.11437 0.10554,-0.16502 1.01457,-0.67246 2.02008,-1.12763 2.31463,-1.04779 5.70513,-2.71042 5.87635,-2.88164 0.0718,-0.0718 0.30688,-0.16808 0.52234,-0.21391 0.98629,-0.20978 7.85522,-3.76994 9.14099,-4.73777 0.79004,-0.59468 1.7178,-1.28106 2.06168,-1.52529 0.34389,-0.24424 3.2233,-2.38933 6.3987,-4.76687 3.17539,-2.37755 6.36108,-4.75551 7.0793,-5.28436 0.71822,-0.52886 1.95225,-1.44169 2.7423,-2.02852 0.79004,-0.58682 2.74715,-2.0285 4.34912,-3.20371 7.49235,-5.49637 10.50571,-7.68833 11.68427,-8.49924 l 1.27721,-0.8788 -0.18342,1.92304 c -0.10087,1.05767 -0.35146,3.21583 -0.55687,4.79592 -0.20544,1.58009 -0.37444,3.24576 -0.37559,3.70149 -0.002,0.68732 -0.25819,1.0436 -1.50385,2.08938 -0.82595,0.69342 -1.5605,1.32025 -1.63232,1.39297 -0.0718,0.0727 -0.89451,0.77269 -1.8282,1.5555 -0.93368,0.78281 -2.34578,2.01611 -3.13802,2.74067 -1.44067,1.31764 -9.63813,8.25771 -12.66165,10.71954 -6.18688,5.03751 -7.7782,6.49075 -7.28785,6.65554 0.27292,0.0917 3.4344,0.19951 7.0255,0.23952 3.5911,0.04 6.54955,0.0923 6.5743,0.11616 0.0248,0.0239 0.12905,1.7175 0.23174,3.7636 l 0.18666,3.72018 -0.62347,0.02 c -0.34291,0.011 -0.79976,0.0538 -1.01522,0.0951 -0.21547,0.0413 -1.62579,0.15707 -3.13405,0.25725 -1.50827,0.10018 -3.27117,0.2336 -3.91757,0.29649 -1.85304,0.18029 -10.10168,0.86384 -12.40563,1.02803 -1.14915,0.0819 -5.61518,0.43593 -9.9245,0.78673 -4.30932,0.3508 -9.42175,0.76012 -11.36094,0.90958 -6.07011,0.46787 -6.88928,0.5345 -8.09631,0.65857 -0.64639,0.0664 -2.20837,0.19053 -3.47105,0.27575 -1.26268,0.0852 -2.61424,0.25077 -3.00347,0.36787 -0.8147,0.24511 -4.13335,1.63161 -5.66993,2.36885 -1.03065,0.49449 -7.30011,3.20722 -11.62212,5.02875 -1.22097,0.51459 -2.69006,1.00717 -3.26463,1.09462 -0.57458,0.0874 -1.5148,0.2652 -2.08937,0.39501 -0.57458,0.12981 -2.80759,0.54561 -4.96225,0.924 -2.15467,0.37839 -5.09284,1.07323 -6.52928,1.5441 -1.43644,0.47087 -4.31585,1.41053 -6.39869,2.08815 -2.08284,0.67761 -3.93862,1.42776 -4.12396,1.66699 -0.18534,0.23923 -0.59278,0.72878 -0.90542,1.08789 -0.31265,0.35911 -1.32663,1.59314 -2.25329,2.7423 -1.49905,1.85896 -2.52759,3.0405 -4.01298,4.60993 -0.25138,0.2656 -0.45705,0.54521 -0.45705,0.62135 0,0.0761 -0.62087,0.86946 -1.37972,1.76291 -2.15625,2.53874 -2.30798,2.71999 -5.40447,6.45612 -2.6373,3.18208 -5.06259,5.38777 -6.79671,6.18132 -0.21547,0.0986 -0.45052,0.25783 -0.52234,0.35386 -0.0718,0.096 -0.88051,0.69223 -1.79709,1.3249 -1.55536,1.0736 -2.78758,1.9316 -6.25533,4.35563 -0.76591,0.53539 -1.5886,1.09096 -1.8282,1.2346 -0.2396,0.14365 -0.4944,0.32027 -0.56623,0.39249 -0.0718,0.0722 -0.65712,0.48357 -1.30067,0.9141 -0.64355,0.43053 -1.34872,0.92515 -1.56703,1.09916 -0.21831,0.174 -1.09549,0.78585 -1.94928,1.35965 -1.47321,0.99009 -1.6472,1.22692 -3.41312,4.64587 -1.02342,1.98143 -2.80382,5.42608 -3.95643,7.65478 l -2.09567,4.05217 0.10459,2.73828 c 0.0575,1.50605 0.14156,3.03209 0.18674,3.3912 0.0452,0.35911 0.0971,1.13212 0.11548,1.71781 l 0.0333,1.06488 2.74603,1.12413 2.74603,1.12413 1.49359,-1.4055 c 0.82147,-0.77302 3.71202,-3.58923 6.42345,-6.25825 l 4.92987,-4.85274 2.90967,-0.81657 c 1.60033,-0.44912 4.67259,-1.29052 6.82725,-1.86978 8.25358,-2.21891 9.99692,-2.70409 12.30129,-3.42349 2.27593,-0.71053 4.07596,-1.34304 5.19717,-1.82623 0.28729,-0.12381 1.10998,-0.4002 1.8282,-0.61421 0.71822,-0.214 3.64653,-1.21836 6.50735,-2.2319 2.86082,-1.01353 5.24504,-1.79923 5.29828,-1.74599 0.10967,0.10966 -0.59131,1.9439 -1.6479,4.31202 -0.67011,1.50189 -0.83532,1.66765 -2.69352,2.70242 -1.08879,0.60631 -2.21467,1.24906 -2.50196,1.42833 -0.28729,0.17928 -0.81616,0.47674 -1.17527,0.66103 -1.24207,0.63743 -4.31553,2.37315 -5.87635,3.31862 -1.5647,0.94783 -4.92607,2.62904 -5.25645,2.62904 -0.096,0 -2.88977,1.06921 -6.20831,2.37603 -3.31854,1.30682 -6.79048,2.66679 -7.71542,3.02215 -1.70158,0.65374 -1.98623,0.89178 -5.10873,4.27223 -0.86187,0.93306 -3.28824,3.51681 -5.39194,5.74165 -2.10371,2.22485 -4.0429,4.31052 -4.30933,4.63482 -0.41464,0.50472 -1.91924,1.05808 -3.99089,1.46775 -0.22609,0.0447 -0.7049,0.15727 -1.06401,0.25014 -3.52175,0.91074 -7.047,1.59987 -11.56677,2.26111 -4.76602,0.69727 -5.84432,0.95163 -9.50603,2.24244 -2.27161,0.80077 -4.36526,1.56039 -4.65255,1.68804 -0.28729,0.12765 -1.2275,0.46668 -2.08937,0.75341 -0.86186,0.28672 -2.56601,0.88664 -3.78698,1.33315 -1.22098,0.44651 -3.66547,1.32645 -5.43222,1.95543 l -3.21226,1.14359 -4.3617,4.7e-4 c -4.7554,5e-4 -4.24994,-0.0919 -12.84976,2.34792 -6.64522,1.88526 -10.54454,2.94678 -11.7527,3.19946 -0.6464,0.1352 -1.35542,0.34364 -1.5756,0.46322 -0.22018,0.11957 -0.80781,0.30255 -1.30585,0.40662 -0.49804,0.10407 -2.72719,0.70146 -4.95368,1.32752 -2.22648,0.62607 -6.39023,1.7914 -9.25278,2.58963 -3.89172,1.08522 -6.32936,1.95384 -9.66333,3.44341 -3.8345,1.7132 -8.67311,3.96369 -9.00049,4.18622 -0.17267,0.11736 0.51358,5.63932 0.75747,6.09503 0.20487,0.38281 1.83637,0.74597 5.35135,1.19119 0.28728,0.0364 0.52234,0.0839 0.52234,0.10556 0,0.0217 0.41134,0.0922 0.9141,0.15686 1.64405,0.21127 12.6344,1.92944 13.97265,2.1844 4.5356,0.86414 5.06996,0.87601 7.96572,0.17704 1.50826,-0.36406 3.8588,-0.90676 5.22342,-1.206 2.71286,-0.59488 4.76263,-1.06827 7.96572,-1.83968 4.87779,-1.17473 7.90941,-1.87274 9.0104,-2.07461 0.6464,-0.11852 1.88043,-0.40826 2.7423,-0.64388 0.86186,-0.23562 1.86084,-0.48404 2.21995,-0.55205 1.1882,-0.225 5.34043,-1.18602 6.13752,-1.4205 0.43093,-0.12676 1.25362,-0.30524 1.8282,-0.3966 0.57457,-0.0914 1.3385,-0.27318 1.69761,-0.40402 0.35911,-0.13085 1.06427,-0.28773 1.56703,-0.34863 0.50275,-0.0609 1.85431,-0.35274 3.00346,-0.64853 3.45713,-0.88985 13.13254,-3.15585 18.54315,-4.34285 1.72373,-0.37816 3.83922,-0.86247 4.70108,-1.07624 2.31918,-0.57525 7.97887,-1.90693 8.87982,-2.08936 1.38069,-0.27957 4.30269,-1.30809 6.39869,-2.25228 3.65953,-1.64852 7.81001,-3.40103 8.34704,-3.52447 0.35337,-0.0812 0.86448,-0.35449 1.13579,-0.60725 0.27131,-0.25277 0.77872,-0.53121 1.12758,-0.61877 0.34886,-0.0876 1.24808,-0.44121 1.99827,-0.78588 0.75019,-0.34468 2.24543,-0.99713 3.32276,-1.4499 1.07733,-0.45276 2.45699,-1.04916 3.06591,-1.32532 0.60892,-0.27616 1.1567,-0.50211 1.21729,-0.50211 0.0606,0 0.97269,-0.40268 2.02692,-0.89483 1.05422,-0.49216 2.5537,-1.14469 3.33217,-1.45007 1.37149,-0.53802 2.3782,-0.97713 5.11387,-2.2306 2.9024,-1.32985 4.33257,-1.95378 4.47847,-1.95378 0.0845,0 0.54068,-0.3232 1.01371,-0.71822 0.47304,-0.39502 1.28309,-1.01204 1.80011,-1.37115 0.81093,-0.56324 2.36375,-1.71537 5.52656,-4.10048 1.40282,-1.05788 4.4684,-3.32682 6.80495,-5.03657 1.27302,-0.93153 2.46988,-1.84236 2.6597,-2.02408 0.18981,-0.18172 0.42607,-0.3304 0.52501,-0.3304 0.0989,0 0.47251,-0.26777 0.83015,-0.59505 0.35764,-0.32728 1.0616,-0.88235 1.56436,-1.23349 0.50275,-0.35114 1.03162,-0.73281 1.17527,-0.84815 0.14364,-0.11535 1.84778,-1.3853 3.78698,-2.82213 5.76951,-4.27487 6.73382,-5.0014 8.90725,-6.71093 1.1414,-0.89777 2.13464,-1.63232 2.2072,-1.63232 0.0726,0 1.28073,-0.86131 2.68484,-1.91402 1.40411,-1.05271 2.95773,-2.13983 3.45251,-2.41583 0.49477,-0.276 0.95835,-0.56588 1.03017,-0.64418 0.14085,-0.15354 3.7328,-2.73974 4.69925,-3.38344 0.3235,-0.21547 1.33529,-0.92063 2.24843,-1.56703 0.91314,-0.6464 2.43769,-1.70414 3.38791,-2.35054 0.95021,-0.6464 2.05912,-1.44174 2.46425,-1.76743 0.59213,-0.476 1.26605,-0.64256 3.43584,-0.84913 1.48457,-0.14134 4.46213,-0.43152 6.61679,-0.64485 2.15467,-0.21333 4.62273,-0.45152 5.4846,-0.52931 0.86186,-0.0778 2.566,-0.27057 3.78698,-0.42838 1.97866,-0.25575 11.58821,-0.34554 11.98684,-0.11201 0.0867,0.0508 2.97826,0.16902 6.42572,0.26272 3.44746,0.0937 6.67945,0.21982 7.18221,0.28028 0.50275,0.0605 3.49969,0.17658 6.65986,0.25806 3.16017,0.0815 6.5802,0.21606 7.60008,0.29908 l 1.85431,0.15094 0.43093,1.36709 c 0.26964,0.85539 0.43094,2.26274 0.43094,3.75997 l 0,2.39288 -2.35054,0.0327 c -1.2928,0.0179 -2.67374,0.0553 -3.06876,0.083 -0.39503,0.0277 -4.06774,0.1393 -8.1616,0.24797 -4.09386,0.10867 -7.61967,0.24041 -7.83513,0.29276 -0.21547,0.0523 -3.09488,0.16503 -6.3987,0.2504 -3.30381,0.0854 -7.00591,0.20559 -8.22688,0.26715 -1.22098,0.0616 -4.86432,0.18504 -8.09631,0.2744 l -5.87635,0.16247 -3.00347,1.17274 c -1.6519,0.64501 -3.35604,1.32268 -3.78698,1.50595 -1.07255,0.45614 -2.58363,1.0531 -2.74229,1.08336 -0.0718,0.0137 -0.48317,0.17146 -0.9141,0.35059 -0.43093,0.17912 -1.19486,0.48076 -1.69761,0.67031 -5.19633,1.95908 -5.42386,2.09514 -13.23133,7.91175 -4.18889,3.12073 -8.747,6.49676 -10.12913,7.50227 -1.38213,1.00551 -4.25098,3.12099 -6.37521,4.70108 -2.12423,1.58008 -4.97033,3.69182 -6.32466,4.69276 -1.35432,1.00093 -3.05038,2.29373 -3.76901,2.87288 -0.71863,0.57915 -4.59702,3.16002 -8.61865,5.73527 -4.02162,2.57524 -9.19248,5.91831 -11.49078,7.42903 -5.35208,3.51803 -4.47023,3.07917 -17.75964,8.83812 -2.15466,0.93372 -4.32891,1.90669 -4.83166,2.16215 -0.50276,0.25546 -1.20792,0.55342 -1.56703,0.66213 -0.35911,0.1087 -1.47561,0.58148 -2.48112,1.05061 -7.95213,3.71014 -15.08891,6.63223 -17.12488,7.01163 -8.46436,1.57728 -13.91895,2.56717 -15.78268,2.86422 -0.43093,0.0687 -1.72373,0.31078 -2.87288,0.53801 -1.14916,0.22722 -2.61646,0.48497 -3.26069,0.57278 -0.64422,0.0878 -1.45094,0.26597 -1.79271,0.39591 -0.50495,0.19198 -0.59288,0.16193 -0.4692,-0.16037 0.18964,-0.4942 -0.25244,-0.52587 -0.53665,-0.0384 -0.19937,0.3419 -1.09473,0.53462 -8.04399,1.73149 -4.84916,0.83518 -9.46283,1.74486 -15.96843,3.14847 -3.42711,0.73943 -7.81773,1.67633 -9.75692,2.08201 -1.9392,0.4057 -5.19995,1.09887 -7.24611,1.54038 -4.2139,0.9093 -5.61839,0.95054 -13.77817,0.40443 z m 25.12616,-8.28558 c -0.0623,-0.3232 -0.11319,-0.0588 -0.11319,0.58764 0,0.64639 0.0509,0.91083 0.11319,0.58763 0.0622,-0.3232 0.0622,-0.85207 0,-1.17527 z m -51.34557,-8.55335 c 0.32944,-0.59913 1.91264,-4.15474 2.47488,-5.55819 0.43267,-1.08001 0.90637,-1.5566 3.50377,-3.52513 1.65191,-1.25195 3.06289,-2.35456 3.13551,-2.45024 0.0726,-0.0957 1.18913,-0.42423 2.48113,-0.73012 1.29199,-0.30588 3.2893,-0.77999 4.43845,-1.05359 1.14915,-0.27359 3.44583,-0.79533 5.10372,-1.15943 4.48023,-0.98393 7.21798,-1.68221 9.26069,-2.36199 1.80515,-0.60072 3.73367,-1.15235 4.11224,-1.17626 0.10708,-0.007 0.81224,-0.23258 1.56703,-0.50183 0.75479,-0.26924 1.95999,-0.6377 2.67821,-0.8188 0.71822,-0.18109 1.4175,-0.42946 1.55397,-0.55193 0.13645,-0.12247 0.45438,-0.22267 0.70649,-0.22267 0.43373,0 2.91971,-1.05872 4.92174,-2.09604 0.50275,-0.2605 1.50173,-0.70711 2.21995,-0.99247 0.71822,-0.28536 2.45625,-1.05874 3.86228,-1.71863 1.40603,-0.65988 2.62527,-1.19979 2.70942,-1.19979 0.0842,0 1.04926,-0.40337 2.14466,-0.89636 1.09541,-0.493 2.99064,-1.07615 4.21161,-1.29589 1.22098,-0.21974 2.56523,-0.49866 2.98723,-0.61982 l 0.76727,-0.2203 -1.02844,-1.05529 c -0.87983,-0.90279 -1.62761,-1.27374 -5.17468,-2.56693 l -4.14625,-1.51164 -3.95006,1.99569 c -2.17253,1.09763 -6.21885,3.17137 -8.99182,4.60831 -2.77297,1.43694 -5.71114,2.78887 -6.52928,3.00427 -1.40711,0.37049 -10.90186,2.67416 -19.50832,4.73323 -3.56592,0.85313 -4.24577,1.11468 -7.57396,2.91374 -6.28987,3.4 -7.02362,3.79972 -8.09631,4.41058 -0.57457,0.3272 -1.28817,0.70353 -1.58576,0.83628 -0.51137,0.22813 -2.41692,1.42935 -7.35935,4.63921 -1.18506,0.76964 -2.15466,1.50278 -2.15466,1.62921 0,0.21167 1.60385,2.67246 2.44842,3.75662 0.24102,0.3094 1.51881,0.72475 3.83896,1.2479 1.91272,0.43128 3.51694,0.8234 3.56491,0.87137 0.23531,0.2353 1.21662,-0.018 1.40635,-0.36307 z m 124.2064,-14.67455 c -0.0834,-0.20835 -0.14526,-0.14646 -0.15779,0.15779 -0.0113,0.27531 0.0504,0.42957 0.13717,0.34278 0.0868,-0.0868 0.0961,-0.31204 0.0206,-0.50057 z M 169.18266,503.30239 c 0.57457,-0.17748 2.455,-0.63944 4.17873,-1.02658 1.72373,-0.38714 3.66293,-0.86894 4.30933,-1.07065 1.31813,-0.41134 6.48683,-1.49909 9.27157,-1.95119 2.09068,-0.33943 2.34761,-0.37671 4.30932,-0.62531 2.53681,-0.32148 3.48346,-0.69597 5.21997,-2.065 0.93559,-0.73759 1.85185,-1.48498 2.03614,-1.66085 0.18429,-0.17587 0.86007,-0.69679 1.50173,-1.1576 0.64167,-0.46081 1.16666,-0.97335 1.16666,-1.13898 0,-0.16564 -1.03459,-1.38928 -2.29908,-2.71921 l -2.29909,-2.41805 -1.4226,0.2857 c -0.78243,0.15714 -2.7154,0.52485 -4.29548,0.81714 -1.58009,0.29229 -3.57805,0.69337 -4.43991,0.89128 -0.86187,0.19792 -4.30812,0.90737 -7.65835,1.57657 -6.76736,1.35177 -5.9397,1.33522 -13.88827,0.27779 -1.50826,-0.20065 -3.8588,-0.43953 -5.22342,-0.53086 -1.36462,-0.0913 -2.79355,-0.22618 -3.17539,-0.2997 -0.54655,-0.10521 -1.47734,0.35386 -4.37462,2.15764 -2.02419,1.26022 -3.67587,2.35431 -3.67039,2.43133 0.006,0.077 0.68126,0.59725 1.50174,1.15609 0.82047,0.55883 2.93563,2.00611 4.70035,3.21616 3.25595,2.23258 3.88652,2.50341 7.76061,3.3331 1.14915,0.2461 2.38318,0.54716 2.74229,0.669 0.90428,0.30682 2.8004,0.23758 4.04816,-0.14782 z m 73.10021,-12.98347 c 0.62304,-1.3287 1.20103,-2.65088 1.28441,-2.93817 0.0834,-0.28729 0.0609,-1.8739 -0.0501,-3.52581 l -0.20168,-3.00347 -3.28067,-6.22268 -3.28068,-6.22268 -2.57582,-1.65121 c -1.41671,-0.90816 -4.00336,-2.57398 -5.74813,-3.70182 l -3.17231,-2.05061 -2.02256,-3.2065 c -1.1124,-1.76357 -2.44675,-3.53925 -2.96521,-3.94596 -1.20588,-0.94595 -4.03819,-2.90113 -4.09658,-2.82792 -0.0245,0.0307 -0.49323,0.87856 -1.04159,1.88407 -1.53774,2.81968 -1.80099,3.26121 -1.94549,3.26299 -0.0737,9.1e-4 -1.30692,-1.8977 -2.7404,-4.21913 -1.51319,-2.4505 -3.48346,-5.22053 -4.6976,-6.60442 -2.61115,-2.97621 -2.65389,-3.02553 -3.2194,-3.71512 -0.26919,-0.32826 -0.93376,-2.5863 -1.57574,-5.35401 -1.87595,-8.08752 -2.33612,-9.99061 -2.54129,-10.50965 -0.13858,-0.35058 -0.10634,-0.44349 0.10795,-0.31106 0.19655,0.12148 0.30555,-0.008 0.30555,-0.36432 0,-0.30424 -0.10906,-0.48576 -0.24236,-0.40338 -0.26457,0.16351 -0.29283,0.0837 -0.92299,-2.60811 -0.34632,-1.47933 -0.38609,-2.34156 -0.20463,-4.43618 l 0.22524,-2.59996 -2.83873,-8.36121 c -1.56129,-4.59866 -3.01859,-8.94884 -3.23843,-9.66706 -0.21983,-0.71822 -0.57053,-1.70284 -0.77934,-2.18805 -0.37144,-0.86317 -0.32832,-1.01537 1.9976,-7.05162 1.30748,-3.39318 2.54009,-6.58077 2.73913,-7.08352 1.2502,-3.15781 3.34803,-8.56455 3.82098,-9.84779 0.30673,-0.83224 0.68897,-1.6794 0.84942,-1.88257 0.1905,-0.24124 0.27089,-1.6458 0.23167,-4.04815 l -0.06,-3.67875 1.32661,-3.39522 c 0.72964,-1.86738 1.42885,-3.63028 1.5538,-3.91757 1.19072,-2.73768 2.5937,-6.52989 2.5937,-7.0107 0,-0.32844 -0.55939,-1.41222 -1.24309,-2.40841 -1.36282,-1.9857 -0.94238,-1.7593 -6.0697,-3.2683 -1.50826,-0.44389 -3.13811,-0.94328 -3.62188,-1.10975 -1.02524,-0.35281 -0.41786,-0.93453 -7.5885,7.26788 -6.84976,7.83536 -6.72867,7.67357 -8.14675,10.8843 -0.71849,1.62677 -1.52742,3.42788 -1.79762,4.00245 -0.27019,0.57458 -2.13432,4.83142 -4.1425,9.45964 l -3.65125,8.41497 -0.1498,2.55423 c -0.21011,3.58234 -0.7334,17.51227 -0.7582,20.18328 -0.0161,1.7339 1.31491,14.70359 2.0638,20.11018 0.0696,0.50275 0.24065,1.73679 0.38002,2.7423 0.13937,1.00551 0.35938,2.67054 0.48892,3.70007 0.14819,1.17785 0.58348,2.64253 1.17401,3.95044 0.51618,1.14321 0.9385,2.15142 0.9385,2.24046 0,0.089 0.41134,1.05244 0.9141,2.14087 0.50275,1.08842 0.9141,2.02331 0.9141,2.07752 0,0.0542 1.42736,3.36577 3.17192,7.35901 1.74456,3.99325 3.6049,8.25943 4.13408,9.4804 l 0.96216,2.21996 4.02751,3.47572 c 2.21514,1.91165 4.48759,3.85085 5.04989,4.30933 0.5623,0.45847 1.14994,0.95574 1.30586,1.10504 0.15591,0.1493 1.46568,1.2658 2.91059,2.48113 1.4449,1.21532 3.92793,3.32618 5.51783,4.6908 5.43064,4.66112 5.84562,4.95275 9.72139,6.83158 2.09598,1.01606 5.80883,2.81948 8.25078,4.00761 11.84114,5.76128 10.63895,5.28226 15.3274,6.10733 2.34324,0.41236 4.46943,0.76401 4.72487,0.78143 0.34119,0.0233 0.76503,-0.60937 1.59724,-2.38415 z m 12.80374,0.21215 c 0.65813,-0.92229 1.1966,-1.91663 1.1966,-2.20965 0,-0.51768 -2.23396,-6.49835 -3.53411,-9.46139 -0.35454,-0.80801 -0.64462,-1.53147 -0.64462,-1.6077 0,-0.0762 -0.58927,-1.37545 -1.30949,-2.88717 l -1.30948,-2.74858 0.24601,-2.173 c 0.1513,-1.33645 0.1527,-2.26852 0.004,-2.42112 -0.291,-0.29788 -0.32078,-1.10096 -0.0465,-1.25434 0.10774,-0.0602 0.0447,-0.0721 -0.14013,-0.0263 -0.20355,0.0504 -0.83904,-0.97534 -1.61207,-2.60213 -1.07406,-2.26028 -1.54337,-2.93139 -2.96467,-4.23949 -4.99884,-4.60071 -9.06286,-8.60476 -8.81688,-8.68676 0.15363,-0.0512 0.27932,-0.21752 0.27932,-0.36958 0,-0.15206 0.47011,-1.02084 1.04468,-1.93062 0.57458,-0.90977 1.04469,-1.709 1.04469,-1.77604 0,-0.067 0.4742,-0.87822 1.05379,-1.8026 1.10027,-1.75483 0.92493,-1.63852 4.30022,-2.85247 0.43093,-0.15499 0.89516,-0.38049 1.03162,-0.50111 0.4196,-0.3709 0.8282,-0.27556 6.77885,1.58159 3.17373,0.99051 7.94467,2.47079 10.60209,3.28953 2.65741,0.81874 5.70533,1.774 6.77315,2.1228 l 1.94148,0.63418 0.94785,-0.92555 c 0.52132,-0.50906 1.02859,-0.8644 1.12728,-0.78966 0.0987,0.0747 0.12352,0.0604 0.0552,-0.0318 -0.0683,-0.0923 0.47107,-0.85492 1.19866,-1.69479 1.1108,-1.28221 3.10531,-2.97882 10.90117,-9.27293 2.37573,-1.91808 6.98039,-5.71734 7.08988,-5.84979 0.0718,-0.0869 0.77699,-0.63176 1.56703,-1.21084 0.79004,-0.57908 2.55295,-2.02115 3.91757,-3.2046 2.37473,-2.05944 3.23599,-3.11692 6.42664,-7.89072 0.63885,-0.95583 1.77536,-2.2847 2.52558,-2.95303 2.08313,-1.85576 5.67336,-5.43614 5.67336,-5.65779 0,-0.10842 -0.9696,-0.4886 -2.15466,-0.84483 -4.20987,-1.26551 -5.87039,-1.73429 -6.10039,-1.72222 -0.12816,0.007 -0.64436,0.59402 -1.14711,1.30508 -0.50276,0.71106 -1.11977,1.35988 -1.37115,1.44181 -0.25138,0.0819 -0.46023,0.34671 -0.46411,0.58841 -0.007,0.41207 -0.67411,1.38103 -3.29408,4.78181 -0.59465,0.77187 -3.04207,3.40136 -5.43871,5.84331 l -4.35752,4.43991 0.18585,-4.57049 c 0.16334,-4.01677 0.25473,-5.35401 0.36592,-5.35401 0.0168,0 0.0455,-0.9245 0.0638,-2.05444 0.0248,-1.53008 -0.0613,-2.10629 -0.33706,-2.25758 -0.42216,-0.23157 -5.21674,-1.56513 -6.33074,-1.76083 -0.82642,-0.14518 -1.0757,-0.62032 -1.60972,-3.06814 -1.24054,-5.68632 -1.84346,-7.93108 -2.31489,-8.61864 -0.29547,-0.43094 -1.35343,-1.88125 -2.35103,-3.22291 l -1.81381,-2.4394 0.30837,-1.217 c 0.16961,-0.66935 0.37061,-1.62834 0.44668,-2.1311 0.34182,-2.2591 0.51999,-2.49044 2.66183,-3.45603 1.10789,-0.49947 2.60198,-1.11379 3.3202,-1.36517 l 1.30586,-0.45704 6.2681,2.14303 c 3.44746,1.17867 6.47274,2.20342 6.72284,2.27722 0.2501,0.0738 1.00255,-0.12332 1.67212,-0.43806 0.66958,-0.31474 1.43471,-0.51542 1.7003,-0.44597 0.26559,0.0695 0.43066,0.0418 0.36683,-0.0615 -0.1313,-0.21243 6.29551,-2.89754 6.93527,-2.89754 0.36745,0 2.09628,0.52583 7.72402,2.34929 2.01136,0.65171 2.26114,0.66023 1.94935,0.0665 -0.13202,-0.25137 -0.31925,-0.98592 -0.41608,-1.63231 -0.4953,-3.30655 -0.70809,-3.8625 -1.81685,-4.7467 -0.58917,-0.46986 -1.18875,-0.94832 -1.3324,-1.06326 -0.19422,-0.15541 -5.43646,-3.98084 -5.806,-4.23683 -0.0672,-0.0466 -2.65007,-7.45111 -4.2847,-12.28336 -0.58309,-1.72373 -1.15342,-3.30227 -1.26739,-3.50788 -0.23533,-0.42455 -0.83761,0.6911 -2.47385,4.58249 l -1.00092,2.38046 -3.91269,0.45368 c -2.56751,0.29772 -3.96852,0.36376 -4.07509,0.19209 -0.1734,-0.27929 -1.46475,-2.09912 -3.5112,-4.94814 -1.32695,-1.84734 -2.04038,-2.29626 -6.31455,-3.9733 -0.86186,-0.33817 -1.68117,-0.71655 -1.82069,-0.84085 -0.25298,-0.22539 -1.25654,-2.9608 -1.69138,-4.6102 -0.12608,-0.47823 -0.2795,-0.91977 -0.34094,-0.98121 -0.0614,-0.0614 -1.14319,0.39363 -2.40389,1.01126 l -2.29219,1.12297 -2.12415,-0.43972 c -6.56337,-1.35868 -5.84624,-1.06851 -7.83714,-3.17109 -0.98749,-1.04287 -2.50545,-2.71883 -3.37324,-3.72434 -1.90064,-2.20227 -4.84484,-5.48529 -6.45344,-7.1961 -0.6464,-0.68747 -1.70414,-1.53875 -2.35054,-1.89172 -5.1336,-2.80327 -6.84796,-3.94193 -7.49888,-4.98068 -2.11211,-3.37058 -3.63537,-5.47269 -4.10867,-5.67001 -0.48458,-0.20202 -2.57822,-0.71355 -12.15946,-2.97088 l -3.0039,-0.70772 -1.95835,0.89462 c -2.54111,1.16083 -4.63149,2.09436 -10.0406,4.48394 l -4.42585,1.95522 -0.7112,1.56675 c -1.3103,2.88653 -1.60769,2.6222 2.87836,2.55845 l 3.92202,-0.0557 0.39736,0.9141 c 1.04408,2.40188 4.10568,10.33316 4.12765,10.69295 0.0237,0.38909 -0.96515,3.82677 -3.72325,12.94304 l -1.26426,4.17873 -0.18021,8.2269 -0.18021,8.2269 -1.86367,2.86561 c -4.40185,6.76836 -5.63336,8.64107 -5.84422,8.88709 -0.12312,0.14364 -0.52491,0.76698 -0.89286,1.3852 l -0.66902,1.12403 0.61044,2.79354 c 1.0207,4.67103 2.05969,9.67087 4.0268,19.3779 l 1.87888,9.27157 1.82467,4.17874 c 1.00358,2.2983 1.98915,4.35083 2.19017,4.56117 0.31575,0.33039 0.36634,0.22379 0.37179,-0.78352 0.0106,-1.95126 0.30665,-7.60266 0.48173,-9.19477 l 0.16489,-1.49955 2.74515,1.77577 2.74516,1.77577 0.73106,3.64135 c 0.40208,2.00274 0.78195,3.8764 0.84415,4.16369 0.0622,0.28729 0.2264,1.13372 0.36488,1.88096 0.13848,0.74725 0.53091,1.80499 0.87207,2.35054 0.59982,0.95919 3.04341,5.55565 6.31776,11.88391 1.7632,3.40769 2.32915,4.05007 10.07738,11.43814 5.77786,5.50929 6.09,5.86276 7.84674,8.88589 0.84616,1.45613 1.53847,2.68714 1.53847,2.73558 0,0.0484 0.50686,0.94985 1.12634,2.00314 1.02725,1.7466 1.24632,2.46193 2.49027,8.13141 0.75016,3.41899 1.60685,6.82728 1.90376,7.57397 0.2969,0.74669 0.64515,1.62912 0.77388,1.96096 0.30006,0.77351 0.46645,0.65419 1.91131,-1.37059 z m -72.35196,-8.51154 c 3.7836,-1.88314 4.20091,-2.1707 3.90488,-2.69075 -0.12077,-0.21216 -0.89893,-1.10781 -1.72924,-1.99033 l -1.50965,-1.60458 -3.58318,1.0678 c -1.97075,0.58729 -3.877,1.16607 -4.23611,1.28618 -0.35911,0.12011 -1.59315,0.48925 -2.7423,0.82031 -1.14915,0.33106 -2.20601,0.70306 -2.34858,0.82667 -0.2369,0.2054 0.25139,0.73833 2.43878,2.66173 0.33531,0.29484 1.34563,0.63002 2.4594,0.81593 3.53693,0.59036 3.87244,0.53587 7.346,-1.19296 z m -5.77711,-10.8924 c 0.99347,-0.64118 1.45811,-1.09925 1.36394,-1.34466 -0.11351,-0.29581 -2.32903,-4.05817 -5.01504,-8.51647 -0.17387,-0.28859 -0.45717,-0.78914 -0.62956,-1.11234 -0.17238,-0.3232 -0.44147,-0.58891 -0.59797,-0.59046 -0.1565,-0.002 -1.87116,0.70715 -3.81035,1.57489 -2.88499,1.29096 -3.95303,1.93282 -5.87635,3.53148 -3.05527,2.53953 -3.30097,2.78255 -3.16682,3.13215 0.062,0.16146 0.53183,0.94883 1.04415,1.74973 l 0.9315,1.45617 2.42378,0.18638 c 1.33308,0.10251 3.89287,0.33176 5.68842,0.50944 5.62945,0.55708 5.92238,0.53499 7.6443,-0.57631 z m 81.62224,-3.13834 c 0.15943,-0.53866 0.58871,-2.13558 0.95396,-3.5487 0.36524,-1.41313 0.88088,-2.88222 1.14585,-3.26464 0.26498,-0.38243 0.881,-1.43095 1.36895,-2.33005 l 0.88717,-1.63473 -3.26096,-3.25097 -3.26095,-3.25097 -3.91757,-0.68322 c -2.15466,-0.37577 -4.15262,-0.7278 -4.43991,-0.78228 -2.32125,-0.44027 -3.26464,-0.53788 -3.26464,-0.33779 0,0.53675 1.66427,4.56046 2.05478,4.96784 0.23449,0.24463 1.42533,1.14889 2.6463,2.00948 1.22098,0.86058 2.33749,1.66303 2.48113,1.78321 0.14364,0.12019 0.99117,0.72823 1.88339,1.35121 1.11774,0.78045 1.70235,1.38709 1.87991,1.95075 0.31288,0.99324 2.11305,7.70387 2.11305,7.87697 0,0.0678 0.0989,0.12329 0.21983,0.12329 0.12091,0 0.35028,-0.44073 0.50971,-0.9794 z m -111.3355,-10.0879 c 1.2928,-0.35008 3.34952,-0.92982 4.5705,-1.28833 1.22097,-0.3585 3.86533,-1.0855 5.87635,-1.61555 2.01101,-0.53004 4.28031,-1.12948 5.04287,-1.33208 0.76256,-0.2026 2.01672,-0.71902 2.78702,-1.14761 0.99245,-0.55219 1.43858,-0.68517 1.53108,-0.45638 0.0763,0.18864 0.13911,0.13285 0.15115,-0.13417 0.0113,-0.25138 0.13815,-0.45705 0.28179,-0.45705 0.43849,0 0.32096,-0.32879 -1.43644,-4.01853 -0.93368,-1.96033 -1.69761,-3.63359 -1.69761,-3.71837 0,-0.1552 -1.56629,-3.53943 -1.72263,-3.72203 -0.12388,-0.14468 -1.66208,0.50923 -5.39435,2.29324 -1.8315,0.87545 -3.37706,1.59173 -3.43458,1.59173 -0.0575,0 -1.11269,0.47011 -2.34482,1.04468 -1.23213,0.57458 -2.39557,1.04469 -2.58541,1.04469 -0.18985,0 -0.45683,0.1087 -0.59329,0.24156 -0.39735,0.38685 -4.49403,2.37015 -4.89577,2.37015 -0.44905,0 -3.90218,5.12418 -3.79029,5.62451 0.0443,0.1979 0.8444,1.30761 1.77808,2.46601 1.95183,2.42159 1.64733,2.3587 5.87635,1.21353 z m 111.04554,-10.65888 c -0.0834,-0.20834 -0.14526,-0.14646 -0.15779,0.1578 -0.0113,0.27531 0.0504,0.42957 0.13717,0.34278 0.0868,-0.0868 0.0961,-0.31204 0.0206,-0.50058 z m -0.31796,-0.95657 c -0.14716,-0.15491 -0.64396,0.2377 -0.64396,0.50891 0,0.14083 0.16443,0.10451 0.36541,-0.0807 0.20098,-0.18522 0.32633,-0.37792 0.27855,-0.42821 z m -0.9879,-0.0881 c -0.0834,-0.20834 -0.14525,-0.14646 -0.15779,0.15779 -0.0113,0.27532 0.0504,0.42957 0.13718,0.34279 0.0868,-0.0868 0.0961,-0.31205 0.0206,-0.50058 z m -140.7122,-2.01667 c -0.77273,-1.04516 -0.99351,-0.82438 -0.23743,0.23743 0.31863,0.44747 0.63561,0.7573 0.70441,0.6885 0.0688,-0.0688 -0.14134,-0.48547 -0.46698,-0.92593 z m 20.54523,-4.56933 c 11.43434,-3.97036 14.38456,-4.98209 16.17306,-5.54626 1.14915,-0.3625 2.30875,-0.77651 2.57688,-0.92004 0.76989,-0.41209 4.96639,-1.75459 5.14316,-1.64533 0.26537,0.16401 -0.18313,-1.91143 -1.18729,-5.49417 -1.05204,-3.75356 -1.84772,-7.44377 -2.11564,-9.81188 -0.0964,-0.85199 -0.30699,-1.55832 -0.46799,-1.56964 -2.02196,-0.14212 -3.83947,0.1481 -5.86838,0.93706 -6.88599,2.67769 -8.76726,3.3967 -11.38814,4.35243 -1.58687,0.57867 -4.20334,1.56909 -5.8144,2.20093 -1.61105,0.63184 -3.03056,1.1488 -3.15446,1.1488 -0.12391,0 -2.03173,1.84019 -4.23961,4.0893 l -4.01434,4.08931 -0.83343,3.28878 c -0.52915,2.08806 -0.73734,3.34903 -0.57023,3.45382 0.14476,0.0908 1.21893,0.30039 2.38705,0.46582 1.16812,0.16543 3.6517,0.57513 5.51908,0.91045 4.49049,0.80634 5.65664,0.81385 7.85468,0.0506 z m 5.47883,-26.77264 c -0.0812,-0.13137 -0.006,-0.28609 0.16726,-0.34382 0.1987,-0.0662 0.15112,-0.16781 -0.12896,-0.27528 -0.32505,-0.12474 -0.44384,-0.0327 -0.44384,0.34382 0,0.28278 0.12446,0.51415 0.27658,0.51415 0.15212,0 0.21015,-0.10749 0.12896,-0.23887 z m 192.04267,-4.33163 1.83541,-1.56702 0.42845,-2.48113 c 0.23564,-1.36462 0.60137,-3.36176 0.81273,-4.4381 0.3709,-1.8888 0.36594,-1.97183 -0.14233,-2.38341 -0.28965,-0.23454 -0.45327,-0.49979 -0.36362,-0.58944 0.0897,-0.0897 -0.10235,-0.16301 -0.42667,-0.16301 -0.32432,0 -1.62946,-0.53703 -2.9003,-1.19339 l -2.31063,-1.19339 -2.8613,-7.22938 c -3.39624,-8.58093 -3.28216,-8.22963 -2.91674,-8.98242 0.26723,-0.5505 0.25993,-0.56013 -0.0928,-0.12242 -0.36859,0.45738 -0.38885,0.45616 -0.54401,-0.0327 -0.18946,-0.59695 -1.11374,-1.55642 -4.07426,-4.22936 l -2.16953,-1.95879 -3.36482,-6.92104 c -1.85065,-3.80657 -3.66513,-7.56743 -4.03217,-8.35747 -0.36704,-0.79005 -0.76424,-1.61274 -0.88268,-1.8282 -1.82774,-3.32527 -3.60125,-7.53406 -4.71869,-11.19814 l -1.32405,-4.34154 0.22632,-2.57713 c 0.14964,-1.70397 0.13568,-2.69252 -0.0412,-2.91772 -0.34049,-0.43351 -2.18254,-1.19259 -2.31367,-0.95343 -0.0543,0.0991 -0.31644,1.23791 -0.58246,2.53071 l -0.48367,2.35054 -2.22679,2.31016 -2.2268,2.31016 -4.44395,-0.15659 c -9.68794,-0.34137 -9.06164,-0.23076 -14.49904,-2.56049 -2.65741,-1.1386 -5.30177,-2.28264 -5.87635,-2.5423 -0.57457,-0.25967 -2.10242,-0.92051 -3.39522,-1.46854 -1.2928,-0.54803 -2.87941,-1.36374 -3.52581,-1.81268 -2.91528,-2.02475 -7.8285,-5.52768 -8.35748,-5.95854 -0.21546,-0.1755 -1.21444,-0.89831 -2.21995,-1.60625 -1.00551,-0.70793 -2.51631,-1.80866 -3.35734,-2.44606 -1.11683,-0.84644 -1.58405,-1.07008 -1.73279,-0.82942 -0.20767,0.33602 -0.38832,1.73687 -0.67416,5.2278 l -0.16039,1.95879 2.57058,1.41565 c 6.71703,3.69916 6.43355,3.49908 12.10333,8.54211 3.3413,2.97193 4.06066,3.48603 6.11239,4.3683 1.49084,0.64107 2.56876,0.95413 3.00347,0.87229 5.62181,-1.05835 5.14386,-1.02527 6.41934,-0.44422 0.64794,0.29516 1.44288,0.63757 1.76655,0.7609 0.58292,0.22213 0.74169,0.59692 3.12034,7.36601 0.50893,1.44827 0.53041,1.4685 1.88124,1.7708 1.3089,0.29292 1.4529,0.41568 3.42019,2.91585 1.12956,1.43553 2.16785,2.57202 2.30731,2.52554 0.13946,-0.0465 0.92453,-1.38659 1.74461,-2.978 0.82008,-1.59141 1.68297,-3.16748 1.91754,-3.50238 0.81681,-1.16616 5.44165,-5.98476 5.63149,-5.86743 0.10516,0.065 0.52105,0.95891 0.92421,1.9865 0.69602,1.77403 1.55601,2.96859 4.31482,5.99343 0.71132,0.77991 1.95385,2.97635 3.69366,6.52928 1.44196,2.94471 2.99303,6.0907 3.44683,6.99109 0.56481,1.12065 1.74956,2.60363 3.75568,4.70109 1.61182,1.6852 2.93569,3.18891 2.94194,3.34159 0.006,0.15267 0.30517,0.88663 0.66428,1.63103 0.77603,1.60864 0.79201,1.81121 0.19587,2.48243 -0.44411,0.50005 -0.44076,0.5046 0.11871,0.16103 0.31667,-0.19446 0.62614,-0.29925 0.68771,-0.23287 0.0616,0.0664 0.63695,1.32913 1.27861,2.8061 l 1.16665,2.68541 -0.61491,2.53801 c -0.33819,1.39591 -0.79491,3.35905 -1.01492,4.36253 -0.22001,1.00348 -0.48913,1.91362 -0.59805,2.02254 -0.1963,0.1963 -5.05701,-2.81444 -5.2243,-3.23594 -0.0479,-0.12064 -0.21388,-0.21935 -0.36889,-0.21935 -0.15501,0 -0.82099,-0.33951 -1.47997,-0.75447 -1.03826,-0.6538 -2.29253,-1.00082 -4.33219,-1.19859 -0.28728,-0.0279 -1.06062,-0.13903 -1.71852,-0.24706 -1.12251,-0.18432 -1.35574,-0.10883 -3.78698,1.22574 -6.14577,3.37356 -5.18015,3.05059 -10.37056,3.46868 l -2.034,0.16384 -3.32001,-2.00269 c -1.826,-1.10148 -3.93703,-2.40367 -4.69116,-2.89376 -0.75413,-0.49009 -1.37115,-0.8013 -1.37115,-0.69157 0,0.10972 0.42095,0.83867 0.93544,1.61988 1.87177,2.84214 2.13533,3.46567 2.32005,5.48874 0.36744,4.02432 0.42133,4.13053 2.91521,5.74576 1.93329,1.25215 2.45191,1.76315 4.04228,3.98286 1.00344,1.40053 1.9274,2.54642 2.05324,2.54642 0.12584,0 1.144,-1.20465 2.26257,-2.677 1.11857,-1.47236 2.1289,-2.79453 2.24516,-2.93818 0.11627,-0.14364 0.56264,-0.76066 0.99194,-1.37115 0.7086,-1.00767 0.88269,-1.11021 1.88888,-1.11259 0.60958,-0.001 2.24236,-0.0515 3.62838,-0.11132 2.57765,-0.1112 2.88526,-0.0571 7.9268,1.39318 1.00551,0.28926 2.85387,0.81633 4.10748,1.17127 2.55458,0.72329 2.88709,0.8756 2.67181,1.22393 -0.0826,0.13371 -0.0455,0.24312 0.0825,0.24312 0.12802,0 0.17985,0.63814 0.11517,1.41808 l -0.11759,1.41807 1.03398,0.27843 c 0.56869,0.15313 1.61092,0.39435 2.31606,0.53604 0.70515,0.14169 2.69241,0.60047 4.41614,1.01949 1.72373,0.41903 3.33026,0.74433 3.57006,0.72289 0.2398,-0.0214 1.26194,-0.74415 2.27141,-1.60602 z m -181.50555,-16.81579 3.23811,-0.16033 0.32555,-1.17527 c 0.75016,-2.70816 2.4698,-10.12874 2.4698,-10.65764 0,-0.315 -0.12398,-0.57272 -0.2755,-0.57272 -0.30747,0 -2.3674,-0.86863 -3.39425,-1.43129 -0.5713,-0.31303 -1.33458,-0.31104 -5.35401,0.014 -4.61216,0.37293 -5.21425,0.45741 -6.25475,0.87758 -0.69794,0.28184 -6.14569,2.05741 -10.90489,3.5542 -3.2287,1.01543 -3.87342,1.30325 -3.9776,1.77571 -0.32152,1.45807 -1.17953,6.24744 -1.17953,6.58404 0,0.23477 0.27274,0.38482 0.71822,0.39512 0.39502,0.009 1.89349,0.23064 3.32993,0.49222 2.14881,0.3913 3.97725,0.47463 10.31626,0.47017 4.2375,-0.003 9.16169,-0.0776 10.94266,-0.16575 z M 336.1537,386.7794 c 1.84803,-1.35129 2.34587,-1.91851 2.20851,-2.51629 -0.0717,-0.31201 -0.65873,-2.44772 -1.3045,-4.74603 -1.90514,-6.78031 -3.20205,-11.72069 -3.20445,-12.20677 -10e-4,-0.24974 -0.16918,-0.66108 -0.37323,-0.9141 -0.20405,-0.25302 -1.39615,-1.75283 -2.6491,-3.33292 -1.25295,-1.58009 -2.43345,-3.04917 -2.62334,-3.26464 -1.46517,-1.66258 -3.59217,-4.40955 -5.97963,-7.72253 -3.78301,-5.24953 -3.74297,-5.21162 -6.34172,-6.00429 -1.20958,-0.36894 -2.26066,-0.60937 -2.33575,-0.53429 -0.0751,0.0751 0.91848,1.81608 2.20792,3.86888 3.43733,5.47228 3.00606,4.42007 5.1693,12.61218 0.72024,2.72752 1.02453,3.18568 3.0489,4.59053 0.47521,0.32978 1.27041,0.94815 1.76711,1.37416 1.08473,0.93033 1.28707,1.34356 5.61021,11.45732 1.51705,3.54905 2.75827,6.52074 2.75827,6.60376 0,0.21321 0.81904,1.43843 0.96156,1.43843 0.0649,0 0.55086,-0.31653 1.07994,-0.7034 z m -9.4149,-9.48227 c 0.17941,-0.28729 0.28466,-0.52235 0.23389,-0.52235 -0.0508,0 -0.30504,0.23506 -0.56504,0.52235 -0.25999,0.28728 -0.36524,0.52234 -0.23388,0.52234 0.13135,0 0.38561,-0.23506 0.56503,-0.52234 z m 7.3734,-11.34554 c 0,-0.0633 -0.11753,-0.18781 -0.26117,-0.27659 -0.14365,-0.0888 -0.26117,-0.0369 -0.26117,0.11517 0,0.15212 0.11752,0.27659 0.26117,0.27659 0.14364,0 0.26117,-0.0518 0.26117,-0.11517 z M 212.66764,352.74703 c 0,-0.14364 -0.12446,-0.26117 -0.27659,-0.26117 -0.15212,0 -0.20394,0.11753 -0.11517,0.26117 0.0888,0.14364 0.21324,0.26117 0.27659,0.26117 0.0633,0 0.11517,-0.11753 0.11517,-0.26117 z m 80.31011,-19.65597 c 1.58009,-0.57984 2.913,-1.08667 2.96202,-1.1263 0.1759,-0.14218 -0.23463,-1.07369 -0.69064,-1.56711 -0.25572,-0.2767 -0.91425,-1.18194 -1.46339,-2.01165 -0.54913,-0.82971 -1.19063,-1.60742 -1.42555,-1.72824 -0.56291,-0.2895 -9.57091,-3.05995 -10.73481,-3.30153 -0.49804,-0.10337 -1.08567,-0.28768 -1.30585,-0.40957 -0.22018,-0.12188 -1.98695,-0.69222 -3.92614,-1.26741 -2.67618,-0.7938 -4.94187,-1.23323 -9.40216,-1.82357 l -5.87635,-0.77775 -1.23225,1.36016 c -0.67774,0.74809 -1.23599,1.49534 -1.24056,1.66055 -0.0111,0.4009 7.85125,6.01875 9.22616,6.59234 0.59498,0.24821 1.81632,0.66855 2.7141,0.93408 0.89778,0.26553 1.63232,0.55652 1.63232,0.64664 0,0.0901 0.20567,0.17489 0.45705,0.18838 0.25138,0.0135 3.56881,1.0797 7.37208,2.36936 l 6.91503,2.34483 1.57303,-0.51448 c 0.86517,-0.28297 2.86583,-0.9889 4.44591,-1.56873 z m 36.30969,1.6856 c -0.0804,-0.0804 -0.29115,-1.6e-4 -0.46831,0.17833 -0.25601,0.25793 -0.22602,0.28793 0.1462,0.1462 0.25758,-0.0981 0.40253,-0.24412 0.32211,-0.32453 z m -57.59513,-3.06932 c 0,-0.22394 -0.11945,-0.33335 -0.26543,-0.24312 -0.14599,0.0902 -0.19782,0.27345 -0.11517,0.40717 0.22388,0.36225 0.3806,0.29471 0.3806,-0.16405 z m -80.00861,-4.29391 c 0.14321,0 0.5453,-0.30836 0.89354,-0.68525 0.34823,-0.37688 1.42646,-1.3221 2.39606,-2.10049 0.9696,-0.77838 1.76291,-1.53014 1.76291,-1.67056 0,-0.14042 -0.79331,-0.78199 -1.76291,-1.42571 -0.9696,-0.64372 -2.4093,-1.6346 -3.19934,-2.20196 -0.79005,-0.56736 -1.55397,-1.03251 -1.69762,-1.03367 -0.14364,-0.001 -0.63915,0.32154 -1.10112,0.71712 -0.73077,0.62574 -0.8561,0.92141 -0.96416,2.27463 -0.21993,2.75404 -0.24637,4.72154 -0.0674,5.01119 0.096,0.15533 0.7234,0.64596 1.39422,1.0903 1.09534,0.72552 1.2638,0.76795 1.65254,0.41614 0.23808,-0.21546 0.55004,-0.39174 0.69324,-0.39174 z M 353.43886,491.4546 c 0,-0.11485 0.65589,-0.72587 1.45753,-1.35782 4.21205,-3.32047 5.01569,-3.96997 5.80251,-4.68962 1.48121,-1.35476 5.05926,-3.90623 5.28353,-3.76763 0.14672,0.0907 0.23446,0.0198 0.19499,-0.15748 -0.0395,-0.1773 1.16227,-1.29869 2.67054,-2.492 l 2.74229,-2.16964 2.48113,-0.0438 c 1.36462,-0.0241 3.42134,-0.0733 4.57049,-0.10921 9.08262,-0.28418 16.91861,-0.35817 16.58437,-0.15658 -0.21547,0.12995 -1.15409,0.42991 -2.08582,0.66657 -0.93173,0.23666 -1.93071,0.58516 -2.21996,0.77445 -0.28924,0.18929 -1.23105,0.54674 -2.09292,0.79434 -0.86186,0.2476 -2.09689,0.78724 -2.74449,1.1992 -2.38068,1.5144 -4.38015,2.3616 -7.44118,3.15289 -3.44119,0.88957 -5.6583,1.59671 -11.36094,3.62355 -2.08284,0.74028 -5.66741,1.99683 -7.96572,2.79232 -2.29831,0.79549 -4.5607,1.60451 -5.02754,1.79783 -0.46685,0.19331 -0.84881,0.25751 -0.84881,0.14266 z M 131.73467,369.767 c 0.34257,-0.26318 1.91566,-1.34295 3.49574,-2.3995 1.58009,-1.05654 4.51307,-3.01787 6.51774,-4.35849 l 3.64486,-2.4375 2.23149,0.1306 c 1.22732,0.0718 3.36999,0.19361 4.76148,0.27061 l 2.52999,0.14002 0.73465,-0.98351 c 0.40406,-0.54093 0.8649,-1.10104 1.0241,-1.24468 0.1592,-0.14364 0.9738,-1.08386 1.81023,-2.08937 2.45067,-2.94605 5.91163,-6.92103 6.02604,-6.92103 0.0581,0 -0.009,0.20567 -0.14807,0.45705 -0.13953,0.25137 -0.9145,2.04366 -1.72216,3.98286 -0.80767,1.93919 -2.1768,5.1418 -3.0425,7.11691 l -1.57401,3.5911 -3.17003,0.003 c -1.74352,10e-4 -5.32976,0.0727 -7.96942,0.15819 l -4.7994,0.15551 -2.77456,1.24051 c -1.52602,0.68228 -3.90011,1.78636 -5.27576,2.45352 -2.68349,1.30142 -3.29073,1.4953 -2.30041,0.73451 z m 21.38596,-5.7742 c 0,-0.35268 -0.4761,-0.59716 -0.78777,-0.40454 -0.14599,0.0902 -0.19782,0.27346 -0.11517,0.40718 0.19605,0.31722 0.90294,0.31516 0.90294,-0.003 z m 168.15618,-38.90181 c -2.81525,-1.85192 -5.57439,-3.5701 -6.13142,-3.81817 -0.55703,-0.24808 -1.65918,-0.74052 -2.44922,-1.09433 -1.87171,-0.83821 -1.85026,-0.82895 -6.26811,-2.70495 -2.08284,-0.88446 -4.25709,-1.81725 -4.83166,-2.07287 -0.57458,-0.25563 -1.6617,-0.7275 -2.41583,-1.04862 -0.75414,-0.32111 -1.37115,-0.68689 -1.37115,-0.81285 0,-0.28881 -0.26754,-0.2984 4.46861,0.16017 4.90854,0.47526 5.98327,0.57178 8.9817,0.80658 1.2928,0.10124 2.46807,0.20003 2.61171,0.21955 0.229,0.0311 2.9982,1.45106 11.04998,5.66604 l 2.17017,1.13605 10.35152,-5.21868 c 5.69333,-2.87027 10.47558,-5.26284 10.62722,-5.31683 0.53093,-0.18904 -3.27014,2.98433 -9.25274,7.72478 -0.21784,0.1726 -1.39505,1.1187 -2.61602,2.10245 -1.22098,0.98374 -3.51275,2.8195 -5.09284,4.07947 -1.58008,1.25997 -3.22546,2.57412 -3.65639,2.92034 -0.43094,0.34622 -0.84503,0.63163 -0.92021,0.63424 -0.0752,0.003 -2.44007,-1.51045 -5.25532,-3.36237 z"
       style="fill:#000000"
       inkscape:connector-curvature="0" />
    <g
       id="g6213"
       transform="matrix(0.67468761,0,0,0.27072384,25.215684,28.259119)"
       inkscape:export-filename="/home/bcdlog/workspace/Framework/war/shared/images/logo.png"
       inkscape:export-xdpi="157"
       inkscape:export-ydpi="157">
      <g
         id="g4683"
         transform="matrix(0,-0.80935242,0.32234026,0,106.27903,626.77097)"
         inkscape:export-xdpi="157"
         inkscape:export-ydpi="157"
         inkscape:export-filename="/home/bcdlog/Images/Voyage/Main+Tel-118x85.png">
        <path
           style="fill:#ffffff;stroke:#000000;stroke-width:0.7128616"
           inkscape:connector-curvature="0"
           d="m 312.54434,149.37973 -16.39582,179.64112 c 0,0 2.85145,24.2373 22.09871,26.37588 19.24726,2.13859 67.36542,6.77219 67.36542,6.77219 0,0 32.79164,8.55434 34.57379,-21.74228 1.78216,-30.29662 11.76222,-196.03694 11.76222,-196.03694 0,0 -2.13859,-16.75225 -20.67299,-17.82154 -18.5344,-1.0693 -78.05835,-4.63361 -78.05835,-4.63361 0,0 -20.67298,-3.92073 -20.67298,27.44518 z"
           id="path4968" />
        <g
           style="fill:#ebcca7;fill-opacity:1"
           id="g4942"
           transform="matrix(0.71286161,0,0,0.71286161,153.93263,-11.726997)">
          <path
             style="fill:#ebcca7;fill-opacity:1;stroke:#000000"
             inkscape:connector-curvature="0"
             d="m 195,487.5 c 0,0 -26.5,3.5 -39,-21 0,0 -11.5,-12.5 4.5,-13.5 16,-1 39,-7 39,-7 0,0 5.5,35.5 -4.5,41.5 z"
             id="path4944" />
          <path
             style="fill:#ebcca7;fill-opacity:1;stroke:#000000"
             inkscape:connector-curvature="0"
             d="m 202.5,389.5 c 0,0 -6,-7 -4.5,-13.5 0,0 -6,-7 -3,-11.5 3,-4.5 9.5,-0.5 9.5,-0.5"
             id="path4946" />
          <path
             style="fill:#ebcca7;fill-opacity:1;stroke:#000000"
             inkscape:connector-curvature="0"
             d="m 198,376 c 0,0 -2,-12.5 6.5,-7"
             id="path4948" />
          <path
             style="fill:#ebcca7;fill-opacity:1;stroke:#000000"
             inkscape:connector-curvature="0"
             d="m 155.5,463.5 c 0,0 -0.5,-10 11.5,-9"
             id="path4950" />
        </g>
        <g
           style="fill:#ebcca7;fill-opacity:1"
           id="g4952"
           transform="matrix(0.71286161,0,0,0.71286161,153.93263,-11.726997)">
          <path
             style="fill:#ebcca7;fill-opacity:1;stroke:#000000"
             inkscape:connector-curvature="0"
             d="m 305,594 c 0,0 -6.5,-3 -7.5,-15.5 0,0 -29.5,-13.5 -26.5,-18 5.5,7 -33.733,-2.826 -36,-6 0,0 -20,22.5 -41,1.5 0,0 -3,1 -5.5,-5 -2.5,-6 21.5,-19.5 23,-21 0,0 3,-3.5 5.5,-7.5 2.5,-4 128,-16 128,-16 L 305,594 z"
             id="path4954" />
          <path
             style="fill:#ebcca7;fill-opacity:1;stroke:#000000"
             inkscape:connector-curvature="0"
             d="m 235,554.5 c 0,0 10,-2.5 7.5,-21"
             id="path4956" />
          <line
             style="fill:#ebcca7;fill-opacity:1;stroke:#000000"
             x1="274"
             y1="543.5"
             x2="271.5"
             y2="563"
             id="line4958" />
          <path
             style="fill:#ebcca7;fill-opacity:1;stroke:#000000"
             inkscape:connector-curvature="0"
             d="m 313,549.5 c 0,0 -13.5,11 -15.5,29"
             id="path4960" />
          <path
             style="fill:#ebcca7;fill-opacity:1;stroke:#000000"
             inkscape:connector-curvature="0"
             d="m 192.5,552.5 c 0,0 0,-10.5 9,-8.5 l 12.5,-9 c 0,0 3,-5 -2.5,-5"
             id="path4962" />
          <line
             style="fill:#ebcca7;fill-opacity:1;stroke:#000000"
             x1="317"
             y1="540"
             x2="304"
             y2="533"
             id="line4964" />
        </g>
        <path
           style="fill:#000000;fill-opacity:1;stroke:#000000;stroke-width:0.7128616"
           inkscape:connector-curvature="0"
           d="m 305.77215,193.22072 -12.11864,139.72087 c 0,0 -4.6336,24.59373 21.74227,28.51447 26.37588,3.92073 87.68198,10.69292 87.68198,10.69292 0,0 21.38585,5.34646 23.88087,-22.81157 2.49501,-28.15804 14.97009,-202.09627 14.97009,-202.09627 0,0 3.56431,-24.59372 -24.23729,-26.01945 -27.80161,-1.42572 -86.61269,-5.70289 -86.61269,-5.70289 0,0 -19.60369,1.42572 -21.02942,21.38585 -1.42572,19.96012 -4.27717,56.31607 -4.27717,56.31607 z"
           id="path4966" />
        <g
           style="fill:#ebcca7;fill-opacity:1"
           id="g4970"
           transform="matrix(0.71286161,0,0,0.71286161,153.93263,-11.726997)">
          <path
             style="fill:#ebcca7;fill-opacity:1;stroke:#000000"
             inkscape:connector-curvature="0"
             d="m 303,611.5 c 0,0 9,-82.5 44.5,-120.5 0,0 6,-31.5 7,-41.5 1,-10 -12.5,-77.5 43.5,-106 0,0 24.5,-11 28.5,8.5 l -2.5,12.5 -2,12.5 c 0,0 9,17.5 12,28 3,10.5 14,45 20.5,54.5 6.5,9.5 13,24.5 7.5,39 -5.5,14.5 -8,63.5 -13.5,84 -5.5,20.5 -7,31.5 -7,31.5"
             id="path4972" />
          <path
             style="fill:#ebcca7;fill-opacity:1;stroke:#000000"
             inkscape:connector-curvature="0"
             d="m 422,377 c 0,0 -23.865,108.379 1,132 10,9.5 11.5,18.5 11.5,18.5"
             id="path4974" />
          <path
             style="fill:#ebcca7;fill-opacity:1;stroke:#000000"
             inkscape:connector-curvature="0"
             d="m 412,434 c 0,0 -9.5,-8.5 -18,-7"
             id="path4976" />
          <path
             style="fill:#ebcca7;fill-opacity:1;stroke:#000000"
             inkscape:connector-curvature="0"
             d="m 398,343.5 c 0,0 -14.5,26 -11.5,36.5 3,10.5 29,7.5 29,7.5 l 6,-15"
             id="path4978" />
        </g>
        <g
           id="g3906"
           transform="matrix(0.17770263,0,0,0.17770263,319.35854,191.34148)">
          <g
             transform="translate(997.49998,414.13777)"
             style="display:none"
             inkscape:label="jhl,"
             id="layer2">
            <image
               xlink:href="C:\Important\kuvat\My_OS\globe.png"
               sodipodi:absref="C:\Important\kuvat\My_OS\globe.png"
               width="518"
               height="518"
               id="image2164"
               x="-613.28571"
               y="33.362183" />
          </g>
          <g
             transform="translate(997.49998,414.13777)"
             style="display:inline"
             id="layer1-1"
             inkscape:label="Taso 1">
            <path
               inkscape:export-ydpi="25.555916"
               inkscape:export-xdpi="25.555916"
               inkscape:export-filename="C:\Important\kuvat\My_OS\inter.png"
               transform="matrix(1.4927536,0,0,1.3696809,-397.40579,-567.90779)"
               d="m -56,301.36218 c 0,103.82954 -77.23088,188 -172.5,188 -95.26912,0 -172.5,-84.17046 -172.5,-188 0,-103.82953 77.23088,-188 172.5,-188 95.26912,0 172.5,84.17047 172.5,188 z"
               sodipodi:ry="188"
               sodipodi:rx="172.5"
               sodipodi:cy="301.36218"
               sodipodi:cx="-228.5"
               id="path2167"
               style="fill:url(#radialGradient4955);fill-opacity:1;fill-rule:evenodd;stroke:#000000;stroke-width:2.09805799;stroke-linecap:round;stroke-linejoin:round;stroke-miterlimit:4;stroke-opacity:1;stroke-dasharray:none"
               sodipodi:type="arc" />
            <g
               transform="translate(-384,-448)"
               inkscape:export-ydpi="25.555916"
               inkscape:export-xdpi="25.555916"
               inkscape:export-filename="C:\Important\kuvat\My_OS\inter.png"
               style="fill:#000000;fill-opacity:0.60784314;stroke:none"
               id="g2230">
              <path
                 style="fill:#000000;fill-opacity:0.60784314;fill-rule:evenodd;stroke:none"
                 d="m -256.45711,54.18566 c 0,0 4.70711,5.689339 4.70711,5.68934 l 0.75,6 -5.75,3.5 -0.75,3.75 -8.5,-3.75 4.25,6.5 0.75,5 -4.75,3.75 -7.25,-5.75 9,0 -1,-4.25 -10.5,-4.25 -11.5,-1.5 -4.5,-2.5 -10.5,-1.75 -10.75,5.25 -3.75,1 0.25,5 -5.25,8.75 -9.75,10.75 -5.5,0.25 0.5,7 4.25,9.75 5.25,0.75 5.5,-4.25 5.75,0.75 4.25,7.25 3,6.75 3.5,2.25 8,-6.5 -1.5,-7.25 4.75,-6.75 -7,-5 -2.25,-7.75 6.25,-4.25 -0.5,-6.5 7,0.5 0.75,2.25 -3.5,6.25 0,4 3.5,6.75 4,1 0.25,1.5 3.75,0 9.75,-4 5,2.5 -1.5,1.75 -8.75,0 -2.25,3 3.5,6.25 -6.75,-0.75 0.75,13.75 -18.75,5.5 -4.5,-1.75 -5,1.25 -4.5,-3 -2.5,-14.25 -8.25,7.25 4.75,10.75 -14.5,2.75 -1,5.75 -11,6.5 -7.25,8.25 -5.75,0.25 -3.5,3 -11.5,-0.5 0.25,5 9,3.5 -0.25,2.75 4.25,4.75 -2.75,16.25 -28.5,-4 -7.75,2.25 0.75,13.25 -5.25,12.25 1.5,13.25 5.5,-0.5 7,8 2.25,0.5 1.75,-1.5 20.5,-5.75 8.25,-6.25 1.25,-10.5 3.25,-4.5 12,-4.5 -0.5,-8.75 5.25,-3.25 9.75,3 11.75,-7.5 6.25,2.25 13,14 5.25,2 11,7.25 4.25,7.5 -6,4 -11.75,0.75 -1,3.25 15.75,5.75 -0.5,-8 3.5,0 4.75,-9 -3.5,-4 1.5,-3.5 3.5,2.5 3,0.25 -1.25,-3.5 -10.25,-5.5 -1,-2.5 -7,-1.25 -5.75,-6.75 -5,-4.25 -3,-7 3.75,-1.5 1,2.5 4.75,0.25 4,4.5 22,13 0.25,7.25 3.75,6.5 6,4 5.75,11.5 8.25,1 -0.25,-6.75 3.5,-4.5 -5.25,-3 -4,-8 2.5,1.75 2,-0.25 -0.5,-5.5 9.75,1 7.5,16.25 10.125,6.125 5.25,1.125 0.625,-4.5 5,0.625 14.875,-3.5 2.625,7.625 0.875,22.25 -1.5,3.75 -11.875,1 -7.25,5.75 -25.875,-3.125 -4.5,-3.125 -6.125,-0.875 -8,5.375 0.625,9.125 -5.125,2 -6.5,-1.5 -6.5,-0.625 -9.5,-8.5 -15.375,-1.875 -9.125,-4.25 -1,-3.25 4.625,-6.875 -3.75,-5.625 2.375,-4.5 -5,-2.75 -4.625,-0.5 -2.25,1.875 -13.25,0 -4.875,2.125 -8.5,-2.25 -32.625,11.375 -4,-2.25 -11,-0.875 -1.25,-3 -4.125,-0.25 -1,4.375 -24,23.25 -0.5,7.75 -11.25,11 -9.5,2.25 -20.75,27.5 -7,13.25 3.25,5 -3.25,25.75 -6,7.25 3.5,8.25 -1,7.25 18.25,20 4.5,12.5 31,23 10,-2.75 25.5,4 22.75,-7 20,-0.5 6,11 17.5,-2 9,7.25 -4.75,9.5 -3.75,10.5 3.75,7 13.25,9.25 5,12.75 -2.25,2.75 3.5,6.75 -15.25,15.75 0.75,6.25 6.25,8.25 0.25,6.25 c 0,0 5.75,3.25 5.75,3.25 31.29357,-6.32089 60.82165,-20.57629 87,-40.5625 l -0.75,-0.4375 0,-3.5 30,-23.75 12.25,-35.25 33,-52.75 12.5,-32.75 -0.25,-16.25 -14,17.25 -5,-0.25 -1.25,-7.5 -6,-6.5 -5.75,0 -2.5,-9 -7.25,-9.25 -1.75,-12.5 -7.25,-8.75 -13.5,-24.75 5.25,-2.75 13.75,18.25 6,5.5 3.25,12.25 14.25,17.25 2.75,19.75 2.75,0 18.5,-30.5 7.75,-22.5 1,-28.75 -6,-4 -3.25,-8 -2,0.75 0,11.75 -4.5,4.75 -2,-9 -8.5,-6 -5,-10.5 4,-2.5 8.25,9.75 6.25,0.25 2,-4 6,4.5 7.25,-10.25 4.898286,11.0527 C -112.35468,177.33973 -152.95684,104.7751 -256.45711,54.18566 z M -177,161.125 l 5.25,1 9.5,9 8.75,11.5 11,16.5 -4,3.25 -7.75,-2.25 -2.75,-14 -13.5,-10.75 -6.5,-14.25 z m -50.25,7.25 7.25,0.75 7.75,9 6.25,-6.25 14.5,6 6.75,5.25 1,7 -13.25,1.5 -12.25,-2.25 -8,8.25 -8.75,-0.75 -5.25,-5.25 4,-23.25 z"
                 id="path2189"
                 sodipodi:nodetypes="ccccccccccccccccccccccccccccccccccccccccccccccccccccccccccccccccccccccccccccccccccccccccccccccccccccccccccccccccccccccccccccccccccccccccccccccccccccccccccccccccccccccccccccccccccccccccccccccccccccccccccccccccccccccccccccccccccccccccccccccccccccccccccccccccccccccccccccc"
                 inkscape:connector-curvature="0" />
              <path
                 style="fill:#000000;fill-opacity:0.60784314;fill-rule:evenodd;stroke:none"
                 d="m -375.82725,151.68492 22.09708,-3.71231 5.83363,-4.94975 -5.3033,-7.24784 -1.06066,-4.41942 -6.71751,-10.07627 0.17677,-8.83884 -6.71751,-3.0052 -6.01041,5.3033 2.47488,5.3033 -0.17678,6.89429 7.42462,0.35355 -1.59099,7.77818 -8.83883,6.18718 0.7071,2.82843 3.71231,1.41421 -7.24784,4.77298 1.23744,1.41421 z"
                 id="path2209"
                 inkscape:connector-curvature="0" />
              <path
                 style="fill:#000000;fill-opacity:0.60784314;fill-rule:evenodd;stroke:none"
                 d="m -375.29692,127.11296 -3.88909,12.9047 -15.02602,1.94454 1.06066,-4.24264 5.3033,-1.41421 0,-1.76777 -4.24264,-1.59099 3.0052,-5.48008 3.88909,0 2.47487,-3.0052 7.24785,0.53033 0.17678,2.12132 z"
                 id="path2211"
                 inkscape:connector-curvature="0" />
              <path
                 style="fill:#000000;fill-opacity:0.60784314;fill-rule:evenodd;stroke:none"
                 d="m -397.74756,86.454318 12.72792,-2.828427 1.23743,-4.419417 -3.0052,-2.474874 -12.72792,0.176777 -2.12132,-1.237437 -5.83363,4.596194 4.77297,6.187184 4.94975,0 z"
                 id="path2213"
                 inkscape:connector-curvature="0" />
              <path
                 style="fill:#000000;fill-opacity:0.60784314;fill-rule:evenodd;stroke:none"
                 d="m -310.95021,195.17199 -4.41941,1.59099 0.7071,5.12652 1.76777,2.47487 -3.0052,2.65165 1.06066,12.02082 6.0104,-1.94454 0.17678,-9.54595 -3.35876,-3.53553 1.76777,-1.59099 -0.70711,-7.24784 z"
                 id="path2215"
                 inkscape:connector-curvature="0" />
              <path
                 style="fill:#000000;fill-opacity:0.60784314;fill-rule:evenodd;stroke:none"
                 d="m -463.86205,90.696959 26.16295,-15.909902 14.84924,-1.06066 8.83884,-4.242641 21.92031,-3.889087 9.89949,-7.778175 16.97057,-12.020815 10.25305,-2.828427 -7.07107,-4.242641 -17.67767,-1.06066 -16.97056,0 -15.90991,7.424621 -38.89087,22.98097 -14.14214,13.788583 1.76777,8.838834 z"
                 id="path2217"
                 inkscape:connector-curvature="0" />
              <path
                 style="fill:#000000;fill-opacity:0.60784314;fill-rule:evenodd;stroke:none"
                 d="m -566.39253,145.85129 c 0,0 13.08147,-12.02082 13.08147,-12.02082 l 1.76777,5.3033 13.78858,-9.19238 -3.18198,-2.47488 10.6066,-10.25305 8.13173,0.35356 -12.72792,10.25305 5.3033,10.25304 9.19239,-13.78858 0,-4.24264 14.14213,-14.84924 4.94975,-12.727924 16.61701,-13.788582 20.85965,-11.313708 39.24443,-23.334524 c 0,0 -79.90307,14.672468 -141.77491,101.823378 z"
                 id="path2219"
                 sodipodi:nodetypes="ccccccccccccccccs"
                 inkscape:connector-curvature="0" />
              <path
                 style="fill:#000000;fill-opacity:0.60784314;fill-rule:evenodd;stroke:none"
                 d="m -541.99735,471.82751 -8.13173,-19.79899 6.01041,-7.07106 -7.42462,-15.2028 -15.2028,-19.79899 -13.08147,-12.02081 -15.2028,-28.99138 -8.13172,-33.23402 -6.71752,-22.98097 c 0,0 -2.12132,-20.15254 -2.12132,-20.15254 -4.59619,100.23238 70.00357,179.25156 70.00357,179.25156 z"
                 id="path2221"
                 sodipodi:nodetypes="cccccccccsc"
                 inkscape:connector-curvature="0" />
            </g>
          </g>
        </g>
      </g>
      <use
         x="0"
         y="0"
         xlink:href="#g4683"
         id="use4951"
         transform="translate(166.74384,-7.9152886)"
         width="744.09448"
         height="1052.3622" />
    </g>
    <g
       inkscape:label="Layer 1"
       id="layer1-9"
       transform="matrix(2.4401824,0,0,2.4401824,583.62611,592.51014)">
      <g
         transform="matrix(0.985998,0,0,0.968148,0.259974,-0.168682)"
         id="g9249">
        <path
           transform="matrix(0.0466167,0,0,0.04816667,-1.846527,-8.347044)"
           style="fill:none;stroke:#000000;stroke-width:35.09945679;stroke-miterlimit:4;stroke-opacity:1"
           sodipodi:type="arc"
           sodipodi:ry="410.27655"
           sodipodi:rx="416.03482"
           sodipodi:cy="607.53601"
           sodipodi:cx="470.73837"
           id="path1061"
           d="m 886.77319,607.53601 c 0,226.58948 -186.26513,410.27659 -416.03482,410.27659 -229.76968,0 -416.034818,-183.68711 -416.034818,-410.27659 0,-226.58948 186.265138,-410.27655 416.034818,-410.27655 229.76969,0 416.03482,183.68707 416.03482,410.27655 z" />
        <path
           transform="matrix(0.02949617,0,0,0.04816667,6.0631,-8.347045)"
           style="fill:none;stroke:#000000;stroke-width:44.12537384;stroke-miterlimit:4;stroke-opacity:1"
           sodipodi:type="arc"
           sodipodi:ry="410.27655"
           sodipodi:rx="416.03482"
           sodipodi:cy="607.53601"
           sodipodi:cx="470.73837"
           id="path2925"
           d="m 886.77319,607.53601 c 0,226.58948 -186.26513,410.27659 -416.03482,410.27659 -229.76968,0 -416.034818,-183.68711 -416.034818,-410.27659 0,-226.58948 186.265138,-410.27655 416.034818,-410.27655 229.76969,0 416.03482,183.68707 416.03482,410.27655 z" />
        <path
           transform="matrix(0.05197134,0,0,0.05442039,0.720286,-7.837578)"
           style="fill:none;stroke:#000000;stroke-width:31.2738781;stroke-linecap:butt;stroke-linejoin:miter;stroke-miterlimit:4;stroke-opacity:1"
           id="path2926"
           d="m 371.40826,162.70984 -5.75827,728.42085"
           inkscape:connector-curvature="0" />
        <path
           transform="matrix(0.05197134,0,0,0.05442039,0.720286,-7.837578)"
           style="fill:none;stroke:#000000;stroke-width:31.2738781;stroke-linecap:butt;stroke-linejoin:miter;stroke-miterlimit:4;stroke-opacity:1"
           id="path4169"
           d="M -3.1807573,525.94685 741.11646,522.76609"
           inkscape:connector-curvature="0" />
        <path
           transform="matrix(0.05197134,0,0,0.05442039,0.720286,-7.837578)"
           style="fill:none;stroke:#000000;stroke-width:31.2738781;stroke-linecap:butt;stroke-linejoin:miter;stroke-miterlimit:4;stroke-opacity:1"
           id="path4791"
           d="M 50.448472,343.0533 689.07781,339.87254"
           inkscape:connector-curvature="0" />
        <path
           transform="matrix(0.05197134,0,0,0.05442039,0.720286,-7.837578)"
           style="fill:none;stroke:#000000;stroke-width:31.2738781;stroke-linecap:butt;stroke-linejoin:miter;stroke-miterlimit:4;stroke-opacity:1"
           id="path4792"
           d="M 53.629229,719.97304 692.25857,716.79228"
           inkscape:connector-curvature="0" />
      </g>
    </g>
  </g>
</svg>
