<?xml version="1.0" encoding="UTF-8" standalone="no"?>
<!-- Created with Inkscape (http://www.inkscape.org/) -->

<svg
   xmlns:dc="http://purl.org/dc/elements/1.1/"
   xmlns:cc="http://creativecommons.org/ns#"
   xmlns:rdf="http://www.w3.org/1999/02/22-rdf-syntax-ns#"
   xmlns:svg="http://www.w3.org/2000/svg"
   xmlns="http://www.w3.org/2000/svg"
   xmlns:sodipodi="http://sodipodi.sourceforge.net/DTD/sodipodi-0.dtd"
   xmlns:inkscape="http://www.inkscape.org/namespaces/inkscape"
   width="779.81927"
   height="590.19177"
   id="svg3286"
   version="1.1"
   inkscape:version="0.47pre4 r22446"
   sodipodi:docname="LogoCarteDeVisite6.svg"
   inkscape:export-filename="/home/bertrand/Images/Bcdlog/Logo.png"
   inkscape:export-xdpi="157"
   inkscape:export-ydpi="157">
  <sodipodi:namedview
     id="base"
     pagecolor="#ffffff"
     bordercolor="#666666"
     borderopacity="1.0"
     inkscape:pageopacity="0.0"
     inkscape:pageshadow="2"
     inkscape:zoom="0.9249533"
     inkscape:cx="88.759185"
     inkscape:cy="232.52937"
     inkscape:document-units="px"
     inkscape:current-layer="g2648"
     showgrid="false"
     units="mm"
     height="53.98mm"
     inkscape:window-width="1680"
     inkscape:window-height="976"
     inkscape:window-x="0"
     inkscape:window-y="25"
     inkscape:window-maximized="1" />
  <defs
     id="defs3288">
    <inkscape:perspective
       sodipodi:type="inkscape:persp3d"
       inkscape:vp_x="0 : 526.18109 : 1"
       inkscape:vp_y="0 : 1000 : 0"
       inkscape:vp_z="744.09448 : 526.18109 : 1"
       inkscape:persp3d-origin="372.04724 : 350.78739 : 1"
       id="perspective3294" />
    <inkscape:perspective
       id="perspective3311"
       inkscape:persp3d-origin="0.5 : 0.33333333 : 1"
       inkscape:vp_z="1 : 0.5 : 1"
       inkscape:vp_y="0 : 1000 : 0"
       inkscape:vp_x="0 : 0.5 : 1"
       sodipodi:type="inkscape:persp3d" />
    <inkscape:perspective
       id="perspective3386"
       inkscape:persp3d-origin="0.5 : 0.33333333 : 1"
       inkscape:vp_z="1 : 0.5 : 1"
       inkscape:vp_y="0 : 1000 : 0"
       inkscape:vp_x="0 : 0.5 : 1"
       sodipodi:type="inkscape:persp3d" />
  </defs>
  <metadata
     id="metadata3291">
    <rdf:RDF>
      <cc:Work
         rdf:about="">
        <dc:format>image/svg+xml</dc:format>
        <dc:type
           rdf:resource="http://purl.org/dc/dcmitype/StillImage" />
        <dc:title></dc:title>
      </cc:Work>
    </rdf:RDF>
  </metadata>
  <g
     inkscape:label="Calque 1"
     inkscape:groupmode="layer"
     id="layer1"
     transform="translate(-37.937249,-430.51556)">
    <g
       style="fill:#3d2e3d;fill-opacity:1"
       transform="matrix(0.28422937,0,0,0.29182397,42.305406,996.47146)"
       inkscape:export-ydpi="344.15106"
       inkscape:export-xdpi="344.15106"
       inkscape:export-filename="/home/bertrand/Images/logo.png"
       id="g2648">
      <g
         style="fill:#90b8c0;fill-opacity:1;stroke:none"
         inkscape:label="Gear24"
         transform="matrix(11.053624,0.82934314,-0.87425529,11.053624,1811.8122,-1023.0306)"
         id="g3016"
         inkscape:export-filename="/home/bertrand/Images/Bcdlog/Logo.png"
         inkscape:export-xdpi="76.417191"
         inkscape:export-ydpi="76.417191">
        <path
           style="fill:#90b8c0;fill-opacity:1;stroke:none"
           d="m 69.802,-5.621 1.754,-0.141 4.675,0.766 6.498,2.719 0,4.554 -6.498,2.719 -4.675,0.766 -1.754,-0.141 -0.923,7.016 1.73,0.317 4.317,1.95 5.574,4.308 -1.179,4.4 -6.981,0.944 -4.714,-0.47 -1.657,-0.59 -2.708,6.537 1.589,0.755 3.666,3 4.268,5.604 -2.277,3.945 -6.987,-0.895 -4.432,-1.674 -1.448,-0.999 -4.308,5.614 1.34,1.14 2.764,3.847 2.673,6.518 -3.221,3.221 -6.518,-2.673 -3.847,-2.764 -1.14,-1.34 -5.614,4.308 0.999,1.448 1.674,4.432 0.895,6.987 -3.945,2.277 -5.604,-4.268 -3,-3.666 -0.755,-1.589 -6.537,2.708 0.59,1.657 0.47,4.714 -0.944,6.981 -4.4,1.179 -4.308,-5.574 -1.95,-4.317 -0.317,-1.73 -7.016,0.923 0.141,1.754 -0.766,4.675 -2.719,6.498 -4.554,0 -2.719,-6.498 -0.766,-4.675 0.141,-1.754 -7.016,-0.923 -0.317,1.73 -1.95,4.317 -4.308,5.574 -4.4,-1.179 -0.944,-6.981 0.47,-4.714 0.59,-1.657 -6.537,-2.708 -0.755,1.589 -3,3.666 -5.604,4.268 -3.945,-2.277 0.895,-6.987 1.674,-4.432 0.999,-1.448 -5.614,-4.308 -1.14,1.34 -3.847,2.764 -6.518,2.673 -3.221,-3.221 2.673,-6.518 2.764,-3.847 1.34,-1.14 -4.308,-5.614 -1.448,0.999 -4.432,1.674 -6.987,0.895 -2.277,-3.945 4.268,-5.604 3.666,-3 1.589,-0.755 -2.708,-6.537 -1.657,0.59 -4.714,0.47 -6.981,-0.944 -1.179,-4.4 5.574,-4.308 4.317,-1.95 1.73,-0.317 -0.923,-7.016 -1.754,0.141 -4.675,-0.766 -6.498,-2.719 0,-4.554 6.498,-2.719 4.675,-0.766 1.754,0.141 0.923,-7.016 -1.73,-0.317 -4.317,-1.95 -5.574,-4.308 1.179,-4.4 6.981,-0.944 4.714,0.47 1.657,0.59 2.708,-6.537 -1.589,-0.755 -3.666,-3 -4.268,-5.604 2.277,-3.945 6.987,0.895 4.432,1.674 1.448,0.999 4.308,-5.614 -1.34,-1.14 -2.764,-3.847 -2.673,-6.518 3.221,-3.221 6.518,2.673 3.847,2.764 1.14,1.34 5.614,-4.308 -0.999,-1.448 -1.674,-4.432 -0.895,-6.987 3.945,-2.277 5.604,4.268 3,3.666 0.755,1.589 6.537,-2.708 -0.59,-1.657 -0.47,-4.714 0.944,-6.981 4.4,-1.179 4.308,5.574 1.95,4.317 0.317,1.73 7.016,-0.923 -0.141,-1.754 0.766,-4.675 2.719,-6.498 4.554,0 2.719,6.498 0.766,4.675 -0.141,1.754 7.016,0.923 0.317,-1.73 1.95,-4.317 4.308,-5.574 4.4,1.179 0.944,6.981 -0.47,4.714 -0.59,1.657 6.537,2.708 0.755,-1.589 3,-3.666 5.604,-4.268 3.945,2.277 -0.895,6.987 -1.674,4.432 -0.999,1.448 5.614,4.308 1.14,-1.34 3.847,-2.764 6.518,-2.673 3.221,3.221 -2.673,6.518 -2.764,3.847 -1.34,1.14 4.308,5.614 1.448,-0.999 4.432,-1.674 6.987,-0.895 2.277,3.945 -4.268,5.604 -3.666,3 -1.589,0.755 2.708,6.537 1.657,-0.59 4.714,-0.47 6.981,0.944 1.179,4.4 -5.574,4.308 -4.317,1.95 -1.73,0.317 z"
           id="path3018" />
      </g>
      <g
         style="fill:#3d2e3d;fill-opacity:1;stroke:none"
         inkscape:label="Gear15"
         transform="matrix(11.014534,-1.2272416,1.2937016,11.014534,556.91189,-489.38135)"
         id="g3108"
         inkscape:export-filename="/home/bertrand/Images/Bcdlog/Logo.png"
         inkscape:export-xdpi="76.417191"
         inkscape:export-ydpi="76.417191">
        <path
           style="fill:#3d2e3d;fill-opacity:1;stroke:none"
           d="m 39.236,-4.716 3.306,-0.397 2.806,0.347 6.291,2.771 0,3.99 -6.291,2.771 -2.806,0.347 -3.306,-0.397 -1.474,6.934 3.182,0.982 2.422,1.459 4.62,5.09 -1.623,3.645 -6.874,-0.027 -2.705,-0.824 -2.859,-1.708 -4.166,5.735 2.507,2.191 1.62,2.318 2.15,6.53 -2.965,2.669 -6.269,-2.821 -2.136,-1.853 -1.917,-2.722 -6.139,3.544 1.399,3.022 0.537,2.776 -0.691,6.839 L 14.06,49.728 9.48,44.601 8.283,42.04 7.639,38.773 0.589,39.514 0.639,42.843 0,45.598 l -3.414,5.967 -3.968,-0.417 -2.098,-6.547 -0.052,-2.827 0.741,-3.246 -6.743,-2.191 -1.309,3.062 -1.703,2.257 -5.546,4.062 -3.455,-1.995 0.745,-6.834 1.103,-2.603 1.997,-2.665 -5.268,-4.743 -2.441,2.264 -2.475,1.369 -6.718,1.456 -2.345,-3.228 3.46,-5.94 2.066,-1.93 2.909,-1.622 -2.884,-6.476 -3.151,1.076 -2.817,0.244 -6.73,-1.403 -0.829,-3.903 5.577,-4.019 2.673,-0.923 3.316,-0.298 0,-7.09 -3.316,-0.298 -2.673,-0.923 -5.577,-4.019 0.829,-3.903 6.73,-1.403 2.817,0.244 3.151,1.076 2.884,-6.476 -2.909,-1.622 -2.066,-1.93 -3.46,-5.94 2.345,-3.228 6.718,1.456 2.475,1.369 2.441,2.264 5.268,-4.743 -1.997,-2.665 -1.103,-2.603 -0.745,-6.834 3.455,-1.995 5.546,4.062 1.703,2.257 1.309,3.062 6.743,-2.191 -0.741,-3.246 0.052,-2.827 2.098,-6.547 3.968,-0.417 3.414,5.967 0.639,2.755 -0.05,3.329 7.05,0.741 0.644,-3.267 1.197,-2.561 4.58,-5.127 3.795,1.233 0.691,6.839 -0.537,2.776 -1.399,3.022 6.139,3.544 1.917,-2.722 2.136,-1.853 6.269,-2.821 2.965,2.669 -2.15,6.53 -1.62,2.318 -2.507,2.191 4.166,5.735 2.859,-1.708 2.705,-0.824 6.874,-0.027 1.623,3.645 -4.62,5.09 -2.422,1.459 -3.182,0.982 z"
           id="path3110" />
      </g>
    </g>
  </g>
</svg>
