<?xml version="1.0" encoding="utf-8"?>
<!-- Generator: Adobe Illustrator 19.0.0, SVG Export Plug-In . SVG Version: 6.00 Build 0)  -->
<svg version="1.0" id="Calque_1" xmlns="http://www.w3.org/2000/svg" xmlns:xlink="http://www.w3.org/1999/xlink" x="0px" y="0px"
	 viewBox="0 0 300 300" style="enable-background:new 0 0 300 300;" xml:space="preserve">
<style type="text/css">
	.st0{fill:#5B581C;}
	.st1{fill:#E7E22E;}
	.st2{fill:#F8EB56;}
	.st3{opacity:4.000000e-002;fill:#6D543F;}
	.st4{fill:#64A8DD;}
	.st5{opacity:0.61;fill:#1E1E1E;}
	.st6{fill:#FFFFFF;}
	.st7{fill:#4CBFD8;}
	.st8{opacity:0.8;fill:none;stroke:#000000;stroke-width:10;stroke-miterlimit:10;}
	.st9{opacity:4.000000e-002;fill:#6D5540;}
	.st10{fill:none;stroke:#5B581C;stroke-width:8;stroke-miterlimit:10;}
</style>
<circle id="XMLID_1_" class="st0" cx="150" cy="150" r="107.3"/>
<circle id="XMLID_9_" class="st1" cx="150" cy="150" r="94"/>
<circle id="XMLID_6_" class="st2" cx="150" cy="150" r="80.7"/>
<path id="XMLID_8_" class="st3" d="M161,221.9c-44.6,0-80.7-36.1-80.7-80.7c0-23,9.6-43.7,25-58.4c-21.7,14.5-36,39.2-36,67.2
	c0,44.6,36.1,80.7,80.7,80.7c21.6,0,41.2-8.5,55.7-22.3C192.9,216.9,177.6,221.9,161,221.9z"/>
<path id="XMLID_22_" class="st4" d="M62.6,184.7c5.1,12.8,12.9,24.2,22.7,33.5l27.6-77.1l-30.7-11L62.6,184.7z"/>
<path id="XMLID_21_" class="st4" d="M214.5,130.1l-30.7,11l28.5,79.3c9.9-8.7,17.9-19.4,23.4-31.6L214.5,130.1z"/>
<g id="Calque_2_-_copie">
	<circle id="XMLID_4_" class="st5" cx="195.9" cy="126.3" r="27.9"/>
	<circle id="XMLID_3_" class="st6" cx="195.9" cy="126.3" r="24.2"/>
	<circle id="XMLID_2_" class="st7" cx="195.9" cy="126.3" r="10.3"/>
</g>
<g id="Calque_2_-_copie_2">
	<circle id="XMLID_11_" class="st5" cx="101.4" cy="126.3" r="27.9"/>
	<circle id="XMLID_10_" class="st6" cx="101.4" cy="126.3" r="24.2"/>
	<circle id="XMLID_7_" class="st7" cx="101.4" cy="126.3" r="10.3"/>
</g>
<path id="XMLID_5_" class="st8" d="M131.4,171.3c11.6-11.1,30-10.6,41,1"/>
<g id="Calque_4">
	<ellipse id="XMLID_12_" class="st2" cx="129" cy="232.1" rx="18.6" ry="35.3"/>
	<path id="XMLID_17_" class="st9" d="M129,196.8c-0.4,0-0.7,0-1,0.1c5.8,6,9.7,17.6,9.7,30.9c0,18.8-7.8,34.2-17.6,35.2
		c2.7,2.7,5.7,4.3,8.9,4.3c10.3,0,18.6-15.8,18.6-35.3C147.6,212.6,139.3,196.8,129,196.8z"/>
	<ellipse id="XMLID_13_" class="st10" cx="129" cy="232.1" rx="18.6" ry="35.3"/>
	<ellipse id="XMLID_18_" class="st2" cx="174.8" cy="232.1" rx="18.6" ry="35.3"/>
	<path id="XMLID_16_" class="st9" d="M174.8,196.8c0.4,0,0.7,0,1,0.1c-5.8,6-9.7,17.6-9.7,30.9c0,18.8,7.8,34.2,17.6,35.2
		c-2.7,2.7-5.7,4.3-8.9,4.3c-10.3,0-18.6-15.8-18.6-35.3C156.2,212.6,164.6,196.8,174.8,196.8z"/>
	<ellipse id="XMLID_15_" class="st10" cx="174.8" cy="232.1" rx="18.6" ry="35.3"/>
</g>
</svg>
