<?xml version="1.0" encoding="utf-8"?>
<!-- Generator: Adobe Illustrator 19.0.0, SVG Export Plug-In . SVG Version: 6.00 Build 0)  -->
<svg version="1.0" id="Calque_1" xmlns="http://www.w3.org/2000/svg" xmlns:xlink="http://www.w3.org/1999/xlink" x="0px" y="0px"
	 viewBox="0 0 300 300" style="enable-background:new 0 0 300 300;" xml:space="preserve">
<style type="text/css">
	.st0{fill:#D1A5CD;}
	.st1{opacity:0.2;fill:#FFFFFF;}
	.st2{fill:#638DB5;}
	.st3{fill:#FCD6B0;}
	.st4{opacity:8.000000e-002;fill:#010202;}
	.st5{opacity:3.000000e-002;fill:#010202;}
	.st6{fill:#333333;}
	.st7{fill:#010202;}
	.st8{display:none;fill:#010202;}
	.st9{opacity:0.36;fill:#FAFAFA;}
</style>
<circle id="XMLID_1_" class="st0" cx="150" cy="150" r="97.5"/>
<path id="XMLID_8_" class="st1" d="M194.3,63.1l-59.2,39.5l11.7,144.8c1.1,0,2.1,0.1,3.2,0.1c53.9,0,97.5-43.7,97.5-97.5
	C247.5,112.1,225.9,79.2,194.3,63.1z"/>
<path id="XMLID_9_" class="st2" d="M146.8,168.7c-23.9,0-43.2,23.9-43.2,53.3c0,5.1,0.6,10,1.7,14.7c13.4,6.9,28.6,10.8,44.7,10.8
	c13.3,0,25.9-2.7,37.5-7.5c1.6-5.6,2.5-11.7,2.5-18.1C190,192.5,170.7,168.7,146.8,168.7z"/>
<rect id="XMLID_3_" x="139.8" y="146.5" class="st3" width="14.1" height="28.9"/>
<path id="XMLID_15_" class="st4" d="M139.8,162.7c2.2,0.8,4.6,1.3,7,1.3c2.4,0,4.8-0.5,7-1.3v-16.1h-14.1V162.7z"/>
<ellipse id="XMLID_10_" class="st3" cx="146.8" cy="129.9" rx="24.5" ry="31"/>
<path id="XMLID_16_" class="st5" d="M167.9,145.7c-4.8-3.2-12.4-5.3-20.9-5.3c-8.8,0-16.5,2.2-21.2,5.5c4.3,9,12.1,15.1,21,15.1
	C155.8,161,163.7,154.8,167.9,145.7z"/>
<path id="XMLID_4_" class="st3" d="M164.6,176.4c0,5.3-6.9,11.6-17.8,11.6s-17.1-6.2-17.1-11.5s6.1-7.8,17.1-7.8
	S164.6,171.1,164.6,176.4z"/>
<g id="Calque_2">
	<path id="XMLID_2_" class="st6" d="M139.5,132.5h-6.9c-2.6,0-4.8-2.1-4.8-4.7v0c0-2.6,2.1-4.7,4.8-4.7h6.9c2.6,0,4.8,2.1,4.8,4.7v0
		C144.3,130.4,142.1,132.5,139.5,132.5z"/>
	<path id="XMLID_5_" class="st6" d="M160.6,132.5h-6.9c-2.6,0-4.8-2.1-4.8-4.7v0c0-2.6,2.1-4.7,4.8-4.7h6.9c2.6,0,4.8,2.1,4.8,4.7v0
		C165.4,130.4,163.2,132.5,160.6,132.5z"/>
	<rect id="XMLID_6_" x="141.9" y="126.6" class="st7" width="10.1" height="0.7"/>
	<rect id="XMLID_7_" x="141.9" y="124.6" class="st8" width="10.1" height="0.7"/>
	<path id="XMLID_14_" class="st9" d="M161.4,123.1c-2.2,2.3-6.2,6.5-8.8,9.3c0.4,0.1,0.8,0.2,1.2,0.2h6.9c2.6,0,4.8-2.1,4.8-4.8
		C165.4,125.4,163.6,123.4,161.4,123.1z"/>
</g>
</svg>
