<?xml version="1.0" encoding="utf-8"?>
<!-- Generator: Adobe Illustrator 19.0.0, SVG Export Plug-In . SVG Version: 6.00 Build 0)  -->
<svg version="1.0" id="Calque_1" xmlns="http://www.w3.org/2000/svg" xmlns:xlink="http://www.w3.org/1999/xlink" x="0px" y="0px"
	 viewBox="0 0 300 300" style="enable-background:new 0 0 300 300;" xml:space="preserve">
<style type="text/css">
	.st0{fill:#4D4C4C;}
	.st1{fill:#B3B2B2;}
	.st2{fill:#E2E1D7;}
	.st3{opacity:4.000000e-002;fill:#6D543F;}
	.st4{opacity:0.61;fill:#1E1E1E;}
	.st5{fill:#FFFFFF;}
	.st6{fill:#D64D4D;}
	.st7{fill:#B2B2B2;}
	.st8{fill:#353535;}
	.st9{fill:#010202;}
	.st10{fill:none;stroke:#3A3A3A;stroke-width:10;stroke-miterlimit:10;}
	.st11{fill:#4E4C4C;}
</style>
<circle id="XMLID_1_" class="st0" cx="150" cy="150" r="107.3"/>
<circle id="XMLID_9_" class="st1" cx="150" cy="150" r="94"/>
<circle id="XMLID_6_" class="st2" cx="150" cy="150" r="80.7"/>
<path id="XMLID_8_" class="st3" d="M161,221.9c-44.6,0-80.7-36.1-80.7-80.7c0-23,9.6-43.7,25-58.4c-21.7,14.5-36,39.2-36,67.2
	c0,44.6,36.1,80.7,80.7,80.7c21.6,0,41.2-8.5,55.7-22.3C192.9,216.9,177.6,221.9,161,221.9z"/>
<g id="Calque_2_-_copie">
	<circle id="XMLID_4_" class="st4" cx="197.9" cy="126.3" r="27.9"/>
	<circle id="XMLID_3_" class="st5" cx="197.9" cy="126.3" r="24.2"/>
	<circle id="XMLID_2_" class="st6" cx="197.9" cy="126.3" r="10.3"/>
</g>
<g id="Calque_2_-_copie_2">
	<circle id="XMLID_11_" class="st4" cx="101.4" cy="126.3" r="27.9"/>
	<circle id="XMLID_10_" class="st5" cx="101.4" cy="126.3" r="24.2"/>
	<circle id="XMLID_7_" class="st6" cx="101.4" cy="126.3" r="10.3"/>
</g>
<g id="Calque_6">
	<polygon id="XMLID_17_" class="st7" points="134.8,176 131.8,203 117.8,182 	"/>
	<polygon id="XMLID_18_" class="st7" points="166.1,176 169.1,203 183.1,182 	"/>
</g>
<g id="Calque_7">
	<path id="XMLID_16_" class="st8" d="M165.4,142.6c0,6-6.4,15.1-14.3,15.1s-14.3-9.1-14.3-15.1c0-6,6.4-10.9,14.3-10.9
		S165.4,136.5,165.4,142.6z"/>
	
		<ellipse id="XMLID_19_" transform="matrix(0.899 -0.4378 0.4378 0.899 -50.2121 77.459)" class="st9" cx="142.9" cy="147.6" rx="3.1" ry="3.7"/>
	
		<ellipse id="XMLID_21_" transform="matrix(-0.899 -0.4378 0.4378 -0.899 237.5673 350.0143)" class="st9" cx="159.1" cy="147.6" rx="3.1" ry="3.7"/>
</g>
<path id="XMLID_5_" class="st10" d="M195.9,190.1c-23.7-24.9-63-25.9-87.9-2.3"/>
<g id="Calque_4_-_copie">
	<path id="XMLID_15_" class="st11" d="M166.1,79.6c0,0,39.6-57.4,63.9-57.4s-1.5,67.6-1.5,67.6S199.2,105.7,166.1,79.6z"/>
	<path id="XMLID_14_" class="st2" d="M169.8,82.4c0,0,37.3-51.2,59.7-51.1c22.4,0-4.3,61.2-4.3,61.2S200.4,106.5,169.8,82.4z"/>
</g>
<g id="Calque_4_-_copie_2">
	<path id="XMLID_13_" class="st11" d="M132.9,77.7c0,0-39.6-57.4-63.9-57.4s1.5,67.6,1.5,67.6S99.8,103.8,132.9,77.7z"/>
	<path id="XMLID_12_" class="st2" d="M129.2,80.4c0,0-37.3-51.2-59.7-51.1c-22.4,0,4.3,61.2,4.3,61.2S98.6,104.6,129.2,80.4z"/>
</g>
</svg>
