<?xml version="1.0" encoding="utf-8"?>
<!-- Generator: Adobe Illustrator 19.0.0, SVG Export Plug-In . SVG Version: 6.00 Build 0)  -->
<svg version="1.0" id="Calque_1" xmlns="http://www.w3.org/2000/svg" xmlns:xlink="http://www.w3.org/1999/xlink" x="0px" y="0px"
	 viewBox="0 0 300 300" style="enable-background:new 0 0 300 300;" xml:space="preserve">
<style type="text/css">
	.st0{fill:url(#XMLID_3_);}
	.st1{display:none;fill:url(#XMLID_4_);}
	.st2{opacity:0.6;fill:#332814;}
	.st3{fill:url(#XMLID_5_);}
	.st4{opacity:0.6;fill:none;stroke:#2E2514;stroke-miterlimit:10;}
	.st5{opacity:0.6;fill:none;stroke:#2E2514;stroke-width:2;stroke-miterlimit:10;}
</style>
<radialGradient id="XMLID_3_" cx="146.8087" cy="197.1514" r="27.4156" gradientUnits="userSpaceOnUse">
	<stop  offset="0" style="stop-color:#FCC130"/>
	<stop  offset="0.2809" style="stop-color:#FDC800"/>
	<stop  offset="0.5602" style="stop-color:#F18F34"/>
	<stop  offset="0.7563" style="stop-color:#EF8D36"/>
	<stop  offset="1" style="stop-color:#F59D25"/>
</radialGradient>
<path id="XMLID_14_" class="st0" d="M183.7,194.3c-1.6-3.2-3.5-6.3-5.6-9c-7.9,8.2-19,13.4-31.3,13.4c-12.3,0-23.4-5.1-31.3-13.4
	c-2.1,2.7-4,5.8-5.6,9c9.6,9.1,22.6,14.7,36.9,14.7S174.1,203.4,183.7,194.3z"/>
<radialGradient id="XMLID_4_" cx="146.8087" cy="197.3371" r="25.8129" gradientUnits="userSpaceOnUse">
	<stop  offset="0" style="stop-color:#F59D25"/>
	<stop  offset="3.237949e-002" style="stop-color:#F4992A"/>
	<stop  offset="0.1332" style="stop-color:#F09033"/>
	<stop  offset="0.2407" style="stop-color:#EF8D36"/>
	<stop  offset="0.524" style="stop-color:#F18F34"/>
	<stop  offset="0.7998" style="stop-color:#FDC800"/>
	<stop  offset="1" style="stop-color:#FCC130"/>
</radialGradient>
<path id="XMLID_17_" class="st1" d="M146.8,205.1c13.6,0,26.1-5,35.7-13.1c-0.4-0.8-0.9-1.6-1.4-2.3c-9.3,7.7-21.3,12.4-34.3,12.4
	s-25-4.7-34.3-12.4c-0.5,0.8-0.9,1.5-1.4,2.3C120.7,200.1,133.2,205.1,146.8,205.1z"/>
<path id="XMLID_18_" class="st2" d="M146.8,205.1c13.6,0,26.1-5,35.7-13.1c-0.4-0.8-0.9-1.6-1.4-2.3c-9.3,7.7-21.3,12.4-34.3,12.4
	s-25-4.7-34.3-12.4c-0.5,0.8-0.9,1.5-1.4,2.3C120.7,200.1,133.2,205.1,146.8,205.1z"/>
<radialGradient id="XMLID_5_" cx="143.875" cy="219.6856" r="8.8864" gradientTransform="matrix(-4.489659e-011 1 -1 -4.489659e-011 365.7689 73.1856)" gradientUnits="userSpaceOnUse">
	<stop  offset="0" style="stop-color:#FCC130"/>
	<stop  offset="0.3499" style="stop-color:#FDC800"/>
	<stop  offset="1" style="stop-color:#EF8D36;stop-opacity:0.9"/>
</radialGradient>
<polygon id="XMLID_2_" class="st3" points="137.9,212.3 146.1,207.6 154.3,212.3 154.3,221.8 146.1,226.6 137.9,221.8 "/>
<polygon id="XMLID_12_" class="st4" points="137.9,212.3 146.1,207.6 154.3,212.3 154.3,221.8 146.1,226.6 137.9,221.8 "/>
<polygon id="XMLID_19_" class="st5" points="141.9,214.7 146.1,212.3 150.2,214.7 150.2,219.5 146.1,221.9 141.9,219.5 "/>
</svg>
