vu_handler_rdnor with test buffer 0x400c57550
0x400c57550 |0x80000014 0x58600003 0x00000003 0x01827ec0 0x00000000 0x01827fc0 0x00000000 0x01826000
0x400c57570 |0x00000000 0x01826080 0x00000000 0x018260c0 0x00000000 0x01826180 0x00000000 0x01827000
0x400c57590 |0x00000000 0x01827e80 0x00000000 0x7b1c3ab6 0xcdcdcdcd 0xcdcdcdcd 0xabababab 0xabababab
0x400c575b0 |0xffffffff 0xffffffff 0xffffffff 0xffffffff 0xffffffff 0xffffffff 0xffffffff 0xffffffff
0x400c575d0 |0xffffffff 0xffffffff 0xffffffff 0xffffffff 0xffffffff 0xffffffff 0xffffffff 0xffffffff
0x400c575f0 |0xffffffff 0xffffffff 0xffffffff 0xffffffff 0xffffffff 0xffffffff 0xffffffff 0xffffffff
0x400c57610 |0xffffffff 0xffffffff 0xffffffff 0xffffffff 0xffffffff 0xffffffff 0xffffffff 0xffffffff
0x400c57630 |0xffffffff 0xffffffff 0xffffffff 0xffffffff 0xffffffff 0xffffffff 0xffffffff 0xffffffff
0x400c57650 |0xffffffff 0xffffffff 0xffffffff 0xffffffff 0xffffffff 0xffffffff 0xffffffff 0xffffffff
0x400c57670 |0xffffffff 0xffffffff 0xffffffff 0xffffffff 0xffffffff 0xffffffff 0xffffffff 0xffffffff
0x400c57690 |0xffffffff 0xffffffff 0xffffffff 0xffffffff 0xffffffff 0xffffffff 0xffffffff 0xffffffff
0x400c576b0 |0xffffffff 0xffffffff 0xffffffff 0xffffffff 0xffffffff 0xffffffff 0xffffffff 0xffffffff
0x400c576d0 |0xffffffff 0xffffffff 0xffffffff 0xffffffff 0xffffffff 0xffffffff 0xffffffff 0xffffffff
0x400c576f0 |0xffffffff 0xffffffff 0xffffffff 0xffffffff 0xffffffff 0xffffffff 0xffffffff 0xffffffff
0x400c57710 |0xffffffff 0xffffffff 0xffffffff 0xffffffff 0xffffffff 0xffffffff 0xffffffff 0xffffffff
0x400c57730 |0xffffffff 0xffffffff 0xffffffff 0xffffffff 0xffffffff 0xffffffff 0xffffffff 0xffffffff
0x400c57750 |0xffffffff 0xffffffff 0xffffffff 0xffffffff 0xffffffff 0xffffffff 0xffffffff 0xffffffff
0x400c57770 |0xffffffff 0xffffffff 0xffffffff 0xffffffff 0xffffffff 0xffffffff 0xffffffff 0xffffffff
0x400c57790 |0xffffffff 0xffffffff 0xffffffff 0xffffffff 0xffffffff 0xffffffff 0xffffffff 0xffffffff
0x400c577b0 |0xffffffff 0xffffffff 0xffffffff 0xffffffff 0xffffffff 0xffffffff 0xffffffff 0xffffffff
0x400c577d0 |0xffffffff 0xffffffff 0xffffffff 0xffffffff 0xffffffff 0xffffffff 0xffffffff 0xffffffff
0x400c577f0 |0xffffffff 0xffffffff 0xffffffff 0xffffffff 0xffffffff 0xffffffff 0xffffffff 0xffffffff
0x400c57810 |0xffffffff 0xffffffff 0xffffffff 0xffffffff 0xffffffff 0xffffffff 0xffffffff 0xffffffff
0x400c57830 |0xffffffff 0xffffffff 0xffffffff 0xffffffff 0xffffffff 0xffffffff 0xffffffff 0xffffffff
0x400c57850 |0xffffffff 0xffffffff 0xffffffff 0xffffffff 0xffffffff 0xffffffff 0xffffffff 0xffffffff
0x400c57870 |0xffffffff 0xffffffff 0xffffffff 0xffffffff 0xffffffff 0xffffffff 0xffffffff 0xffffffff
0x400c57890 |0xffffffff 0xffffffff 0xffffffff 0xffffffff 0xffffffff 0xffffffff 0xffffffff 0xffffffff
0x400c578b0 |0xffffffff 0xffffffff 0xffffffff 0xffffffff 0xffffffff 0xffffffff 0xffffffff 0xffffffff
0x400c578d0 |0xffffffff 0xffffffff 0xffffffff 0xffffffff 0xffffffff 0xffffffff 0xffffffff 0xffffffff
0x400c578f0 |0xffffffff 0xffffffff 0xffffffff 0xffffffff 0xffffffff 0xffffffff 0xffffffff 0xffffffff
0x400c57910 |0xffffffff 0xffffffff 0xffffffff 0xffffffff 0xffffffff 0xffffffff 0xffffffff 0xffffffff
0x400c57930 |0xffffffff 0xffffffff 0xffffffff 0xffffffff 0xffffffff 0xffffffff 0xffffffff 0xffffffff
0x400c57950 |0x000c0013 0x00030003 0x00090009 0x00080000 0x00010030 0x00800030 0x0780007b 0x007e0780
0x400c57970 |0x0000013e 0x0c217f2c 0x0c217f3d 0x0c21bbe6 0x0c21bc51 0xffffffff 0xffffffff 0x00008c24
0x400c57990 |0x00010001 0x00090e01 0x05090305 0x031a0100 0x1001000a 0x03010018 0x00060202 0x04010801
0x400c579b0 |0x02050007 0x07010105 0x05000509 0x0011070e 0x0c09000d 0xffff0005 0xffffffff 0xffffffff
0x400c579d0 |0xc008e215 0x00281008 0x00000000 0x00000000 0x00000000 0x00000000 0x00010000 0x00000000
0x400c579f0 |0x06060606 0x06060606 0x0a040200 0x332b1f13 0x00000000 0x00000000 0x0dff01ff 0x00010000
0x400c57a10 |0x807f7e80 0x80808000 0x8080807b 0x80802020 0x80808080 0x80408080 0x80178080 0x00808080
0x400c57a30 |0x14140f01 0x00602080 0x20400020 0x00000000 0x00000000 0x00000000 0x00000000 0x00000000
0x400c57a50 |0x00000000 0x00000000 0x00000000 0x00000000 0x00000000 0x00000000 0x00000000 0x00000003
0x400c57a70 |0x00000000 0x01010000 0x00000000 0x00000000 0x00000000 0x00000000 0x00000000 0x00000000
0x400c57a90 |0x00000000 0x00000000 0x00000000 0x00000000 0x00000000 0x001c0000 0x0c21cd50 0x00068f80
0x400c57ab0 |0xa4a4a4a4 0x39393939 0x00000000 0x2c2c2c2c 0x80808080 0x00000000 0x0a0a8a12 0x00000000
0x400c57ad0 |0xffffffff 0xffffffff 0xffffffff 0xffffffff 0xffffffff 0xffffffff 0x00000000 0x00000000
0x400c57af0 |0x7c582fc0 0x00000000 0xffffffff 0xffffffff 0x7200dfc0 0x00000000 0xffffffff 0xffffffff
0x400c57b10 |0x72800fc0 0x00000000 0x72019fc0 0x00000000 0x658ad280 0x00000000 0x6652b2c0 0x00000000
0x400c57b30 |0xffffffff 0xffffffff 0x00000031 0x00000000 0x00000000 0x06000000 0x00000003 0x00000010
0x400c57b50 |0x00000000 0x0000000e 0x00000000 0x0000007c 0x00000000 0x00000000 0x00100036 0x00000000
0x400c57b70 |0x00001000 0x00001000 0x00000000 0x00300000 0x00080808 0x08080008 0x00000000 0x00000000
0x400c57b90 |0x00000000 0x0ff00060 0x0ff01700 0x00401640 0x00000140 0x00000001 0x17000980 0x12071030
0x400c57bb0 |0xffff0000 0x01130200 0x00710200 0x00700280 0x02000438 0xff000797 0xea15f101 0x010d0362
0x400c57bd0 |0x02800000 0xff001822 0x14980001 0x010d0362 0x02800000 0x0c420001 0x5602c021 0x00002734
0x400c57bf0 |0xf40140c4 0x56162734 0x00362362 0xff383838 0xf1800001 0xff098010 0x00000000 0x00000000
0x400c57c10 |0xf0982101 0xb0910001 0x0000315f 0x6401315f 0x75000001 0x915f0000 0x0000087c 0x11000139
0x400c57c30 |0xff0100f0 0xff113001 0x1e1e1001 0x01bc0181 0xfffef401 0x00700280 0x02000438 0xff000767
0x400c57c50 |0x15f01001 0x00000000 0x10712270 0x03f11800 0x00090290 0x140c0000 0x00000000 0x11131f80
0x400c57c70 |0x07d11800 0x00090290 0x140c0000 0x00000000 0xd0f43170 0x17b11800 0x00090210 0x140c0000
0x400c57c90 |0x00000000 0xd0921fb0 0x10b11800 0x00090210 0x140c0000 0x00000000 0xd09c1740 0x16f11800
0x400c57cb0 |0x00090210 0x140c0000 0x00000000 0xd0632810 0x01511800 0x00090210 0x140c0000 0x00000000
0x400c57cd0 |0xd0902720 0x01e11800 0x00090210 0x140c0000 0x00000000 0xd1731c50 0x11911800 0x00090210
0x400c57cf0 |0x140c0000 0x00000000 0xd1900e90 0x10d11800 0x00090210 0x140c0000 0x00000000 0xd0b92170
0x400c57d10 |0x04811800 0x00090290 0x140c0000 0x00000000 0xd03b0e00 0x12911800 0x00090290 0x140c0000
0x400c57d30 |0x00000000 0xd1b12180 0x08711800 0x00090290 0x140c0000 0x00000000 0xd11f2220 0x19711800
0x400c57d50 |0x00090210 0x140c0000 0x00000000 0xd0e31cb0 0x06811800 0x00090210 0x140c0000 0x00000000
0x400c57d70 |0xd1002800 0x0c411800 0x00090210 0x140c0000 0x00000000 0xd0871940 0x15f11800 0x00090210
0x400c57d90 |0x140c0000 0xdeefdeef 0x00200000 0x00000000 0x00000000 0x00000000 0x00000000 0x18850400
0x400c57db0 |0x00000010 0x00000010 0x00000010 0x00000010 0x00000010 0x00000010 0x00000010 0x00000010
0x400c57dd0 |0x00000010 0x00000010 0x00000010 0x00000010 0x00000010 0x00000010 0x00000010 0x00000010
0x400c57df0 |0x00000000 0xff000000 0xff000000 0x00800000 0x00002111 0x00000000 0x10311031 0x15511551
0x400c57e10 |0x10311551 0xb45ab45a 0xba21b45a 0xba21ba21 0x00000000 0x00000000 0x0008002a 0x00ffff00
0x400c57e30 |0x10741074 0x00000000 0x00808080 0x150f150f 0x3fffc000 0xffffffff 0x00000000 0x00000000
0x400c57e50 |0x00000000 0x00000000 0x00000000 0x00000000 0x00000000 0x00450045 0x000008a0 0x00000010
0x400c57e70 |0x00000000 0x001777ff 0x0cc80cc8 0x77f977f9 0x00000000 0x10741074 0x85e585e5 0x43824382
0x400c57e90 |0x00000000 0x00000000 0x91d291d2 0x9aaa0008 0x80000044 0x10311031 0xb43ab43a 0xb438b43a
0x400c57eb0 |0xb438b438 0xb43ab43a 0x000cb43a 0xffffffff 0x00000000 0x00000000 0x0000f000 0x00000003
0x400c57ed0 |0x0000000e 0x00000000 0x00200000 0x00000000 0x00000000 0x00000000 0x00000000 0x00000000
0x400c57ef0 |0x00000000 0x00000000 0x00000000 0x00000000 0x00000000 0xffffffff 0xffffffff 0xffffffff
0x400c57f10 |0xffffffff 0xffffffff 0xffffffff 0xffffffff 0xffffffff 0xffffffff 0xffffffff 0xffffffff
0x400c57f30 |0xffffffff 0xffffffff 0xffffffff 0xffffffff 0xffffffff 0xffffffff 0xffffffff 0xffffffff
0x400c57f50 |0x00000014 0x00030003 0x00090009 0x00080000 0x00010030 0x00800030 0x07800080 0x007e0780
0x400c57f70 |0x0000013e 0x0c217f2c 0x0c217f3d 0x0c21bbe6 0x0c21bc51 0x0c21d5f1 0x0c21d7a2 0x00008c24
0x400c57f90 |0x00010001 0x00090e01 0x05090305 0x03010100 0x1001000a 0x03010018 0x00060202 0x04030801
0x400c57fb0 |0x02050007 0x07010105 0x05000509 0x0011070e 0x0009000d 0xffff0005 0xffffffff 0xffffffff
0x400c57fd0 |0xc008a215 0x00201008 0x00000000 0x00000000 0x00000000 0x00000000 0x00010000 0x00000000
0x400c57ff0 |0x06060606 0x06060606 0x0a040200 0x33241e0f 0x00000000 0x00000000 0x0fff01ff 0x00010000
0x400c58010 |0x807f7e80 0x80808000 0x80808080 0x80802020 0x80808080 0x80408080 0x80178080 0x00808080
0x400c58030 |0x00110f01 0x00602080 0x20400020 0x00000000 0x00000000 0x00000000 0x00000000 0x00000000
0x400c58050 |0x00000000 0x00000000 0x00000000 0x00000000 0x00000000 0x00000000 0x00000000 0x00000003
0x400c58070 |0x00000000 0x01010000 0x00000000 0x00000000 0x00000000 0x00000000 0x00000000 0x00000000
0x400c58090 |0x00000000 0x00000000 0x00000000 0x00000000 0x00000000 0x00ff0000 0x0c221b74 0x0006dd76
0x400c580b0 |0xa4a4a4a4 0x39393939 0x10101010 0x2d2d2d2d 0x80808080 0x00000000 0x0a0a8a12 0x00000000
0x400c580d0 |0xffffffff 0xffffffff 0xffffffff 0xffffffff 0xffffffff 0xffffffff 0x00000000 0x00000000
0x400c580f0 |0x7c582fc0 0x00000000 0xffffffff 0xffffffff 0x7200dfc0 0x00000000 0xffffffff 0xffffffff
0x400c58110 |0x72800fc0 0x00000000 0x72019fc0 0x00000000 0x658ad280 0x00000000 0x6652b2c0 0x00000000
0x400c58130 |0xffffffff 0xffffffff 0x00000031 0x00000000 0x00000000 0x06000000 0x00000003 0x00000010
0x400c58150 |0x00000000 0x0000000e 0x00000000 0x0000007c 0x00000000 0x00000000 0x00100036 0x00000000
0x400c58170 |0x00001000 0x00001000 0x00000000 0x00300000 0x00080808 0x08080008 0x00000000 0x00000000
0x400c58190 |0x00000000 0x0ff00390 0x0ff00d00 0x00b68640 0x00000140 0x00000001 0x17000c00 0x12071030
0x400c581b0 |0xffff0000 0x01130200 0x00710200 0x00700280 0x02000448 0xff000798 0xea0db101 0x010d0363
0x400c581d0 |0x02800000 0xff001922 0x14980001 0x010d0363 0x02800000 0x0db20001 0x5704c021 0x00002735
0x400c581f0 |0xf40140db 0x57182735 0x00363363 0xff484848 0xf1800001 0xff0c0010 0x00000000 0x00000000
0x400c58210 |0xf0c02101 0x80b10001 0x000030db 0x6c0130db 0x72000001 0xb0db0000 0x0000082c 0x11000139
0x400c58230 |0xff0100f0 0xff113001 0x1e1e1001 0x01bc0181 0xfffef401 0x00700280 0x02000448 0xff000768
0x400c58250 |0x0db01001 0x00000000 0x10712270 0x03f11800 0x00090290 0x140c0000 0x00000000 0x11131f80
0x400c58270 |0x07d11800 0x00090210 0x140c0000 0x00000000 0xd0f43170 0x17b11800 0x00090210 0x140c0000
0x400c58290 |0x00000000 0xd0921fb0 0x10b11800 0x00090210 0x140c0000 0x00000000 0xd09c1740 0x16f11800
0x400c582b0 |0x00090290 0x140c0000 0x00000000 0xd0632810 0x0db11800 0x00090290 0x140c0000 0x00000000
0x400c582d0 |0xd0902720 0x01e11800 0x00090210 0x140c0000 0x00000000 0xd1731c50 0x11911800 0x00090210
0x400c582f0 |0x140c0000 0x00000000 0xd1900e90 0x10d11800 0x00090290 0x140c0000 0x00000000 0xd0b92170
0x400c58310 |0x04811800 0x00090210 0x140c0000 0x00000000 0xd03b0e00 0x12911800 0x00090210 0x140c0000
0x400c58330 |0x00000000 0xd1b12180 0x08711800 0x00090210 0x140c0000 0x00000000 0xd11f2220 0x19711800
0x400c58350 |0x00090210 0x140c0000 0x00000000 0xd0e31cb0 0x06811800 0x00090210 0x140c0000 0x00000000
0x400c58370 |0xd1002800 0x0c411800 0x00090210 0x140c0000 0x00000000 0xd0871940 0x15f11800 0x00090290
0x400c58390 |0x140c0000 0xdef0def0 0x00200000 0x00000000 0x00000000 0x00000000 0x00000000 0x18856400
0x400c583b0 |0x00000010 0x00000010 0x00000010 0x00000010 0x00000010 0x00000010 0x00000010 0x00000010
0x400c583d0 |0x00000010 0x00000010 0x00000010 0x00000010 0x00000010 0x00000010 0x00000010 0x00000010
0x400c583f0 |0x00000000 0xff000000 0xff000000 0x00800000 0x00002111 0x00000000 0x10321032 0x15721572
0x400c58410 |0x10321572 0xb46ab46a 0xba41b46a 0xba41ba41 0x00000000 0x00000000 0x0008002a 0x00ffff00
0x400c58430 |0x10751075 0x00000000 0x00a0a0a0 0x15301530 0x3fffc000 0xffffffff 0x00000000 0x00000000
0x400c58450 |0x00000000 0x00000000 0x00000000 0x00000000 0x00000000 0x00450045 0x000008a0 0x00000010
0x400c58470 |0x00000000 0x001777ff 0x0cc90cc9 0x77f977f9 0x00000000 0x10751075 0x85e585e5 0x43844384
0x400c58490 |0x00000000 0x00000000 0x91d291d2 0x9aaa0008 0x80000044 0x10321032 0xb44ab44a 0xb448b44a
0x400c584b0 |0xb448b448 0xb44ab44a 0x000cb44a 0xffffffff 0x00000000 0x00000000 0x0000f000 0x00000003
0x400c584d0 |0x0000000e 0x00000000 0x00200000 0x00000000 0x00000000 0x00000000 0x00000000 0x00000000
0x400c584f0 |0x00000000 0x00000000 0x00000000 0x00000000 0x00000000 0xffffffff 0xffffffff 0xffffffff
0x400c58510 |0xffffffff 0xffffffff 0xffffffff 0xffffffff 0xffffffff 0xffffffff 0xffffffff 0xffffffff
0x400c58530 |0xffffffff 0xffffffff 0xffffffff 0xffffffff 0xffffffff 0xffffffff 0xffffffff 0xffffffff
