{
    "configurations": [
        {
            "name": "Win32",
            "includePath": [
                "${workspaceRoot}",
                "d:/mingw/include/**",
                "d:/mingw/bin/../lib/gcc/mingw32/8.2.0/include/c++",
                "d:/mingw/bin/../lib/gcc/mingw32/8.2.0/include/c++/mingw32",
                "d:/mingw/bin/../lib/gcc/mingw32/8.2.0/include/c++/backward",
                "d:/mingw/bin/../lib/gcc/mingw32/8.2.0/include",
                "d:/mingw/bin/../lib/gcc/mingw32/8.2.0/../../../../include",
                "d:/mingw/bin/../lib/gcc/mingw32/8.2.0/include-fixed"
            ],
            "defines": [
                "_DEBUG",
                "UNICODE",
                "__GNUC__=6",
                "__cdecl=__attribute__((__cdecl__))"
            ],
            "intelliSenseMode": "msvc-x64",
            "browse": {
                "limitSymbolsToIncludedHeaders": true,
                "databaseFilename": "",
                "path": [
                    "${workspaceRoot}",
                    "d:/mingw/include/**",
                    "d:/mingw/bin/../lib/gcc/mingw32/8.2.0/include/c++",
                    "d:/mingw/bin/../lib/gcc/mingw32/8.2.0/include/c++/mingw32",
                    "d:/mingw/bin/../lib/gcc/mingw32/8.2.0/include/c++/backward",
                    "d:/mingw/bin/../lib/gcc/mingw32/8.2.0/include",
                    "d:/mingw/bin/../lib/gcc/mingw32/8.2.0/../../../../include",
                    "d:/mingw/bin/../lib/gcc/mingw32/8.2.0/include-fixed"
                ]
            }
        }
    ],
    "version": 4
}