Block size,IO type,WR/RD,Jobs,Queue Depth,Bandwidth(MB/s),IOPS,Max_lat,Mean_lat(us),Std_dev,Qos(us) 10%,Qos(us) 20%,Qos(us) 30%,Qos(us) 40%,Qos(us) 50%,Qos(us) 60%,Qos(us) 70%,Qos(us) 80%,Qos(us) 90%,Qos(us) 99%,Qos(us) 99_9%,Qos(us) 99_99%,Qos(us) 99_999%,Qos(us) 99_9999%,Qos(us) 99_99999%,Qos(us) 99_999999,Qos(us) 100%
128kB,Sequential,write,1,128,2718.781,20742,14896,6154,551,5931,5996,5996,5996,5996,5996,6062,6127,6389,9109,10682,11862,13041,13697,14876,14876,14876
4kB,Sequential,write,1,1,333.817,81498,296,10,0,10,10,10,10,10,10,11,11,11,12,14,29,32,102,292,296,296
128kB,Sequential,read,1,128,3569.558,27233,9617,4698,504,4046,4227,4358,4554,4685,4816,4947,5144,5406,5865,6193,6586,7045,8355,9109,9633,9633
4kB,Sequential,read,1,1,55.436,13534,416,72,6,66,68,69,70,71,72,75,81,82,83,138,199,220,230,240,415,415
4kB,Random,write,4,128,473.088,115499,58470,4431,10815,45,72,93,173,2572,4227,4292,4423,4489,54263,54788,54788,54788,56885,57409,57409,58458
4kB,Random,write,1,1,258.153,63025,1543,14,1,13,13,13,14,14,14,14,14,14,29,29,32,72,116,301,1417,1548
4kB,Random,read,4,128,3294.615,804349,11339,635,532,187,264,337,411,485,577,700,888,1253,2736,4358,5931,7307,8716,10420,10944,11337
4kB,Random,read,1,1,52.804,12891,1643,76,50,67,69,69,70,71,73,76,81,82,117,1019,1368,1515,1597,1630,1646,1646
4kB,Random mix-70-30,read,4,128,840.485,205196,56197,1828,4943,518,667,790,937,1089,1236,1433,1679,2146,36438,50593,52166,52690,53215,53739,55312,56360
4kB,Random mix-70-30,write,4,128,360.225,87945,55019,1551,4970,160,407,514,602,700,888,1073,1368,2072,35913,50069,51642,51642,52166,54788,54788,54788
