To make new bl3 
-----------------------------
Connect to 192.168.5.12
Using Branch origin/feature/myrtle_b0_validation_benand
cd /opt/univa/zebu_workarea/user/asekar/myrtle_benand
./bl3_fpga_zebu_be_wout_build.sh

To use new bl3 in e2e run
-----------------------------
Connect to 192.168.4.165
cd /home/tcn/b0_e2e/scripts/bl3_hex_gen
cp /opt/univa/zebu_workarea/user/asekar/myrtle_benand/myrtle_fw.fpga.zebu.be.wout.bl3.dev.img(newly made bl3) .
./read_bl3 myrtle_fw.fpga.zebu.be.wout.bl3.dev.img

To run e2e
-----------------------------
1. 
     Connect to 192.168.4.165
       cd /home/tcn/b0_e2e/runtime
       source sourceme_zs4_M1
       make run_zrci

When print 

"""Waiting for UART connection, do "make ConnectUT" to connect 
make ConnectUT """

go to step 2.
--------------------------------------------------------------------------------

2.
Connect to 192.168.4.165
cd /home/tcn/b0_e2e/runtime
source sourceme_zs4_M1
make ConnectUT

The terminal in step 2 will show the prints from fw
---------------------------------------------------------------

3.
Connect to 192.168.4.165
cd /home/tcn/b0_e2e/runtime
source sourceme_zs4_M1
make VBoxRun
4.
Connect to 192.168.4.165
cd /home/tcn/b0_e2e/runtime
source sourceme_zs4_M1
make ConnectVM
pwd: snpszebu
pwd: scaleflux
cd zebu_script/runtime/
sudo ./pcimem /sys/bus/pci/devices/0000\:01\:00.0/resource0 0xc014 w 0x446f6e65

sudo ./pcimem /sys/bus/pci/devices/0000\:01\:00.0/resource0 0xc014 w 0x446f6e65



feature/myrtle_b0_validation_benand



