Block size,IO type,WR/RD,Jobs,Queue Depth,Bandwidth(MB/s),IOPS,Max_lat,Mean_lat(us),Std_dev,Qos(us) 10%,Qos(us) 20%,Qos(us) 30%,Qos(us) 40%,Qos(us) 50%,Qos(us) 60%,Qos(us) 70%,Qos(us) 80%,Qos(us) 90%,Qos(us) 99%,Qos(us) 99_9%,Qos(us) 99_99%,Qos(us) 99_999%,Qos(us) 99_9999%,Qos(us) 99_99999%,Qos(us) 99_999999,Qos(us) 100%
128kB,Sequential,write,1,128,2719.14,20745,17260,6153,549,5931,5996,5996,5996,5996,5996,6062,6127,6389,9109,10682,11862,13172,16187,17170,17170,17170
4kB,Sequential,write,1,1,334.417,81644,342,10,0,10,10,10,10,10,10,11,11,11,12,14,29,31,102,120,305,342
128kB,Sequential,read,1,128,3569.556,27233,9601,4698,505,4046,4227,4358,4554,4685,4816,4947,5144,5406,5865,6193,6586,7110,8159,9371,9633,9633
4kB,Sequential,read,1,1,55.407,13527,366,72,6,66,68,69,70,71,72,75,81,82,83,138,199,220,230,358,366,366
4kB,Random,write,4,128,472.525,115362,58524,4436,10822,45,72,93,175,2572,4227,4292,4423,4489,54263,54788,54788,55312,57409,58458,58458,58458
4kB,Random,write,1,1,258.463,63101,1848,14,1,13,13,13,14,14,14,14,14,14,29,29,32,72,117,301,1318,1843
4kB,Random,read,4,128,3297.222,804985,9926,635,530,187,264,337,407,485,577,700,888,1253,2703,4358,5865,7372,8585,9240,9764,9895
4kB,Random,read,1,1,55.144,13463,235,73,6,67,69,69,70,71,73,75,81,82,83,142,181,220,230,234,236,236
4kB,Random mix-70-30,read,4,128,841.483,205440,56465,1827,4932,518,667,790,937,1089,1236,1433,1679,2146,36438,50069,51642,52690,53215,54263,55836,56360
4kB,Random mix-70-30,write,4,128,360.608,88038,52618,1547,4956,162,407,514,602,700,888,1073,1351,2056,35913,50069,51642,51642,52166,52690,52690,52690
