{
	"id": "a0add66f-7aec-4357-b671-afaf6b231380",
	"name": "production",
	"values": [
		{
			"key": "baseUrl",
			"value": "http://Carsapi-env.eba-wderhrry.eu-west-2.elasticbeanstalk.com",
			"enabled": true
		}
	],
	"_postman_variable_scope": "environment",
	"_postman_exported_at": "2022-09-09T23:19:51.502Z",
	"_postman_exported_using": "Postman/8.0.10"
}