Titre,Éditeur,ISSN,ISSN-e,Clé interne,URL,URL RSS,Début - Date (XXXX-XX ou XXXX),Début - Volume,Début - N°,Fin - Date,Fin - Volume,Fin - N°,Accès libre (0/1),Accès restreint (0/1),Barrière (K-Bart),langues,URL alerte courriel,URL dernier numéro,lacunaire,sélection,T id mirabel,T préfixe,T sigle,T début,T fin,T langues,T périodicité,T électronique,T url,T sudoc,T worldcat
Alpha mixte,Antipodes,1660-7880,1660-7880,ALPHA,http://example.com/alpha,http://example.com/alpha/rss,2000,10,1,2010,3,9,1,1,P5Y,,,,,,,Le ,,,,,,,,,,
Beta ouvert,Actes Sud,,,BETA,http://example.com/beta,http://example.com/beta/rss,2000,10,1,2010,3,9,1,0,,,,,,,,Le ,,,,,,,,,
Abstracta Iranica,Antipodes,0240-8910,,GAMMA,http://example.com/gamma,http://example.com/gamma/rss,2000,10,1,2010,3,9,1,0,,,,,,,,Le ,,,,,,,,,
