{
   "items" : [
      {
         "listed_in_doaj" : "no",
         "publishers" : [
            {
               "relationship_type_phrases" : [
                  {
                     "phrase" : "Society Publisher",
                     "value" : "society_publisher",
                     "language" : "en"
                  }
               ],
               "relationship_type" : "society_publisher",
               "publisher" : {
                  "id" : 110,
                  "name" : [
                     {
                        "language" : "en",
                        "language_phrases" : [
                           {
                              "language" : "en",
                              "value" : "en",
                              "phrase" : "English"
                           }
                        ],
                        "preferred_phrases" : [
                           {
                              "language" : "en",
                              "value" : "name",
                              "phrase" : "Name"
                           }
                        ],
                        "name" : "American Anthropological Association",
                        "preferred" : "name"
                     }
                  ],
                  "country_phrases" : [
                     {
                        "phrase" : "United States of America",
                        "value" : "us",
                        "language" : "en"
                     }
                  ],
                  "country" : "us",
                  "url" : "http://www.aaanet.org/",
                  "publication_count" : 33,
                  "imprints_id" : [
                     6875,
                     2228
                  ],
                  "uri" : "http://v2.sherpa.ac.uk/id/publisher/110"
               }
            },
            {
               "relationship_type" : "commercial_publisher",
               "relationship_type_phrases" : [
                  {
                     "value" : "commercial_publisher",
                     "phrase" : "Commercial Publisher",
                     "language" : "en"
                  }
               ],
               "publisher" : {
                  "uri" : "http://v2.sherpa.ac.uk/id/publisher/580",
                  "imprints_id" : [
                     1390,
                     45,
                     53370,
                     1032,
                     79
                  ],
                  "publication_count" : 1743,
                  "url" : "http://eu.wiley.com/WileyCDA/",
                  "country" : "us",
                  "country_phrases" : [
                     {
                        "language" : "en",
                        "phrase" : "United States of America",
                        "value" : "us"
                     }
                  ],
                  "name" : [
                     {
                        "language" : "en",
                        "language_phrases" : [
                           {
                              "language" : "en",
                              "value" : "en",
                              "phrase" : "English"
                           }
                        ],
                        "preferred_phrases" : [
                           {
                              "phrase" : "Name",
                              "value" : "name",
                              "language" : "en"
                           }
                        ],
                        "name" : "Wiley",
                        "preferred" : "name"
                     }
                  ],
                  "id" : 580
               }
            }
         ],
         "type" : "journal",
         "id" : 1149,
         "publisher_policy" : [
            {
               "uri" : "http://v2.sherpa.ac.uk/id/publisher_policy/3521",
               "permitted_oa" : [
                  {
                     "location" : {
                        "location" : [
                           "authors_homepage",
                           "institutional_website",
                           "non_commercial_subject_repository",
                           "preprint_repository"
                        ],
                        "location_phrases" : [
                           {
                              "language" : "en",
                              "phrase" : "Author's Homepage",
                              "value" : "authors_homepage"
                           },
                           {
                              "language" : "en",
                              "phrase" : "Institutional Website",
                              "value" : "institutional_website"
                           },
                           {
                              "language" : "en",
                              "phrase" : "Non-Commercial Subject Repository",
                              "value" : "non_commercial_subject_repository"
                           },
                           {
                              "language" : "en",
                              "phrase" : "Preprint Repository",
                              "value" : "preprint_repository"
                           }
                        ]
                     },
                     "article_version_phrases" : [
                        {
                           "language" : "en",
                           "value" : "submitted",
                           "phrase" : "Submitted"
                        },
                        {
                           "language" : "en",
                           "phrase" : "Accepted",
                           "value" : "accepted"
                        }
                     ],
                     "article_version" : [
                        "submitted",
                        "accepted"
                     ],
                     "conditions" : [
                        "Published source must be acknowledged with citation",
                        "Copyright must be acknowledged"
                     ],
                     "additional_oa_fee" : "no",
                     "additional_oa_fee_phrases" : [
                        {
                           "value" : "no",
                           "phrase" : "No",
                           "language" : "en"
                        }
                     ]
                  },
                  {
                     "conditions" : [
                        "Published source must be acknowledged with citation"
                     ],
                     "license" : [
                        {
                           "license_phrases" : [
                              {
                                 "language" : "en",
                                 "phrase" : "CC BY",
                                 "value" : "cc_by"
                              }
                           ],
                           "license" : "cc_by"
                        }
                     ],
                     "article_version_phrases" : [
                        {
                           "language" : "en",
                           "phrase" : "Published",
                           "value" : "published"
                        }
                     ],
                     "publisher_deposit" : [
                        {
                           "system_metadata" : {
                              "id" : 267,
                              "uri" : "http://v2.sherpa.ac.uk/id/repository/267"
                           },
                           "repository_metadata" : {
                              "type" : "disciplinary",
                              "description" : "A subject-based repository of biomedical and life sciences journal literature developed and managed by the National Center for Biotechnology Information (NCBI) at the US National Library of Medicine (NLM). \r\n\r\nContent includes articles deposited by participating journals that have applied to and been selected for the archive by NLM, as well as individual author manuscripts that have been submitted in compliance with the NIH Public Access Policy and similar policies of other research funding agencies. More than 2000 journals currently use PMC as a repository. Digitization projects have also added content from the 18th, 19th, and 20th centuries to the archive.",
                              "name" : [
                                 {
                                    "preferred" : "name",
                                    "name" : "PubMed Central",
                                    "preferred_phrases" : [
                                       {
                                          "phrase" : "Name",
                                          "value" : "name",
                                          "language" : "en"
                                       }
                                    ],
                                    "language_phrases" : [
                                       {
                                          "language" : "en",
                                          "phrase" : "English",
                                          "value" : "en"
                                       }
                                    ],
                                    "language" : "en"
                                 }
                              ],
                              "url" : "http://www.ncbi.nlm.nih.gov/pmc/",
                              "type_phrases" : [
                                 {
                                    "phrase" : "Disciplinary",
                                    "value" : "disciplinary",
                                    "language" : "en"
                                 }
                              ]
                           }
                        }
                     ],
                     "article_version" : [
                        "published"
                     ],
                     "location" : {
                        "location" : [
                           "any_website",
                           "institutional_repository",
                           "named_repository",
                           "subject_repository",
                           "this_journal"
                        ],
                        "named_repository" : [
                           "PubMed Central"
                        ],
                        "location_phrases" : [
                           {
                              "language" : "en",
                              "phrase" : "Any Website",
                              "value" : "any_website"
                           },
                           {
                              "language" : "en",
                              "phrase" : "Institutional Repository",
                              "value" : "institutional_repository"
                           },
                           {
                              "phrase" : "Named Repository",
                              "value" : "named_repository",
                              "language" : "en"
                           },
                           {
                              "phrase" : "Subject Repository",
                              "value" : "subject_repository",
                              "language" : "en"
                           },
                           {
                              "value" : "this_journal",
                              "phrase" : "This Journal",
                              "language" : "en"
                           }
                        ]
                     },
                     "additional_oa_fee_phrases" : [
                        {
                           "language" : "en",
                           "value" : "yes",
                           "phrase" : "Yes"
                        }
                     ],
                     "additional_oa_fee" : "yes",
                     "copyright_owner" : "authors",
                     "copyright_owner_phrases" : [
                        {
                           "language" : "en",
                           "value" : "authors",
                           "phrase" : "Authors"
                        }
                     ]
                  },
                  {
                     "copyright_owner_phrases" : [
                        {
                           "value" : "authors",
                           "phrase" : "Authors",
                           "language" : "en"
                        }
                     ],
                     "copyright_owner" : "authors",
                     "additional_oa_fee" : "yes",
                     "additional_oa_fee_phrases" : [
                        {
                           "value" : "yes",
                           "phrase" : "Yes",
                           "language" : "en"
                        }
                     ],
                     "location" : {
                        "location" : [
                           "any_repository",
                           "named_repository",
                           "non_commercial_institutional_repository",
                           "non_commercial_subject_repository",
                           "this_journal"
                        ],
                        "named_repository" : [
                           "PubMed Central"
                        ],
                        "location_phrases" : [
                           {
                              "language" : "en",
                              "phrase" : "Any Repository",
                              "value" : "any_repository"
                           },
                           {
                              "phrase" : "Named Repository",
                              "value" : "named_repository",
                              "language" : "en"
                           },
                           {
                              "value" : "non_commercial_institutional_repository",
                              "phrase" : "Non-Commercial Institutional Repository",
                              "language" : "en"
                           },
                           {
                              "phrase" : "Non-Commercial Subject Repository",
                              "value" : "non_commercial_subject_repository",
                              "language" : "en"
                           },
                           {
                              "value" : "this_journal",
                              "phrase" : "This Journal",
                              "language" : "en"
                           }
                        ]
                     },
                     "article_version" : [
                        "published"
                     ],
                     "publisher_deposit" : [
                        {
                           "repository_metadata" : {
                              "type" : "disciplinary",
                              "description" : "A subject-based repository of biomedical and life sciences journal literature developed and managed by the National Center for Biotechnology Information (NCBI) at the US National Library of Medicine (NLM). \r\n\r\nContent includes articles deposited by participating journals that have applied to and been selected for the archive by NLM, as well as individual author manuscripts that have been submitted in compliance with the NIH Public Access Policy and similar policies of other research funding agencies. More than 2000 journals currently use PMC as a repository. Digitization projects have also added content from the 18th, 19th, and 20th centuries to the archive.",
                              "name" : [
                                 {
                                    "preferred_phrases" : [
                                       {
                                          "language" : "en",
                                          "value" : "name",
                                          "phrase" : "Name"
                                       }
                                    ],
                                    "language_phrases" : [
                                       {
                                          "value" : "en",
                                          "phrase" : "English",
                                          "language" : "en"
                                       }
                                    ],
                                    "language" : "en",
                                    "preferred" : "name",
                                    "name" : "PubMed Central"
                                 }
                              ],
                              "url" : "http://www.ncbi.nlm.nih.gov/pmc/",
                              "type_phrases" : [
                                 {
                                    "phrase" : "Disciplinary",
                                    "value" : "disciplinary",
                                    "language" : "en"
                                 }
                              ]
                           },
                           "system_metadata" : {
                              "uri" : "http://v2.sherpa.ac.uk/id/repository/267",
                              "id" : 267
                           }
                        }
                     ],
                     "article_version_phrases" : [
                        {
                           "value" : "published",
                           "phrase" : "Published",
                           "language" : "en"
                        }
                     ],
                     "license" : [
                        {
                           "license" : "cc_by_nc_nd",
                           "license_phrases" : [
                              {
                                 "language" : "en",
                                 "phrase" : "CC BY-NC-ND",
                                 "value" : "cc_by_nc_nd"
                              }
                           ]
                        }
                     ],
                     "conditions" : [
                        "Published source must be acknowledged with citation"
                     ]
                  }
               ],
               "open_access_prohibited_phrases" : [
                  {
                     "language" : "en",
                     "value" : "no",
                     "phrase" : "No"
                  }
               ],
               "publication_count" : 33,
               "urls" : [
                  {
                     "url" : "http://americanethnologist.org/submit/aaa-author-agreement-form",
                     "description" : "AAA Author Agreement Form - Example"
                  },
                  {
                     "url" : "https://authorservices.wiley.com/author-resources/Journal-Authors/open-access/onlineopen.html",
                     "description" : "Publish open access with Wiley OnlineOpen"
                  }
               ],
               "internal_moniker" : "Default Policy",
               "open_access_prohibited" : "no",
               "id" : 3521
            }
         ],
         "issns" : [
            {
               "issn" : "0002-7294",
               "type" : "print",
               "type_phrases" : [
                  {
                     "phrase" : "Print",
                     "value" : "print",
                     "language" : "en"
                  }
               ]
            },
            {
               "issn" : "1548-1433",
               "type" : "electronic",
               "type_phrases" : [
                  {
                     "language" : "en",
                     "phrase" : "Electronic",
                     "value" : "electronic"
                  }
               ]
            }
         ],
         "type_phrases" : [
            {
               "language" : "en",
               "value" : "journal",
               "phrase" : "Journal"
            }
         ],
         "title" : [
            {
               "acronym" : "American Anthropologist",
               "language" : "en",
               "language_phrases" : [
                  {
                     "phrase" : "English",
                     "value" : "en",
                     "language" : "en"
                  }
               ],
               "title" : "Journal of the American Anthropological Association"
            }
         ],
         "url" : "http://onlinelibrary.wiley.com/journal/10.1111/%28ISSN%291548-1433",
         "system_metadata" : {
            "date_created" : "2010-07-15 14:07:40",
            "uri" : "http://v2.sherpa.ac.uk/id/publication/1149",
            "publicly_visible_phrases" : [
               {
                  "language" : "en",
                  "phrase" : "Yes",
                  "value" : "yes"
               }
            ],
            "publicly_visible" : "yes",
            "id" : 1149,
            "date_modified" : "2020-01-29 15:25:40"
         },
         "listed_in_doaj_phrases" : [
            {
               "language" : "en",
               "phrase" : "No",
               "value" : "no"
            }
         ]
      }
   ]
}

