%!PS-Adobe-3.0 EPSF-3.0
%%Creator: cairo 1.15.14 (http://cairographics.org)
%%CreationDate: Mon Oct  1 17:18:42 2018
%%Pages: 1
%%DocumentData: Clean7Bit
%%LanguageLevel: 2
%%BoundingBox: 0 0 35 54
%%EndComments
%%BeginProlog
50 dict begin
/q { gsave } bind def
/Q { grestore } bind def
/cm { 6 array astore concat } bind def
/w { setlinewidth } bind def
/J { setlinecap } bind def
/j { setlinejoin } bind def
/M { setmiterlimit } bind def
/d { setdash } bind def
/m { moveto } bind def
/l { lineto } bind def
/c { curveto } bind def
/h { closepath } bind def
/re { exch dup neg 3 1 roll 5 3 roll moveto 0 rlineto
      0 exch rlineto 0 rlineto closepath } bind def
/S { stroke } bind def
/f { fill } bind def
/f* { eofill } bind def
/n { newpath } bind def
/W { clip } bind def
/W* { eoclip } bind def
/BT { } bind def
/ET { } bind def
/BDC { mark 3 1 roll /BDC pdfmark } bind def
/EMC { mark /EMC pdfmark } bind def
/cairo_store_point { /cairo_point_y exch def /cairo_point_x exch def } def
/Tj { show currentpoint cairo_store_point } bind def
/TJ {
  {
    dup
    type /stringtype eq
    { show } { -0.001 mul 0 cairo_font_matrix dtransform rmoveto } ifelse
  } forall
  currentpoint cairo_store_point
} bind def
/cairo_selectfont { cairo_font_matrix aload pop pop pop 0 0 6 array astore
    cairo_font exch selectfont cairo_point_x cairo_point_y moveto } bind def
/Tf { pop /cairo_font exch def /cairo_font_matrix where
      { pop cairo_selectfont } if } bind def
/Td { matrix translate cairo_font_matrix matrix concatmatrix dup
      /cairo_font_matrix exch def dup 4 get exch 5 get cairo_store_point
      /cairo_font where { pop cairo_selectfont } if } bind def
/Tm { 2 copy 8 2 roll 6 array astore /cairo_font_matrix exch def
      cairo_store_point /cairo_font where { pop cairo_selectfont } if } bind def
/g { setgray } bind def
/rg { setrgbcolor } bind def
/d1 { setcachedevice } bind def
/cairo_data_source {
  CairoDataIndex CairoData length lt
    { CairoData CairoDataIndex get /CairoDataIndex CairoDataIndex 1 add def }
    { () } ifelse
} def
/cairo_flush_ascii85_file { cairo_ascii85_file status { cairo_ascii85_file flushfile } if } def
/cairo_image { image cairo_flush_ascii85_file } def
/cairo_imagemask { imagemask cairo_flush_ascii85_file } def
%%EndProlog
%%BeginSetup
%%EndSetup
%%Page: 1 1
%%BeginPageSetup
%%PageBoundingBox: 0 0 35 54
%%EndPageSetup
q 0 0 35 54 rectclip
1 0 0 -1 0 54 cm q
0.407843 0.490196 0.560784 rg
18.559 0 m 26.316 0 32.605 6.289 32.605 14.047 c 32.605 19.254 30.191 23.777
 26.281 26.227 c 26.207 26.277 26.152 26.348 26.152 26.445 c 26.152 26.617
 26.285 26.66 26.297 26.664 c 31.363 28.625 34.543 33.801 34.543 39.812 
c 34.543 47.57 28.254 53.859 20.496 53.859 c 1.949 53.855 l 0.875 53.855
 0 52.98 0 51.906 c 0 1.949 l 0 0.871 0.875 0 1.949 0 c 18.559 0 l f
0.980392 0.760784 0 rg
11.77 44.32 m 11.523 44.32 11.309 44.109 11.309 43.859 c 11.309 32.598 
l 11.309 32.352 11.523 32.141 11.77 32.141 c 12.477 32.141 l 12.727 32.141
 12.938 32.352 12.938 32.598 c 12.938 37.59 l 17.32 37.59 l 17.32 32.598
 l 17.32 32.352 17.535 32.141 17.781 32.141 c 18.488 32.141 l 18.734 32.141
 18.949 32.352 18.949 32.598 c 18.949 43.859 l 18.949 44.109 18.734 44.32
 18.488 44.32 c 17.781 44.32 l 17.535 44.32 17.32 44.109 17.32 43.859 c 
17.32 39.02 l 12.938 39.02 l 12.938 43.859 l 12.938 44.109 12.727 44.32 
12.477 44.32 c 11.77 44.32 l f
11.723 21.676 m 11.477 21.676 11.262 21.461 11.262 21.215 c 11.262 9.949
 l 11.262 9.703 11.477 9.492 11.723 9.492 c 18.496 9.492 l 18.746 9.492 
18.957 9.703 18.957 9.949 c 18.957 10.426 l 18.957 10.676 18.746 10.887 
18.496 10.887 c 12.891 10.887 l 12.891 14.801 l 17.668 14.801 l 17.914 14.801
 18.125 15.016 18.125 15.262 c 18.125 15.742 l 18.125 15.988 17.914 16.199
 17.668 16.199 c 12.891 16.199 l 12.891 21.215 l 12.891 21.461 12.68 21.676
 12.43 21.676 c 11.723 21.676 l f
Q Q
showpage
%%Trailer
end
%%EOF
