<?xml version="1.0" encoding="UTF-8" standalone="no"?>
<svg
   xmlns:dc="http://purl.org/dc/elements/1.1/"
   xmlns:cc="http://creativecommons.org/ns#"
   xmlns:rdf="http://www.w3.org/1999/02/22-rdf-syntax-ns#"
   xmlns:svg="http://www.w3.org/2000/svg"
   xmlns="http://www.w3.org/2000/svg"
   xmlns:xlink="http://www.w3.org/1999/xlink"
   width="227.3712pt"
   height="236.17397pt"
   viewBox="0 0 227.3712 236.17396"
   version="1.2"
   id="svg215">
  <metadata
     id="metadata219">
    <rdf:RDF>
      <cc:Work
         rdf:about="">
        <dc:format>image/svg+xml</dc:format>
        <dc:type
           rdf:resource="http://purl.org/dc/dcmitype/StillImage" />
        <dc:title></dc:title>
      </cc:Work>
    </rdf:RDF>
  </metadata>
  <defs
     id="defs58">
    <g
       id="g56">
      <symbol
         overflow="visible"
         id="glyph0-0">
        <path
           style="stroke:none"
           d="M 5.15625,-9.953125 H 1.171875 V 3.3125 H 5.15625 Z M 4.640625,-9.46875 V 2.828125 H 1.6875 V -9.46875 Z m -1.5625,5.1875 c -0.375,0 -0.890625,0.125 -0.890625,0.375 0,0.125 0.09375,0.21875 0.234375,0.21875 0.03125,0 0.078125,-0.015625 0.125,-0.03125 0.15625,-0.078125 0.28125,-0.109375 0.484375,-0.109375 0.484375,0 0.578125,0.296875 0.578125,0.65625 0,0.5 -0.171875,0.703125 -0.859375,0.734375 v 0.796875 C 2.75,-1.5 2.859375,-1.40625 2.984375,-1.40625 3.09375,-1.40625 3.21875,-1.5 3.21875,-1.640625 V -2.0625 C 3.859375,-2.15625 4.125,-2.515625 4.125,-3.1875 4.125,-3.75 3.890625,-4.28125 3.078125,-4.28125 Z m -0.09375,3.140625 c -0.1875,0 -0.328125,0.140625 -0.328125,0.328125 0,0.203125 0.140625,0.359375 0.328125,0.359375 0.1875,0 0.328125,-0.15625 0.328125,-0.359375 0,-0.1875 -0.140625,-0.328125 -0.328125,-0.328125 z m 0,0"
           id="path2" />
      </symbol>
      <symbol
         overflow="visible"
         id="glyph0-1">
        <path
           style="stroke:none"
           d="M 2.328125,-6.53125 H 0.984375 V 0 H 2.5 C 3.890625,0 5.53125,-0.625 5.53125,-3.296875 5.53125,-6 3.953125,-6.53125 2.328125,-6.53125 Z M 2.5,-5.859375 c 1.0625,0 2.15625,0.3125 2.15625,2.5625 0,2.1875 -1.046875,2.640625 -2.09375,2.640625 H 1.796875 v -5.203125 z m 0,0"
           id="path5" />
      </symbol>
      <symbol
         overflow="visible"
         id="glyph0-2">
        <path
           style="stroke:none"
           d="m 2.765625,-5.109375 c -1.40625,0 -2.203125,1.0625 -2.203125,2.625 0,1.578125 0.796875,2.59375 2.1875,2.59375 1.390625,0 2.203125,-1.046875 2.203125,-2.609375 0,-1.59375 -0.796875,-2.609375 -2.1875,-2.609375 z m 0,0.65625 c 0.859375,0 1.328125,0.625 1.328125,1.953125 0,1.328125 -0.484375,1.96875 -1.34375,1.96875 -0.859375,0 -1.34375,-0.640625 -1.34375,-1.953125 0,-1.34375 0.5,-1.96875 1.359375,-1.96875 z m 0,0"
           id="path8" />
      </symbol>
      <symbol
         overflow="visible"
         id="glyph0-3">
        <path
           style="stroke:none"
           d="m 3.015625,-5.109375 c -0.625,0 -1.09375,0.390625 -1.359375,1.15625 L 1.578125,-4.984375 H 0.90625 V 0 h 0.796875 v -2.890625 c 0.21875,-0.984375 0.578125,-1.4375 1.21875,-1.4375 0.171875,0 0.296875,0.015625 0.4375,0.0625 l 0.15625,-0.78125 c -0.15625,-0.03125 -0.328125,-0.0625 -0.5,-0.0625 z m 0,0"
           id="path11" />
      </symbol>
      <symbol
         overflow="visible"
         id="glyph0-4">
        <path
           style="stroke:none"
           d="m 5.875,-5.109375 c -0.671875,0 -1.140625,0.375 -1.5,0.921875 -0.1875,-0.578125 -0.640625,-0.921875 -1.25,-0.921875 -0.65625,0 -1.125,0.359375 -1.46875,0.875 l -0.078125,-0.75 H 0.90625 V 0 h 0.796875 v -3.5625 c 0.34375,-0.546875 0.671875,-0.921875 1.21875,-0.921875 0.421875,0 0.734375,0.25 0.734375,1.015625 V 0 H 4.453125 V -3.5625 C 4.8125,-4.109375 5.125,-4.484375 5.6875,-4.484375 c 0.40625,0 0.734375,0.25 0.734375,1.015625 V 0 H 7.21875 v -3.578125 c 0,-0.9375 -0.53125,-1.53125 -1.34375,-1.53125 z m 0,0"
           id="path14" />
      </symbol>
      <symbol
         overflow="visible"
         id="glyph0-5">
        <path
           style="stroke:none"
           d="M 4.1875,-1.140625 V -3.46875 c 0,-1.03125 -0.546875,-1.640625 -1.734375,-1.640625 -0.546875,0 -1.09375,0.125 -1.6875,0.34375 l 0.203125,0.59375 c 0.515625,-0.1875 0.96875,-0.28125 1.34375,-0.28125 0.71875,0 1.078125,0.296875 1.078125,1.03125 V -3.03125 H 2.5625 c -1.359375,0 -2.15625,0.578125 -2.15625,1.640625 0,0.890625 0.59375,1.5 1.578125,1.5 0.625,0 1.15625,-0.234375 1.5,-0.765625 0.125,0.5 0.4375,0.703125 0.921875,0.765625 l 0.1875,-0.5625 C 4.328125,-0.546875 4.1875,-0.6875 4.1875,-1.140625 Z M 2.15625,-0.5 C 1.5625,-0.5 1.25,-0.828125 1.25,-1.4375 1.25,-2.140625 1.75,-2.5 2.671875,-2.5 h 0.71875 v 1.203125 C 3.09375,-0.765625 2.703125,-0.5 2.15625,-0.5 Z m 0,0"
           id="path17" />
      </symbol>
      <symbol
         overflow="visible"
         id="glyph0-6">
        <path
           style="stroke:none"
           d="m 3.21875,-5.109375 c -0.671875,0 -1.203125,0.359375 -1.5625,0.875 l -0.078125,-0.75 H 0.90625 V 0 h 0.796875 v -3.5625 c 0.34375,-0.546875 0.75,-0.921875 1.328125,-0.921875 0.515625,0 0.8125,0.25 0.8125,1.015625 V 0 h 0.796875 v -3.578125 c 0,-0.953125 -0.5,-1.53125 -1.421875,-1.53125 z m 0,0"
           id="path20" />
      </symbol>
      <symbol
         overflow="visible"
         id="glyph0-7">
        <path
           style="stroke:none"
           d="m 3.078125,-0.765625 c -0.25,0.15625 -0.453125,0.21875 -0.6875,0.21875 -0.453125,0 -0.625,-0.25 -0.625,-0.765625 V -4.375 h 1.125 L 2.96875,-4.984375 H 1.765625 V -6.21875 L 0.96875,-6.140625 v 1.15625 H 0.109375 V -4.375 H 0.96875 v 3.09375 c 0,0.90625 0.484375,1.390625 1.3125,1.390625 C 2.703125,0.109375 3.0625,0 3.390625,-0.21875 Z m 0,0"
           id="path23" />
      </symbol>
      <symbol
         overflow="visible"
         id="glyph0-8">
        <path
           style="stroke:none"
           d="M 4.46875,0 H 5.4375 l -1.75,-2.953125 c 0.921875,-0.265625 1.421875,-0.8125 1.421875,-1.734375 0,-1.21875 -0.84375,-1.84375 -2.453125,-1.84375 H 0.984375 V 0 h 0.8125 V -2.8125 H 2.875 Z M 1.796875,-3.4375 V -5.875 h 0.84375 c 1.109375,0 1.59375,0.359375 1.59375,1.1875 0,0.890625 -0.546875,1.25 -1.484375,1.25 z m 0,0"
           id="path26" />
      </symbol>
      <symbol
         overflow="visible"
         id="glyph0-9">
        <path
           style="stroke:none"
           d="m 4.640625,-2.65625 c 0,-1.5 -0.6875,-2.453125 -2.03125,-2.453125 -1.265625,0 -2.046875,1.09375 -2.046875,2.65625 0,1.59375 0.796875,2.5625 2.171875,2.5625 0.6875,0 1.234375,-0.234375 1.71875,-0.625 l -0.34375,-0.46875 c -0.4375,0.296875 -0.8125,0.4375 -1.3125,0.4375 -0.75,0 -1.3125,-0.46875 -1.390625,-1.671875 H 4.625 c 0,-0.109375 0.015625,-0.265625 0.015625,-0.4375 z M 3.84375,-2.8125 h -2.4375 c 0.0625,-1.15625 0.53125,-1.65625 1.21875,-1.65625 0.828125,0 1.21875,0.578125 1.21875,1.578125 z m 0,0"
           id="path29" />
      </symbol>
      <symbol
         overflow="visible"
         id="glyph0-10">
        <path
           style="stroke:none"
           d="m 3.875,-7.09375 v 2.609375 c -0.328125,-0.328125 -0.75,-0.625 -1.359375,-0.625 -1.21875,0 -1.953125,1.109375 -1.953125,2.640625 0,1.5625 0.671875,2.578125 1.875,2.578125 0.640625,0 1.140625,-0.3125 1.453125,-0.8125 L 3.96875,0 h 0.703125 v -7 z m -1.28125,6.578125 c -0.75,0 -1.1875,-0.640625 -1.1875,-1.96875 0,-1.328125 0.5,-1.984375 1.28125,-1.984375 0.515625,0 0.875,0.265625 1.1875,0.671875 V -1.3125 c -0.34375,0.5 -0.703125,0.796875 -1.28125,0.796875 z m 0,0"
           id="path32" />
      </symbol>
      <symbol
         overflow="visible"
         id="glyph0-11">
        <path
           style="stroke:none"
           d="M 4.5,-4.984375 H 3.6875 l -1.359375,4.40625 -1.375,-4.40625 H 0.109375 L 1.796875,0 H 2.0625 C 1.78125,0.796875 1.5,1.1875 0.484375,1.375 L 0.578125,2 c 1.34375,-0.171875 1.890625,-0.90625 2.25,-1.96875 z m 0,0"
           id="path35" />
      </symbol>
      <symbol
         overflow="visible"
         id="glyph0-12">
        <path
           style="stroke:none"
           d="M 4.546875,-4.984375 H 3.75 v 3.578125 c -0.3125,0.515625 -0.71875,0.890625 -1.296875,0.890625 -0.5625,0 -0.8125,-0.265625 -0.8125,-0.984375 V -4.984375 H 0.84375 v 3.578125 c 0,0.96875 0.515625,1.515625 1.390625,1.515625 0.734375,0 1.203125,-0.3125 1.578125,-0.921875 L 3.875,0 h 0.671875 z m 0,0"
           id="path38" />
      </symbol>
      <symbol
         overflow="visible"
         id="glyph0-13">
        <path
           style="stroke:none"
           d="m 1.296875,-7.34375 c -0.34375,0 -0.5625,0.234375 -0.5625,0.546875 0,0.3125 0.21875,0.5625 0.5625,0.5625 0.328125,0 0.5625,-0.25 0.5625,-0.5625 0,-0.3125 -0.234375,-0.546875 -0.5625,-0.546875 z m 0.40625,2.359375 H 0.90625 V 0 h 0.796875 z m 0,0"
           id="path41" />
      </symbol>
      <symbol
         overflow="visible"
         id="glyph0-14">
        <path
           style="stroke:none"
           d="m 4.640625,-5.515625 c -0.5625,0.25 -1,0.4375 -2.265625,0.40625 -1.09375,0 -1.890625,0.71875 -1.890625,1.734375 0,0.65625 0.265625,1.09375 0.828125,1.390625 -0.34375,0.234375 -0.53125,0.546875 -0.53125,0.875 0,0.5 0.390625,0.921875 1.265625,0.921875 h 0.78125 c 0.65625,0 1.046875,0.25 1.046875,0.75 0,0.515625 -0.390625,0.8125 -1.5,0.8125 -1.109375,0 -1.390625,-0.265625 -1.390625,-0.859375 H 0.25 C 0.25,1.515625 0.78125,2 2.375,2 3.90625,2 4.671875,1.453125 4.671875,0.5 4.671875,-0.28125 4.015625,-0.859375 3,-0.859375 H 2.203125 c -0.53125,0 -0.6875,-0.1875 -0.6875,-0.421875 0,-0.203125 0.109375,-0.375 0.28125,-0.5 0.1875,0.078125 0.40625,0.109375 0.625,0.109375 1.1875,0 1.890625,-0.703125 1.890625,-1.6875 0,-0.609375 -0.296875,-1.015625 -0.875,-1.28125 0.578125,0 1.046875,-0.03125 1.4375,-0.15625 z M 2.375,-4.53125 c 0.75,0 1.109375,0.421875 1.109375,1.15625 0,0.734375 -0.375,1.171875 -1.078125,1.171875 -0.703125,0 -1.109375,-0.46875 -1.109375,-1.171875 0,-0.671875 0.375,-1.15625 1.078125,-1.15625 z m 0,0"
           id="path44" />
      </symbol>
      <symbol
         overflow="visible"
         id="glyph0-15">
        <path
           style="stroke:none"
           d="M 2.640625,-6.53125 H 0.984375 V 0 h 0.8125 v -2.421875 h 0.84375 c 1.4375,0 2.515625,-0.609375 2.515625,-2.109375 0,-1.359375 -0.953125,-2 -2.515625,-2 z M 2.625,-3.078125 H 1.796875 V -5.875 h 0.84375 c 1,0 1.640625,0.359375 1.640625,1.359375 0,1.125 -0.671875,1.4375 -1.65625,1.4375 z m 0,0"
           id="path47" />
      </symbol>
      <symbol
         overflow="visible"
         id="glyph0-16">
        <path
           style="stroke:none"
           d="m 1.796875,-6.53125 h -0.8125 V 0 h 0.8125 z m 0,0"
           id="path50" />
      </symbol>
      <symbol
         overflow="visible"
         id="glyph0-17">
        <path
           style="stroke:none"
           d="m 3.140625,-5.109375 c -0.59375,0 -1.125,0.296875 -1.484375,0.8125 l -0.078125,-0.6875 H 0.90625 V 2 L 1.703125,1.90625 v -2.390625 c 0.3125,0.40625 0.765625,0.59375 1.328125,0.59375 1.28125,0 1.953125,-1.09375 1.953125,-2.609375 0,-1.59375 -0.546875,-2.609375 -1.84375,-2.609375 z m -0.296875,4.5625 c -0.484375,0 -0.875,-0.234375 -1.140625,-0.640625 v -2.46875 c 0.28125,-0.4375 0.6875,-0.8125 1.25,-0.8125 0.78125,0 1.15625,0.640625 1.15625,1.96875 0,1.328125 -0.4375,1.953125 -1.265625,1.953125 z m 0,0"
           id="path53" />
      </symbol>
    </g>
  </defs>
  <g
     id="surface5351"
     transform="translate(-76.537058,-70.865182)">
    <path
       style="fill:none;stroke:#000000;stroke-width:0.59776;stroke-linecap:butt;stroke-linejoin:miter;stroke-miterlimit:10;stroke-opacity:1"
       d="m 28.346344,2.1875e-4 c 0,15.65625025 -12.691406,28.34765625 -28.3476565,28.34765625 -15.6562495,0 -28.3437495,-12.691406 -28.3437495,-28.34765625 0,-15.65624975 12.6875,-28.34765575 28.3437495,-28.34765575 15.6562505,0 28.3476565,12.691406 28.3476565,28.34765575 z m 0,0"
       transform="matrix(1,0,0,-1,105.181,184.551)"
       id="path60" />
    <g
       style="fill:#000000;fill-opacity:1"
       id="g76">
      <use
         xlink:href="#glyph0-1"
         x="86.555"
         y="187.811"
         id="use62"
         width="100%"
         height="100%" />
      <use
         xlink:href="#glyph0-2"
         x="92.638664"
         y="187.811"
         id="use64"
         width="100%"
         height="100%" />
      <use
         xlink:href="#glyph0-3"
         x="98.152878"
         y="187.811"
         id="use66"
         width="100%"
         height="100%" />
      <use
         xlink:href="#glyph0-4"
         x="101.75942"
         y="187.811"
         id="use68"
         width="100%"
         height="100%" />
      <use
         xlink:href="#glyph0-5"
         x="109.82669"
         y="187.811"
         id="use70"
         width="100%"
         height="100%" />
      <use
         xlink:href="#glyph0-6"
         x="114.9233"
         y="187.811"
         id="use72"
         width="100%"
         height="100%" />
      <use
         xlink:href="#glyph0-7"
         x="120.41853"
         y="187.811"
         id="use74"
         width="100%"
         height="100%" />
    </g>
    <path
       style="fill:none;stroke:#000000;stroke-width:0.59776;stroke-linecap:butt;stroke-linejoin:miter;stroke-miterlimit:10;stroke-opacity:1"
       d="M 113.38541,2.1875e-4 C 113.38541,15.656469 100.69791,28.347875 85.041656,28.347875 69.385406,28.347875 56.694,15.656469 56.694,2.1875e-4 56.694,-15.656031 69.385406,-28.347437 85.041656,-28.347437 c 15.656254,0 28.343754,12.691406 28.343754,28.34765575 z m 0,0"
       transform="matrix(1,0,0,-1,105.181,184.551)"
       id="path78" />
    <g
       style="fill:#000000;fill-opacity:1"
       id="g82">
      <use
         xlink:href="#glyph0-8"
         x="177.203"
         y="187.095"
         id="use80"
         width="100%"
         height="100%" />
    </g>
    <g
       style="fill:#000000;fill-opacity:1"
       id="g86">
      <use
         xlink:href="#glyph0-9"
         x="182.85957"
         y="187.095"
         id="use84"
         width="100%"
         height="100%" />
    </g>
    <g
       style="fill:#000000;fill-opacity:1"
       id="g94">
      <use
         xlink:href="#glyph0-5"
         x="187.95619"
         y="187.095"
         id="use88"
         width="100%"
         height="100%" />
      <use
         xlink:href="#glyph0-10"
         x="193.0528"
         y="187.095"
         id="use90"
         width="100%"
         height="100%" />
      <use
         xlink:href="#glyph0-11"
         x="198.62396"
         y="187.095"
         id="use92"
         width="100%"
         height="100%" />
    </g>
    <path
       style="fill:none;stroke:#000000;stroke-width:0.59776;stroke-linecap:butt;stroke-linejoin:miter;stroke-miterlimit:10;stroke-opacity:1"
       d="m 198.42837,2.1875e-4 c 0,15.65625025 -12.6914,28.34765625 -28.34765,28.34765625 -15.65625,0 -28.34766,-12.691406 -28.34766,-28.34765625 0,-15.65624975 12.69141,-28.34765575 28.34766,-28.34765575 15.65625,0 28.34765,12.691406 28.34765,28.34765575 z m 0,0"
       transform="matrix(1,0,0,-1,105.181,184.551)"
       id="path96" />
    <g
       style="fill:#000000;fill-opacity:1"
       id="g112">
      <use
         xlink:href="#glyph0-8"
         x="257.68201"
         y="187.265"
         id="use98"
         width="100%"
         height="100%" />
      <use
         xlink:href="#glyph0-12"
         x="263.38602"
         y="187.265"
         id="use100"
         width="100%"
         height="100%" />
      <use
         xlink:href="#glyph0-6"
         x="268.84329"
         y="187.265"
         id="use102"
         width="100%"
         height="100%" />
      <use
         xlink:href="#glyph0-6"
         x="274.33853"
         y="187.265"
         id="use104"
         width="100%"
         height="100%" />
      <use
         xlink:href="#glyph0-13"
         x="279.83377"
         y="187.265"
         id="use106"
         width="100%"
         height="100%" />
      <use
         xlink:href="#glyph0-6"
         x="282.43427"
         y="187.265"
         id="use108"
         width="100%"
         height="100%" />
      <use
         xlink:href="#glyph0-14"
         x="287.9295"
         y="187.265"
         id="use110"
         width="100%"
         height="100%" />
    </g>
    <path
       style="fill:none;stroke:#000000;stroke-width:0.59776;stroke-linecap:butt;stroke-linejoin:miter;stroke-miterlimit:10;stroke-opacity:1"
       d="m 113.38541,85.039281 c 0,15.656249 -12.6875,28.347659 -28.343754,28.347659 -15.65625,0 -28.347656,-12.69141 -28.347656,-28.347659 0,-15.65625 12.691406,-28.34375 28.347656,-28.34375 15.656254,0 28.343754,12.6875 28.343754,28.34375 z m 0,0"
       transform="matrix(1,0,0,-1,105.181,184.551)"
       id="path114" />
    <g
       style="fill:#000000;fill-opacity:1"
       id="g118">
      <use
         xlink:href="#glyph0-15"
         x="173.013"
         y="102.226"
         id="use116"
         width="100%"
         height="100%" />
    </g>
    <g
       style="fill:#000000;fill-opacity:1"
       id="g132">
      <use
         xlink:href="#glyph0-9"
         x="178.21402"
         y="102.226"
         id="use120"
         width="100%"
         height="100%" />
      <use
         xlink:href="#glyph0-6"
         x="183.35808"
         y="102.226"
         id="use122"
         width="100%"
         height="100%" />
      <use
         xlink:href="#glyph0-10"
         x="188.85332"
         y="102.226"
         id="use124"
         width="100%"
         height="100%" />
      <use
         xlink:href="#glyph0-13"
         x="194.42447"
         y="102.226"
         id="use126"
         width="100%"
         height="100%" />
      <use
         xlink:href="#glyph0-6"
         x="197.02498"
         y="102.226"
         id="use128"
         width="100%"
         height="100%" />
      <use
         xlink:href="#glyph0-14"
         x="202.5202"
         y="102.226"
         id="use130"
         width="100%"
         height="100%" />
    </g>
    <path
       style="fill:none;stroke:#000000;stroke-width:0.59776;stroke-linecap:butt;stroke-linejoin:miter;stroke-miterlimit:10;stroke-opacity:1"
       d="m 113.62759,-85.038844 c 0,15.789063 -12.79687,28.585938 -28.585934,28.585938 -15.789062,0 -28.589843,-12.796875 -28.589843,-28.585938 0,-15.789066 12.800781,-28.589846 28.589843,-28.589846 15.789064,0 28.585934,12.80078 28.585934,28.589846 z m 0,0"
       transform="matrix(1,0,0,-1,105.181,184.551)"
       id="path134" />
    <g
       style="fill:#000000;fill-opacity:1"
       id="g142">
      <use
         xlink:href="#glyph0-16"
         x="165.8"
         y="272.134"
         id="use136"
         width="100%"
         height="100%" />
      <use
         xlink:href="#glyph0-6"
         x="168.57135"
         y="272.134"
         id="use138"
         width="100%"
         height="100%" />
      <use
         xlink:href="#glyph0-7"
         x="174.06657"
         y="272.134"
         id="use140"
         width="100%"
         height="100%" />
    </g>
    <g
       style="fill:#000000;fill-opacity:1"
       id="g156">
      <use
         xlink:href="#glyph0-9"
         x="177.32196"
         y="272.134"
         id="use144"
         width="100%"
         height="100%" />
      <use
         xlink:href="#glyph0-3"
         x="182.46602"
         y="272.134"
         id="use146"
         width="100%"
         height="100%" />
      <use
         xlink:href="#glyph0-3"
         x="186.07256"
         y="272.134"
         id="use148"
         width="100%"
         height="100%" />
      <use
         xlink:href="#glyph0-12"
         x="189.67911"
         y="272.134"
         id="use150"
         width="100%"
         height="100%" />
      <use
         xlink:href="#glyph0-17"
         x="195.13637"
         y="272.134"
         id="use152"
         width="100%"
         height="100%" />
      <use
         xlink:href="#glyph0-7"
         x="200.66957"
         y="272.134"
         id="use154"
         width="100%"
         height="100%" />
    </g>
    <g
       style="fill:#000000;fill-opacity:1"
       id="g162">
      <use
         xlink:href="#glyph0-9"
         x="203.92494"
         y="272.134"
         id="use158"
         width="100%"
         height="100%" />
      <use
         xlink:href="#glyph0-10"
         x="209.06902"
         y="272.134"
         id="use160"
         width="100%"
         height="100%" />
    </g>
    <path
       style="fill:none;stroke:#000000;stroke-width:0.59776;stroke-linecap:butt;stroke-linejoin:miter;stroke-miterlimit:10;stroke-opacity:1"
       d="m 24.807281,14.320531 c 9.972657,5.757813 19.621094,6.71875 29.484375,2.878907"
       transform="matrix(1,0,0,-1,105.181,184.551)"
       id="path164" />
    <path
       style="fill:#000000;fill-opacity:1;fill-rule:nonzero;stroke:#000000;stroke-width:0.59776;stroke-linecap:butt;stroke-linejoin:miter;stroke-miterlimit:10;stroke-opacity:1"
       d="M 5.582394,0.00134111 0.299745,1.497572 0.297003,2.34836e-4 0.297781,-1.495407 Z m 0,0"
       transform="matrix(0.90083,0.43402,0.43402,-0.90083,159.34563,167.3049)"
       id="path166" />
    <path
       style="fill:none;stroke:#000000;stroke-width:0.59776;stroke-linecap:butt;stroke-linejoin:miter;stroke-miterlimit:10;stroke-opacity:1"
       d="m 60.233063,-14.324 c -9.972657,-5.753906 -19.621094,-6.714844 -29.484375,-2.875"
       transform="matrix(1,0,0,-1,105.181,184.551)"
       id="path168" />
    <path
       style="fill:#000000;fill-opacity:1;fill-rule:nonzero;stroke:#000000;stroke-width:0.59776;stroke-linecap:butt;stroke-linejoin:miter;stroke-miterlimit:10;stroke-opacity:1"
       d="M 5.582674,9.77503e-4 0.300114,1.497335 0.297333,1.23548e-5 0.298071,-1.495615 Z m 0,0"
       transform="matrix(-0.90085,-0.434,-0.434,0.90085,136.05692,201.797)"
       id="path170" />
    <path
       style="fill:none;stroke:#000000;stroke-width:1.19553;stroke-linecap:butt;stroke-linejoin:miter;stroke-miterlimit:10;stroke-opacity:1"
       d="m 109.84634,14.320531 c 10.01954,5.785157 19.71094,6.726563 29.625,2.824219"
       transform="matrix(1,0,0,-1,105.181,184.551)"
       id="path172" />
    <path
       style="fill:#000000;fill-opacity:1;fill-rule:nonzero;stroke:#000000;stroke-width:1.19553;stroke-linecap:butt;stroke-linejoin:miter;stroke-miterlimit:10;stroke-opacity:1"
       d="M 4.427945,1.71171e-4 0.599693,1.186778 0.598044,0.00217894 0.59809,-1.185939 Z m 0,0"
       transform="matrix(0.90083,0.43402,0.43402,-0.90083,244.3861,167.3049)"
       id="path174" />
    <path
       style="fill:none;stroke:#000000;stroke-width:1.19553;stroke-linecap:butt;stroke-linejoin:miter;stroke-miterlimit:10;stroke-opacity:1"
       d="m 145.27212,-14.324 c -10.01562,-5.78125 -19.70703,-6.722656 -29.62109,-2.820312"
       transform="matrix(1,0,0,-1,105.181,184.551)"
       id="path176" />
    <path
       style="fill:#000000;fill-opacity:1;fill-rule:nonzero;stroke:#000000;stroke-width:1.19553;stroke-linecap:butt;stroke-linejoin:miter;stroke-miterlimit:10;stroke-opacity:1"
       d="M 4.427235,-6.43943e-4 0.59905,1.186054 0.597369,0.00146606 0.597384,-1.186641 Z m 0,0"
       transform="matrix(-0.90085,-0.434,-0.434,0.90085,221.09737,201.797)"
       id="path178" />
    <path
       style="fill:none;stroke:#000000;stroke-width:1.19553;stroke-linecap:butt;stroke-linejoin:miter;stroke-miterlimit:10;stroke-opacity:1"
       d="m 162.66666,27.668188 c -6.58985,24.597656 -20.73829,40.179687 -43.78907,48.082031"
       transform="matrix(1,0,0,-1,105.181,184.551)"
       id="path180" />
    <path
       style="fill:#000000;fill-opacity:1;fill-rule:nonzero;stroke:#000000;stroke-width:1.19553;stroke-linecap:butt;stroke-linejoin:miter;stroke-miterlimit:10;stroke-opacity:1"
       d="M 4.429107,-0.00115039 0.597148,1.187589 0.597282,-0.00113289 0.596273,-1.186119 Z m 0,0"
       transform="matrix(-0.95622,-0.29257,-0.29257,0.95622,224.33252,108.89458)"
       id="path182" />
    <path
       style="fill:none;stroke:#000000;stroke-width:0.59776;stroke-linecap:butt;stroke-linejoin:miter;stroke-miterlimit:10;stroke-opacity:1"
       d="m 162.66666,-27.66775 c -6.48829,-24.386719 -20.625,-40.027344 -43.4336,-47.964844"
       transform="matrix(1,0,0,-1,105.181,184.551)"
       id="path184" />
    <path
       style="fill:#000000;fill-opacity:1;fill-rule:nonzero;stroke:#000000;stroke-width:0.59776;stroke-linecap:butt;stroke-linejoin:miter;stroke-miterlimit:10;stroke-opacity:1"
       d="M 5.583446,0.00137315 0.300728,1.495707 0.297452,5.24057e-4 0.297909,-1.49581 Z m 0,0"
       transform="matrix(-0.95555,0.2947,0.2947,0.95555,224.56142,260.13059)"
       id="path186" />
    <path
       style="fill:none;stroke:#000000;stroke-width:1.19553;stroke-linecap:butt;stroke-linejoin:miter;stroke-miterlimit:10;stroke-opacity:1"
       d="m 177.54166,-27.656031 c 4.97265,-51.363281 -40.89844,-93.757809 -92.500004,-94.234379"
       transform="matrix(1,0,0,-1,105.181,184.551)"
       id="path188" />
    <path
       style="fill:none;stroke:#000000;stroke-width:1.19553;stroke-linecap:butt;stroke-linejoin:miter;stroke-miterlimit:10;stroke-opacity:1"
       d="m 85.041656,-121.89041 c -48.582031,0.95704 -87.609375,39.445316 -89.96875,87.25391"
       transform="matrix(1,0,0,-1,105.181,184.551)"
       id="path190" />
    <path
       style="fill:#000000;fill-opacity:1;fill-rule:nonzero;stroke:#000000;stroke-width:1.19553;stroke-linecap:butt;stroke-linejoin:miter;stroke-miterlimit:10;stroke-opacity:1"
       d="M 4.426059,0.00151297 0.597122,1.185196 0.597358,0.00142078 0.59753,-1.18626 Z m 0,0"
       transform="matrix(-0.0163,-0.99985,-0.99985,0.0163,100.26897,219.48787)"
       id="path192" />
    <path
       style="fill:none;stroke:#000000;stroke-width:0.59776;stroke-linecap:butt;stroke-linejoin:miter;stroke-miterlimit:10;stroke-opacity:1"
       d="M 57.369781,77.629125 C 32.822906,71.051 17.2565,56.945531 9.338531,33.976781"
       transform="matrix(1,0,0,-1,105.181,184.551)"
       id="path194" />
    <path
       style="fill:#000000;fill-opacity:1;fill-rule:nonzero;stroke:#000000;stroke-width:0.59776;stroke-linecap:butt;stroke-linejoin:miter;stroke-miterlimit:10;stroke-opacity:1"
       d="M 5.581277,0.0015901 0.300008,1.494629 0.299797,-1.495725 Z m 0,0"
       transform="matrix(-0.29254,0.95622,0.95622,0.29254,114.56482,150.43995)"
       id="path196" />
    <path
       style="fill:none;stroke:#000000;stroke-width:0.59776;stroke-linecap:butt;stroke-linejoin:miter;stroke-miterlimit:10;stroke-opacity:1"
       d="M 85.041656,56.39475 V 35.230688"
       transform="matrix(1,0,0,-1,105.181,184.551)"
       id="path198" />
    <path
       style="fill:#000000;fill-opacity:1;fill-rule:nonzero;stroke:#000000;stroke-width:0.59776;stroke-linecap:butt;stroke-linejoin:miter;stroke-miterlimit:10;stroke-opacity:1"
       d="M 5.581,0.00120625 0.29975,1.4973 v -2.992188 z m 0,0"
       transform="matrix(0,1,1,0,190.22145,149.169)"
       id="path200" />
    <path
       style="fill:none;stroke:#000000;stroke-width:0.59776;stroke-linecap:butt;stroke-linejoin:miter;stroke-miterlimit:10;stroke-opacity:1"
       d="m 85.041656,-56.152125 v 20.917969"
       transform="matrix(1,0,0,-1,105.181,184.551)"
       id="path202" />
    <path
       style="fill:#000000;fill-opacity:1;fill-rule:nonzero;stroke:#000000;stroke-width:0.59776;stroke-linecap:butt;stroke-linejoin:miter;stroke-miterlimit:10;stroke-opacity:1"
       d="M 5.581438,-0.00120625 0.300188,1.494888 V -1.4973 Z m 0,0"
       transform="matrix(0,-1,-1,0,190.22145,219.933)"
       id="path204" />
    <path
       style="fill:none;stroke:#000000;stroke-width:0.59776;stroke-linecap:butt;stroke-linejoin:miter;stroke-miterlimit:10;stroke-opacity:1"
       d="m 92.514313,-57.1365 c 12.917967,21.363281 35.707027,17.5 55.749997,29.867188"
       transform="matrix(1,0,0,-1,105.181,184.551)"
       id="path206" />
    <path
       style="fill:#000000;fill-opacity:1;fill-rule:nonzero;stroke:#000000;stroke-width:0.59776;stroke-linecap:butt;stroke-linejoin:miter;stroke-miterlimit:10;stroke-opacity:1"
       d="M 5.581257,0.00123857 0.297898,1.495004 0.299843,-0.00176829 0.298593,-1.496291 Z m 0,0"
       transform="matrix(0.81761,-0.5757,-0.5757,-0.81761,253.32414,211.89383)"
       id="path208" />
    <path
       style="fill:none;stroke:#000000;stroke-width:0.59776;stroke-linecap:butt;stroke-linejoin:miter;stroke-miterlimit:10;stroke-opacity:1"
       d="M 57.139313,-92.515406 C 14.705719,-103.8865 12.236969,-69.870875 49.72525,-75.956812"
       transform="matrix(1,0,0,-1,105.181,184.551)"
       id="path210" />
    <path
       style="fill:#000000;fill-opacity:1;fill-rule:nonzero;stroke:#000000;stroke-width:0.59776;stroke-linecap:butt;stroke-linejoin:miter;stroke-miterlimit:10;stroke-opacity:1"
       d="M 5.579866,5.02135e-4 0.297609,1.496655 0.299608,3.95056e-4 0.297783,-1.496665 Z m 0,0"
       transform="matrix(0.97873,0.20494,0.20494,-0.97873,154.77309,260.48586)"
       id="path212" />
  </g>
</svg>
