<svg width="10" height="3" viewBox="0 0 10 3" fill="none" xmlns="http://www.w3.org/2000/svg">
<path d="M1.99999 1.5C1.99999 2.05228 1.55227 2.5 0.999989 2.5C0.447704 2.5 -1.14441e-05 2.05228 -1.14441e-05 1.5C-1.14441e-05 0.947715 0.447704 0.5 0.999989 0.5C1.55227 0.5 1.99999 0.947715 1.99999 1.5Z" fill="#8693A3"/>
<path d="M5.99999 1.5C5.99999 2.05228 5.55227 2.5 4.99999 2.5C4.4477 2.5 3.99999 2.05228 3.99999 1.5C3.99999 0.947715 4.4477 0.5 4.99999 0.5C5.55227 0.5 5.99999 0.947715 5.99999 1.5Z" fill="#8693A3"/>
<path d="M9.99999 1.5C9.99999 2.05228 9.55227 2.5 8.99999 2.5C8.4477 2.5 7.99999 2.05228 7.99999 1.5C7.99999 0.947715 8.4477 0.5 8.99999 0.5C9.55227 0.5 9.99999 0.947715 9.99999 1.5Z" fill="#8693A3"/>
</svg>
