<svg width="17" height="20" viewBox="0 0 17 20" fill="none" xmlns="http://www.w3.org/2000/svg">
<path d="M11.6666 4.5C11.6666 6.15685 10.3235 7.5 8.66664 7.5C7.00979 7.5 5.66664 6.15685 5.66664 4.5C5.66664 2.84315 7.00979 1.5 8.66664 1.5C10.3235 1.5 11.6666 2.84315 11.6666 4.5Z" stroke="#8693A3" stroke-width="2"/>
<path d="M1.66664 17C1.66664 13.4101 4.57679 10.5 8.16664 10.5H9.16664C12.7565 10.5 15.6666 13.4101 15.6666 17V17.5C15.6666 18.0523 15.2189 18.5 14.6666 18.5H2.66664C2.11436 18.5 1.66664 18.0523 1.66664 17.5V17Z" stroke="#8693A3" stroke-width="2"/>
</svg>
