{
  "profiles": {
    "Otus.Teaching.Pcf.GivingToCustomer.IntegrationTests": {
      "commandName": "Project",
      "launchBrowser": true,
      "environmentVariables": {
        "ASPNETCORE_ENVIRONMENT": "Development"
      },
      "applicationUrl": "https://localhost:57811;http://localhost:57812"
    }
  }
}