<?xml version="1.0" encoding="UTF-8" standalone="no"?>
<!-- Created with Inkscape (http://www.inkscape.org/) -->

<svg
   xmlns:dc="http://purl.org/dc/elements/1.1/"
   xmlns:cc="http://creativecommons.org/ns#"
   xmlns:rdf="http://www.w3.org/1999/02/22-rdf-syntax-ns#"
   xmlns:svg="http://www.w3.org/2000/svg"
   xmlns="http://www.w3.org/2000/svg"
   xmlns:sodipodi="http://sodipodi.sourceforge.net/DTD/sodipodi-0.dtd"
   xmlns:inkscape="http://www.inkscape.org/namespaces/inkscape"
   width="124mm"
   height="124mm"
   viewBox="0 0 124 124"
   version="1.1"
   id="svg4565"
   inkscape:version="0.92.3 (2405546, 2018-03-11)"
   sodipodi:docname="logo.svg"
   inkscape:export-filename="/home/hoel/work/Django/djangoMediaArchive_import_OOData/doc/logo_1024.png"
   inkscape:export-xdpi="209.75"
   inkscape:export-ydpi="209.75">
  <defs
     id="defs4559" />
  <sodipodi:namedview
     id="base"
     pagecolor="#ffffff"
     bordercolor="#666666"
     borderopacity="1.0"
     inkscape:pageopacity="0.0"
     inkscape:pageshadow="2"
     inkscape:zoom="0.77988071"
     inkscape:cx="19.114224"
     inkscape:cy="-18.493411"
     inkscape:document-units="mm"
     inkscape:current-layer="layer1"
     showgrid="false"
     fit-margin-top="0"
     fit-margin-left="0"
     fit-margin-right="0"
     fit-margin-bottom="0"
     inkscape:window-width="1512"
     inkscape:window-height="1023"
     inkscape:window-x="0"
     inkscape:window-y="0"
     inkscape:window-maximized="0" />
  <metadata
     id="metadata4562">
    <rdf:RDF>
      <cc:Work
         rdf:about="">
        <dc:format>image/svg+xml</dc:format>
        <dc:type
           rdf:resource="http://purl.org/dc/dcmitype/StillImage" />
        <dc:title></dc:title>
      </cc:Work>
    </rdf:RDF>
  </metadata>
  <g
     inkscape:label="Ebene 1"
     inkscape:groupmode="layer"
     id="layer1"
     transform="translate(24.210858,-64.958203)">
    <g
       id="g5151"
       transform="translate(-58.834817,-3.5150714)">
      <rect
         y="68.473274"
         x="34.623959"
         height="124"
         width="124"
         id="rect5144"
         style="opacity:0.98000004;fill:#81cc33;fill-opacity:1;fill-rule:evenodd;stroke:none;stroke-width:0.13229166;stroke-linecap:round;stroke-linejoin:round;stroke-miterlimit:4;stroke-dasharray:none;stroke-dashoffset:0;stroke-opacity:1" />
      <g
         transform="translate(-8.3760424,-10.52673)"
         id="g5142">
        <path
           style="opacity:0.98000004;fill:#000000;fill-opacity:1;fill-rule:evenodd;stroke:none;stroke-width:0.13229166;stroke-linecap:round;stroke-linejoin:round;stroke-miterlimit:4;stroke-dasharray:none;stroke-dashoffset:0;stroke-opacity:1"
           id="path5110"
           sodipodi:type="arc"
           sodipodi:cx="105"
           sodipodi:cy="141"
           sodipodi:rx="60"
           sodipodi:ry="60"
           sodipodi:start="5.7595865"
           sodipodi:end="1.5707963"
           d="m 156.96152,111 a 60,60 0 0 1 1e-5,60 A 60,60 0 0 1 105,201 l 0,-60 z" />
        <path
           style="opacity:0.98000004;fill:#999999;fill-opacity:1;fill-rule:evenodd;stroke:none;stroke-width:0.13229166;stroke-linecap:round;stroke-linejoin:round;stroke-miterlimit:4;stroke-dasharray:none;stroke-dashoffset:0;stroke-opacity:1"
           id="path5110-2"
           sodipodi:type="arc"
           sodipodi:cx="105"
           sodipodi:cy="141"
           sodipodi:rx="60"
           sodipodi:ry="60"
           sodipodi:start="3.6651914"
           sodipodi:end="5.7595865"
           d="M 53.038475,111 A 60,60 0 0 1 105,81 60,60 0 0 1 156.96152,111 L 105,141 Z" />
        <path
           style="opacity:0.98000004;fill:#f9f9f9;fill-opacity:1;fill-rule:evenodd;stroke:none;stroke-width:0.13229166;stroke-linecap:round;stroke-linejoin:round;stroke-miterlimit:4;stroke-dasharray:none;stroke-dashoffset:0;stroke-opacity:1"
           id="path5110-5"
           sodipodi:type="arc"
           sodipodi:cx="105"
           sodipodi:cy="141"
           sodipodi:rx="60"
           sodipodi:ry="60"
           sodipodi:start="1.5707963"
           sodipodi:end="3.6651914"
           d="m 105,201 a 60,60 0 0 1 -51.961523,-30 60,60 0 0 1 -2e-6,-60 L 105,141 Z" />
      </g>
    </g>
    <g
       id="g5254"
       transform="translate(65.768672,10.448926)">
      <circle
         r="10"
         cy="116.50928"
         cx="-27.97953"
         id="path5172"
         style="opacity:0.98000004;fill:none;fill-opacity:1;fill-rule:evenodd;stroke:#4d4d4d;stroke-width:0.13229166;stroke-linecap:round;stroke-linejoin:round;stroke-miterlimit:4;stroke-dasharray:none;stroke-dashoffset:0;stroke-opacity:1" />
      <circle
         r="55"
         cy="116.50928"
         cx="-27.97953"
         id="path5172-1"
         style="opacity:0.98000004;fill:none;fill-opacity:1;fill-rule:evenodd;stroke:#4d4d4d;stroke-width:0.13229166;stroke-linecap:round;stroke-linejoin:round;stroke-miterlimit:4;stroke-dasharray:none;stroke-dashoffset:0;stroke-opacity:1" />
      <circle
         r="50"
         cy="116.50928"
         cx="-27.97953"
         id="path5172-6"
         style="opacity:0.98000004;fill:none;fill-opacity:1;fill-rule:evenodd;stroke:#4d4d4d;stroke-width:0.13229166;stroke-linecap:round;stroke-linejoin:round;stroke-miterlimit:4;stroke-dasharray:none;stroke-dashoffset:0;stroke-opacity:1" />
      <circle
         r="40"
         cy="116.50928"
         cx="-27.97953"
         id="path5172-7"
         style="opacity:0.98000004;fill:none;fill-opacity:1;fill-rule:evenodd;stroke:#4d4d4d;stroke-width:0.13229166;stroke-linecap:round;stroke-linejoin:round;stroke-miterlimit:4;stroke-dasharray:none;stroke-dashoffset:0;stroke-opacity:1" />
      <circle
         r="45"
         cy="116.50928"
         cx="-27.97953"
         id="path5172-2"
         style="opacity:0.98000004;fill:none;fill-opacity:1;fill-rule:evenodd;stroke:#4d4d4d;stroke-width:0.13229166;stroke-linecap:round;stroke-linejoin:round;stroke-miterlimit:4;stroke-dasharray:none;stroke-dashoffset:0;stroke-opacity:1" />
      <circle
         r="35"
         cy="116.50928"
         cx="-27.97953"
         id="path5172-74"
         style="opacity:0.98000004;fill:none;fill-opacity:1;fill-rule:evenodd;stroke:#4d4d4d;stroke-width:0.13229166;stroke-linecap:round;stroke-linejoin:round;stroke-miterlimit:4;stroke-dasharray:none;stroke-dashoffset:0;stroke-opacity:1" />
      <circle
         r="30"
         cy="116.50928"
         cx="-27.97953"
         id="path5172-9"
         style="opacity:0.98000004;fill:none;fill-opacity:1;fill-rule:evenodd;stroke:#4d4d4d;stroke-width:0.13229166;stroke-linecap:round;stroke-linejoin:round;stroke-miterlimit:4;stroke-dasharray:none;stroke-dashoffset:0;stroke-opacity:1" />
      <circle
         r="25"
         cy="116.50928"
         cx="-27.97953"
         id="path5172-0"
         style="opacity:0.98000004;fill:none;fill-opacity:1;fill-rule:evenodd;stroke:#4d4d4d;stroke-width:0.13229166;stroke-linecap:round;stroke-linejoin:round;stroke-miterlimit:4;stroke-dasharray:none;stroke-dashoffset:0;stroke-opacity:1" />
      <circle
         r="20"
         cy="116.50928"
         cx="-27.97953"
         id="path5172-4"
         style="opacity:0.98000004;fill:none;fill-opacity:1;fill-rule:evenodd;stroke:#4d4d4d;stroke-width:0.13229166;stroke-linecap:round;stroke-linejoin:round;stroke-miterlimit:4;stroke-dasharray:none;stroke-dashoffset:0;stroke-opacity:1" />
      <circle
         r="15"
         cy="116.50928"
         cx="-27.97953"
         id="path5172-76"
         style="opacity:0.98000004;fill:none;fill-opacity:1;fill-rule:evenodd;stroke:#4d4d4d;stroke-width:0.13229166;stroke-linecap:round;stroke-linejoin:round;stroke-miterlimit:4;stroke-dasharray:none;stroke-dashoffset:0;stroke-opacity:1" />
      <circle
         r="5"
         cy="116.50928"
         cx="-27.97953"
         id="path5172-8"
         style="opacity:0.98000004;fill:none;fill-opacity:1;fill-rule:evenodd;stroke:#4d4d4d;stroke-width:0.13229166;stroke-linecap:round;stroke-linejoin:round;stroke-miterlimit:4;stroke-dasharray:none;stroke-dashoffset:0;stroke-opacity:1" />
    </g>
    <text
       xml:space="preserve"
       style="font-style:normal;font-variant:normal;font-weight:normal;font-stretch:normal;font-size:77.6111145px;line-height:6.61458302px;font-family:'Source Sans Pro';-inkscape-font-specification:'Source Sans Pro, Normal';font-variant-ligatures:normal;font-variant-caps:normal;font-variant-numeric:normal;font-feature-settings:normal;text-align:center;letter-spacing:0px;word-spacing:0px;writing-mode:lr-tb;text-anchor:middle;fill:#008080;fill-opacity:1;stroke:none;stroke-width:0.26458331pt;stroke-linecap:butt;stroke-linejoin:miter;stroke-opacity:1;"
       x="37.741516"
       y="152.41464"
       id="text5277"><tspan
         sodipodi:role="line"
         id="tspan5275"
         x="37.741516"
         y="152.41464"
         style="font-style:normal;font-variant:normal;font-weight:normal;font-stretch:normal;font-size:77.6111145px;font-family:'Source Sans Pro';-inkscape-font-specification:'Source Sans Pro, Normal';font-variant-ligatures:normal;font-variant-caps:normal;font-variant-numeric:normal;font-feature-settings:normal;text-align:center;writing-mode:lr-tb;text-anchor:middle;stroke-width:0.26458331pt;fill:#008080;">OO</tspan></text>
  </g>
</svg>
