<?xml version="1.0" encoding="UTF-8" standalone="no"?>
<!-- Created with Inkscape (http://www.inkscape.org/) -->

<svg
   width="13mm"
   height="13mm"
   viewBox="0 0 13 13"
   version="1.1"
   id="svg8"
   inkscape:version="1.2.1 (9c6d41e410, 2022-07-14)"
   sodipodi:docname="bhLogo.svg"
   inkscape:export-filename="/home/hoel/Bilder/bhLogo.png"
   inkscape:export-xdpi="488.45999"
   inkscape:export-ydpi="488.45999"
   xmlns:inkscape="http://www.inkscape.org/namespaces/inkscape"
   xmlns:sodipodi="http://sodipodi.sourceforge.net/DTD/sodipodi-0.dtd"
   xmlns="http://www.w3.org/2000/svg"
   xmlns:svg="http://www.w3.org/2000/svg"
   xmlns:rdf="http://www.w3.org/1999/02/22-rdf-syntax-ns#"
   xmlns:cc="http://creativecommons.org/ns#"
   xmlns:dc="http://purl.org/dc/elements/1.1/">
  <defs
     id="defs2" />
  <sodipodi:namedview
     id="base"
     pagecolor="#009cff"
     bordercolor="#666666"
     borderopacity="1.0"
     inkscape:pageopacity="0"
     inkscape:pageshadow="2"
     inkscape:zoom="10.567992"
     inkscape:cx="-6.3872115"
     inkscape:cy="22.473522"
     inkscape:document-units="mm"
     inkscape:current-layer="layer1"
     showgrid="false"
     fit-margin-top="1"
     fit-margin-left="1"
     fit-margin-right="1"
     fit-margin-bottom="1"
     inkscape:window-width="3609"
     inkscape:window-height="2125"
     inkscape:window-x="0"
     inkscape:window-y="0"
     inkscape:window-maximized="0"
     inkscape:pagecheckerboard="true"
     inkscape:showpageshadow="2"
     inkscape:deskcolor="#009cff" />
  <metadata
     id="metadata5">
    <rdf:RDF>
      <cc:Work
         rdf:about="">
        <dc:format>image/svg+xml</dc:format>
        <dc:type
           rdf:resource="http://purl.org/dc/dcmitype/StillImage" />
        <dc:title />
      </cc:Work>
    </rdf:RDF>
  </metadata>
  <g
     inkscape:label="Ebene 1"
     inkscape:groupmode="layer"
     id="layer1"
     transform="translate(-45.259011,-62.039291)">
    <rect
       style="opacity:0.98000004;fill:#00c8c8;fill-opacity:1;fill-rule:evenodd;stroke:none;stroke-width:0.13672215;stroke-linecap:round;stroke-linejoin:round;stroke-miterlimit:4;stroke-dasharray:none;stroke-dashoffset:0;stroke-opacity:1"
       id="rect4557"
       width="13.068945"
       height="13.194127"
       x="45.25901"
       y="61.995384" />
    <g
       id="text817"
       style="font-style:normal;font-variant:normal;font-weight:normal;font-stretch:normal;font-size:14.1111px;line-height:6.61458px;font-family:'Source Sans Pro';-inkscape-font-specification:'Source Sans Pro, Normal';font-variant-ligatures:normal;font-variant-caps:normal;font-variant-numeric:normal;font-feature-settings:normal;text-align:center;letter-spacing:0px;word-spacing:0px;writing-mode:lr-tb;text-anchor:middle;fill:#008080;fill-opacity:1;stroke:none;stroke-width:0.264583pt;stroke-linecap:butt;stroke-linejoin:miter;stroke-opacity:1"
       aria-label="B"
       transform="translate(0.4364948,0.22240677)">
      <path
         inkscape:connector-curvature="0"
         id="path826"
         style="font-style:normal;font-variant:normal;font-weight:normal;font-stretch:normal;font-size:14.1111px;font-family:'Source Sans Pro';-inkscape-font-specification:'Source Sans Pro, Normal';font-variant-ligatures:normal;font-variant-caps:normal;font-variant-numeric:normal;font-feature-settings:normal;text-align:center;writing-mode:lr-tb;text-anchor:middle;fill:#008080;stroke-width:0.264583pt;fill-opacity:1"
         d="m 46.259011,71.726181 h 2.949222 c 2.074333,0 3.513666,-0.889 3.513666,-2.709333 0,-1.27 -0.776111,-2.003778 -1.890888,-2.215445 v -0.05644 c 0.874889,-0.282222 1.354666,-1.100667 1.354666,-2.017889 0,-1.622778 -1.298222,-2.257778 -3.175,-2.257778 h -2.751666 z m 1.171222,-5.319889 v -3.005666 h 1.425222 c 1.439333,0 2.173111,0.409222 2.173111,1.481666 0,0.945445 -0.649111,1.524 -2.229555,1.524 z m 0,4.388556 V 67.309403 H 49.0389 c 1.622777,0 2.525888,0.522111 2.525888,1.665111 0,1.241778 -0.931333,1.820334 -2.525888,1.820334 z" />
    </g>
    <g
       transform="translate(2.0137812,0.34758823)"
       id="text821"
       style="font-style:normal;font-variant:normal;font-weight:normal;font-stretch:normal;font-size:14.1111px;line-height:6.61458px;font-family:'Source Sans Pro';-inkscape-font-specification:'Source Sans Pro, Normal';font-variant-ligatures:normal;font-variant-caps:normal;font-variant-numeric:normal;font-feature-settings:normal;text-align:center;letter-spacing:0px;word-spacing:0px;writing-mode:lr-tb;text-anchor:middle;fill:#008080;fill-opacity:1;stroke:none;stroke-width:0.264583pt;stroke-linecap:butt;stroke-linejoin:miter;stroke-opacity:1"
       aria-label="H">
      <path
         inkscape:connector-curvature="0"
         id="path823"
         style="font-style:normal;font-variant:normal;font-weight:normal;font-stretch:normal;font-size:14.1111px;font-family:'Source Sans Pro';-inkscape-font-specification:'Source Sans Pro, Normal';font-variant-ligatures:normal;font-variant-caps:normal;font-variant-numeric:normal;font-feature-settings:normal;text-align:center;writing-mode:lr-tb;text-anchor:middle;fill:#008080;stroke-width:0.264583pt;fill-opacity:1"
         d="m 48.14829,74.039291 h 1.171223 v -4.360333 h 4.303888 v 4.360333 h 1.185334 v -9.256888 h -1.185334 v 3.880555 H 49.319513 V 64.782403 H 48.14829 Z" />
    </g>
  </g>
</svg>
