<?xml version="1.0" encoding="UTF-8" standalone="no"?>
<!-- Created with Inkscape (http://www.inkscape.org/) -->

<svg
   width="50.006248mm"
   height="62.953159mm"
   viewBox="0 0 50.006248 62.953159"
   version="1.1"
   id="svg5349"
   inkscape:version="1.2.1 (9c6d41e410, 2022-07-14)"
   sodipodi:docname="head.svg"
   xmlns:inkscape="http://www.inkscape.org/namespaces/inkscape"
   xmlns:sodipodi="http://sodipodi.sourceforge.net/DTD/sodipodi-0.dtd"
   xmlns="http://www.w3.org/2000/svg"
   xmlns:svg="http://www.w3.org/2000/svg"
   xmlns:rdf="http://www.w3.org/1999/02/22-rdf-syntax-ns#"
   xmlns:cc="http://creativecommons.org/ns#"
   xmlns:dc="http://purl.org/dc/elements/1.1/">
  <defs
     id="defs5343" />
  <sodipodi:namedview
     id="base"
     pagecolor="#ffffff"
     bordercolor="#666666"
     borderopacity="1.0"
     inkscape:pageopacity="0.0"
     inkscape:pageshadow="2"
     inkscape:zoom="7.8131173"
     inkscape:cx="94.456537"
     inkscape:cy="118.9666"
     inkscape:document-units="mm"
     inkscape:current-layer="layer1"
     showgrid="false"
     inkscape:window-width="3609"
     inkscape:window-height="2125"
     inkscape:window-x="0"
     inkscape:window-y="0"
     inkscape:window-maximized="0"
     inkscape:showpageshadow="2"
     inkscape:pagecheckerboard="0"
     inkscape:deskcolor="#d1d1d1" />
  <metadata
     id="metadata5346">
    <rdf:RDF>
      <cc:Work
         rdf:about="">
        <dc:format>image/svg+xml</dc:format>
        <dc:type
           rdf:resource="http://purl.org/dc/dcmitype/StillImage" />
      </cc:Work>
    </rdf:RDF>
  </metadata>
  <g
     inkscape:label="Ebene 1"
     inkscape:groupmode="layer"
     id="layer1"
     transform="translate(-150.6235,-217.98286)">
    <path
       inkscape:connector-curvature="0"
       id="path5979"
       d="m 162.92663,280.36156 c -1.35821,-1.39372 -4.83071,-3.77157 -6.53288,-4.47348 -1.03664,-0.42748 -2.01913,-0.88872 -2.18332,-1.02499 -0.16419,-0.13627 -1.03842,-0.61485 -1.94273,-1.06353 l -1.6442,-0.81577 v -6.09041 c 0.3065,0.31463 0.0778,0.29995 0.32819,0.16658 0.0378,0.0351 1.25931,-0.33868 2.71452,-0.83052 1.45521,-0.49185 2.85594,-0.89642 3.11274,-0.89905 0.2568,-0.003 0.69606,-0.3816 0.97614,-0.84215 0.28007,-0.46054 0.87364,-0.99058 1.31903,-1.17785 0.44539,-0.18727 0.8098,-0.53253 0.8098,-0.76724 0,-0.61405 1.06531,-3.07719 1.60019,-3.69984 0.6933,-0.80707 1.25227,-2.07031 1.11221,-2.51354 -0.069,-0.21829 -0.42752,-0.84554 -0.79677,-1.3939 -0.57003,-0.84651 -0.67818,-1.32579 -0.71641,-3.175 -0.0375,-1.81355 0.04,-2.27421 0.46338,-2.75313 0.44718,-0.50587 0.47017,-0.69101 0.1909,-1.53722 -0.27543,-0.83456 -0.24424,-1.13241 0.23535,-2.24723 0.40995,-0.95296 0.51172,-1.58529 0.39372,-2.44621 -0.12178,-0.88845 0.034,-1.76403 0.66352,-3.72922 0.45246,-1.4125 0.82688,-2.9537 0.83203,-3.42491 0.005,-0.4712 0.17953,-1.15438 0.3875,-1.51819 0.20797,-0.3638 0.38244,-0.95911 0.38771,-1.32291 0.0184,-1.27054 2.72022,-6.04618 4.77167,-8.43426 0.65484,-0.7623 1.86395,-1.80578 2.68691,-2.31884 0.82295,-0.51306 1.54965,-1.13693 1.61488,-1.38638 0.13281,-0.50784 1.78659,-1.08969 3.09723,-1.08969 0.60707,0 1.06816,-0.22782 1.58855,-0.78491 l 0.73322,-0.78491 1.82033,0.52012 c 1.00119,0.28606 2.15478,0.76709 2.56354,1.06894 0.56528,0.41745 0.82877,0.47782 1.10064,0.25218 0.27483,-0.22809 0.44833,-0.16688 0.75073,0.26485 0.22878,0.32664 1.15178,0.807 2.20665,1.14843 2.58242,0.83584 3.25952,1.25631 4.93179,3.06256 0.81612,0.88151 1.57943,1.60568 1.69625,1.60927 0.39653,0.0122 3.5197,3.12769 3.5197,3.51105 0,0.20963 0.4755,1.20244 1.05666,2.20626 1.49058,2.57459 1.85375,4.22338 1.85375,8.41598 0,4.47405 -0.53957,7.32485 -1.61966,8.55741 -0.85044,0.9705 -0.96719,1.58215 -0.34736,1.82 0.58004,0.22258 0.26849,1.90453 -0.71487,3.85933 -1.01027,2.00831 -1.41125,1.99029 -1.1976,-0.0538 0.0906,-0.86635 0.0571,-1.64164 -0.0743,-1.72285 -0.13141,-0.0812 -0.66479,0.1036 -1.18528,0.4107 -0.52049,0.3071 -0.94635,0.45577 -0.94635,0.33038 0,-0.12539 0.26789,-0.34551 0.59531,-0.48916 0.56042,-0.24587 0.58971,-0.38928 0.49982,-2.44694 -0.0863,-1.97589 -0.052,-2.16908 0.35743,-2.01197 0.24911,0.0956 0.53568,0.0399 0.63683,-0.12376 0.10115,-0.16366 0.21323,-1.69906 0.24906,-3.41199 0.0358,-1.71294 0.12591,-3.31721 0.20016,-3.56505 0.2052,-0.68491 -0.39871,-3.62596 -0.97752,-4.76052 -0.28301,-0.55474 -0.71051,-1.00657 -0.95238,-1.00657 -0.43262,0 -1.7259,-0.36633 -2.96016,-0.83847 -0.50246,-0.19221 -0.7408,-0.12447 -1.16534,0.33122 -0.45731,0.49087 -0.72664,0.55124 -1.88189,0.42187 -0.74151,-0.083 -1.8329,-0.39735 -2.42531,-0.69847 -0.59241,-0.30112 -1.93362,-0.71069 -2.98047,-0.91016 l -1.90336,-0.36267 -1.78203,0.87665 c -1.30481,0.64189 -2.02796,1.21031 -2.70039,2.12258 -0.84872,1.15144 -0.91272,1.37171 -0.84389,2.90431 0.0433,0.96467 -0.0429,1.73091 -0.20612,1.83179 -0.15432,0.0954 -0.28059,0.40451 -0.28059,0.68697 0,0.39593 0.18456,0.51355 0.80584,0.51355 1.74375,0 7.7617,2.29936 8.402,3.21026 0.18937,0.2694 0.57684,0.61426 0.86105,0.76636 0.43065,0.23048 0.56654,0.16727 0.81562,-0.37939 0.32572,-0.71488 0.48889,-0.74424 4.24297,-0.7634 2.3746,-0.0121 3.54819,0.51425 3.29607,1.47836 -0.0862,0.32972 0.0301,0.75902 0.28061,1.03586 0.39466,0.4361 0.39349,0.47278 -0.0151,0.47278 -0.34183,0 -0.40454,0.15291 -0.27478,0.66994 0.33512,1.33522 0.26986,1.57902 -0.42264,1.57902 -0.36381,0 -0.95585,0.20836 -1.31565,0.46302 -0.84948,0.60125 -2.11749,0.58709 -3.66239,-0.0409 -0.68182,-0.27715 -1.42547,-0.56241 -1.65256,-0.63391 -0.22709,-0.0715 -0.5556,-0.60633 -0.73002,-1.1885 -0.36736,-1.22611 -0.93696,-1.54949 -1.76901,-1.0043 -0.76419,0.50071 -1.18912,2.22172 -1.18912,4.81602 0,1.48833 -0.11325,2.16995 -0.41611,2.50462 -0.37845,0.41818 -0.37829,0.53293 0.002,1.26788 0.45525,0.88036 2.09634,1.52316 3.18872,1.24899 0.32265,-0.081 0.65589,-0.078 0.74052,0.007 0.29084,0.29084 -0.36833,1.29841 -1.19323,1.8239 -1.87341,1.19343 -2.05616,1.32835 -2.05661,1.51832 -2.6e-4,0.10914 0.71931,0.19844 1.59905,0.19844 1.3628,0 1.69963,-0.10011 2.27591,-0.67639 0.49386,-0.49386 0.62828,-0.83301 0.49809,-1.25677 -0.34327,-1.11738 -0.44941,-4.2951 -0.18212,-5.45235 0.25601,-1.1084 0.23029,-1.20464 -0.50563,-1.89209 -0.42654,-0.39837 -0.77545,-0.83528 -0.77545,-0.97093 0,-0.52612 0.36572,-0.57275 0.70401,-0.0898 0.19503,0.27845 0.94985,0.70398 1.67738,0.94563 1.34409,0.44643 1.75509,0.92599 0.79361,0.92599 -0.73941,0 -0.66024,0.48079 0.13914,0.84501 0.78222,0.35641 0.72055,0.88409 -0.0998,0.85378 -1.1599,-0.0429 -0.25942,1.62233 1.66162,3.07273 0.78576,0.59326 1.49658,1.25568 1.57961,1.47205 0.083,0.21637 0.004,0.94393 -0.17576,1.6168 -0.26067,0.97609 -0.25986,1.2457 0.004,1.33377 0.58673,0.19581 0.33532,1.47377 -0.68969,3.50586 l -1.00094,1.98438 1.67214,1.59007 c 1.31504,1.25052 1.67387,1.75904 1.68029,2.38125 0.007,0.65672 0.36649,1.09874 2.11667,2.60098 1.15967,0.99538 2.10573,2.00741 2.10234,2.24895 -0.003,0.24154 -0.44988,1.33213 -0.99219,2.42354 l -0.98602,1.98437 -6.68073,0.0707 c -4.39896,0.0465 -6.68074,-0.0212 -6.68074,-0.19843 0,-0.14802 -0.12609,-0.26913 -0.2802,-0.26913 -0.15411,0 -0.20661,0.11906 -0.11668,0.26458 0.10798,0.17471 -3.23445,0.25924 -9.84011,0.24886 -9.72969,-0.0153 -10.01813,-0.0306 -10.5328,-0.55873 z m 21.1305,-0.9469 c 0.51052,-0.99241 1.52978,-4.34927 1.3693,-4.50974 -0.48061,-0.48061 -1.82995,2.20237 -2.06845,4.11287 -0.16047,1.28544 0.15107,1.46229 0.69915,0.39687 z m 3.64128,-7.8634 c 2.15333,-1.67765 2.30301,-2.03247 2.11103,-5.00414 -0.1464,-2.26593 -0.24418,-2.65944 -0.76584,-3.08186 -0.64137,-0.51935 -0.47343,-0.54352 -3.98553,0.5738 -0.9615,0.30588 -3.239,0.34671 -4.64342,0.0833 -0.66758,-0.12525 -0.91687,-0.0625 -1.04141,0.26203 -0.25229,0.65747 0.69181,1.27959 2.50226,1.64889 1.86425,0.38028 2.83568,1.04459 2.29218,1.56749 -0.42008,0.40416 -2.77554,0.52557 -4.67775,0.24112 -1.37171,-0.20512 -1.70735,-0.41218 -2.74587,-1.69399 -0.68609,-0.8468 -1.07653,-0.43504 -0.88847,0.93699 0.22821,1.66497 0.7921,2.59234 2.30195,3.78581 1.34402,1.06239 2.66198,1.504 3.7512,1.25692 0.46756,-0.10606 3.66351,0.11212 4.45624,0.30422 0.0853,0.0207 0.6853,-0.37558 1.33343,-0.88053 z m -22.25824,-5.03504 c 0,-0.21828 -0.11907,-0.39687 -0.26459,-0.39687 -0.14552,0 -0.26458,0.17859 -0.26458,0.39687 0,0.21829 0.11906,0.39688 0.26458,0.39688 0.14552,0 0.26459,-0.17859 0.26459,-0.39688 z m 20.06709,-3.58044 c 0.0792,-0.23768 -0.0728,-0.28677 -0.51865,-0.16746 -0.3469,0.0928 -0.83909,0.17043 -1.09375,0.17242 -0.25467,0.002 -0.46303,0.11698 -0.46303,0.25554 0,0.37483 1.94503,0.1307 2.07543,-0.2605 z m -22.18232,-4.75123 c -0.16091,-0.30068 -0.41263,-0.47249 -0.55937,-0.3818 -0.30117,0.18613 -0.10106,1.50757 0.3749,2.47567 0.30145,0.61314 0.31888,0.59321 0.39619,-0.45291 0.0445,-0.60185 -0.0508,-1.34029 -0.21172,-1.64096 z m 5.80199,-1.91847 c 0.22785,-0.67199 0.50358,-1.30961 0.61272,-1.41691 0.29956,-0.29453 0.23793,-2.16793 -0.0777,-2.36303 -0.41913,-0.25904 -1.00529,0.35587 -1.09718,1.15101 -0.0512,0.44294 -0.31395,0.80735 -0.70145,0.97282 -0.55647,0.23763 -0.60344,0.38444 -0.46099,1.44086 0.26824,1.98921 1.08844,2.09158 1.72464,0.21525 z m 8.18191,-1.33217 c 1.60989,-1.27394 1.95038,-1.84958 1.61531,-2.73087 -0.15202,-0.39987 -0.21612,-0.88415 -0.14243,-1.07619 0.16994,-0.44285 -0.95744,-1.02055 -2.43254,-1.24651 -1.03639,-0.15876 -1.1504,-0.11816 -1.38252,0.49237 -0.19175,0.50435 -0.44288,0.66539 -1.03766,0.66539 -0.92073,0 -1.11773,0.25049 -1.27625,1.62284 -0.10583,0.91616 -0.007,1.12349 0.98673,2.07866 1.38192,1.32775 2.1834,1.3702 3.66936,0.19431 z m -6.72107,-11.2851 c 0.17605,-0.28485 -0.87,-0.68068 -1.12498,-0.42569 -0.094,0.094 0.004,0.2816 0.21837,0.41698 0.49588,0.3136 0.71687,0.31573 0.90661,0.009 z m 21.8399,9.50595 c -0.29461,-0.19039 -0.13719,-0.25752 0.61093,-0.26053 0.60536,-0.002 0.9425,0.10161 0.84428,0.26053 -0.20667,0.3344 -0.93777,0.3344 -1.45521,0 z"
       style="fill:#00c8c8;fill-opacity:1;stroke-width:0.264583"
       sodipodi:nodetypes="cssscccscssssccccsccccccsccsccccsccscscssssccssscsscssssscsscssccssssscccscssssccsccccsssscscsccsscscccscccscsccssssccscssccssccssscssscccsssssccssccssccccccscccccssssscccscccscss" />
    <path
       inkscape:connector-curvature="0"
       id="path5977"
       d="m 163.40786,280.56703 c -0.39029,-0.69735 -4.68699,-3.91238 -5.90519,-4.41859 -0.65485,-0.27212 -2.46157,-1.12194 -4.01494,-1.88849 l -2.8243,-1.39373 -0.02,-2.57968 c -0.0135,-1.74769 0.0761,-2.57969 0.27797,-2.57969 0.16385,0 1.38424,-0.43653 2.71197,-0.97007 2.04283,-0.8209 2.73955,-0.97347 4.53073,-0.99219 2.059,-0.0215 2.15245,0.005 3.43034,0.98447 0.95156,0.72912 1.47918,0.96505 1.91407,0.8559 0.51906,-0.13028 0.79305,0.14551 2.02284,2.03612 0.78235,1.20275 1.80762,2.87142 2.27838,3.70816 0.47076,0.83675 0.91699,1.52136 0.99164,1.52136 0.23502,0 -0.19518,-1.401 -0.87477,-2.84878 -0.35978,-0.76646 -0.95007,-2.41473 -1.31175,-3.66281 -0.36168,-1.24808 -0.82628,-2.59544 -1.03244,-2.99412 -0.43112,-0.83368 -1.06049,-3.45698 -1.33768,-5.57554 -0.20071,-1.53411 -0.83989,-3.01718 -1.90109,-4.41107 -0.89542,-1.17614 -1.21891,-2.49141 -0.84394,-3.43136 l 0.3018,-0.75653 0.66577,1.45521 c 0.36617,0.80036 0.86087,1.98478 1.09933,2.63204 0.33022,0.8963 0.68404,1.3103 1.48428,1.73672 0.63831,0.34014 1.0094,0.70902 0.94545,0.93984 -0.63857,2.30474 0.93791,8.74525 2.03736,8.32335 0.19354,-0.0743 0.96909,0.44918 1.72344,1.16323 0.75435,0.71404 1.86939,1.77235 2.47786,2.35178 0.60847,0.57944 2.21581,1.65193 3.57187,2.38332 2.62011,1.41315 4.56061,1.92277 7.37258,1.93622 0.86641,0.004 1.57528,0.0551 1.57528,0.11323 0,0.0581 -0.89297,0.9843 -1.98437,2.05815 -1.09141,1.07384 -1.98438,2.15952 -1.98438,2.41261 0,0.25309 -0.19216,0.86511 -0.42702,1.36004 l -0.42702,0.89989 h -4.9845 -4.9845 l -0.27555,-0.99219 c -0.15155,-0.5457 -0.29491,-1.17078 -0.31858,-1.38906 -0.0237,-0.21829 -0.11364,0.19843 -0.19992,0.92604 l -0.15687,1.32291 -2.69376,0.0752 c -2.14597,0.0599 -2.73782,-0.004 -2.91042,-0.31189 z m 5.65427,-4.59195 c -0.0666,-0.25466 -0.121,-0.0463 -0.121,0.46302 0,0.50932 0.0545,0.71768 0.121,0.46302 0.0666,-0.25466 0.0666,-0.67138 0,-0.92604 z m 14.9858,4.49792 c 0.0817,-0.25467 0.51236,-1.5338 0.9569,-2.84252 0.44454,-1.30872 0.80825,-2.69188 0.80825,-3.07369 0,-0.50755 0.26678,-0.87305 0.99219,-1.35937 1.05321,-0.70607 2.73147,-2.281 3.68415,-3.45732 0.31641,-0.39068 0.68644,-0.71033 0.82229,-0.71033 0.13585,0 0.67096,0.6846 1.18913,1.52135 0.71356,1.15225 1.55443,1.97069 3.46589,3.37344 1.38806,1.01864 2.59085,2.01712 2.67287,2.21884 0.082,0.20172 -0.32632,1.36258 -0.9074,2.57969 l -1.05651,2.21293 h -6.3882 c -5.96424,0 -6.37834,-0.0307 -6.23956,-0.46302 z m -33.3909,-13.42761 c -0.0223,-32.70835 -0.0112,-16.35418 0,0 z m 35.94651,-4.50189 c -0.24201,-0.2916 -0.0857,-0.41979 0.80419,-0.65941 1.62794,-0.43836 1.86026,0.19728 0.27419,0.75019 -0.59541,0.20756 -0.84846,0.18626 -1.07838,-0.0908 z m -9.48394,-0.92513 c -1.07839,-0.78118 -1.87717,-1.9499 -1.55374,-2.27333 0.0866,-0.0866 0.79057,0.18178 1.56433,0.59644 0.99897,0.53533 1.43253,0.93536 1.4954,1.37974 0.15058,1.06423 -0.31913,1.15691 -1.50599,0.29715 z m 4.65859,-2.95182 c -1.05561,-0.5452 -1.52136,-0.94216 -1.52136,-1.29668 0,-0.71832 1.57535,-0.60712 1.59631,0.11268 0.0156,0.53714 1.0158,1.52911 1.77049,1.75599 0.50021,0.15038 0.56558,0.21963 0.20508,0.21725 -0.29104,-0.002 -1.21378,-0.35708 -2.05052,-0.78924 z m 15.94115,-6.69334 c 0,-0.23048 -0.31012,-0.53695 -0.68915,-0.68105 -0.57393,-0.21821 -0.66049,-0.37616 -0.51777,-0.9448 0.0943,-0.37554 0.0447,-0.83546 -0.11019,-1.02204 -0.21039,-0.25352 -0.14934,-0.37383 0.24157,-0.47605 0.45612,-0.11928 0.53307,-0.40294 0.60088,-2.21513 l 0.0778,-2.07833 h 0.79375 c 0.70212,0 0.80332,-0.0993 0.87666,-0.8599 0.099,-1.02687 0.75648,-1.16497 0.99635,-0.20927 0.23047,0.91828 -0.43379,4.3992 -0.87155,4.56719 -0.69737,0.2676 -1.17159,1.62524 -0.9902,2.83481 0.10853,0.72376 0.065,1.21117 -0.1182,1.32441 -0.16358,0.1011 -0.28993,-0.003 -0.28993,-0.23984 z m -33.84094,-0.12546 c -0.24656,-0.15238 -0.19071,-0.59284 0.23561,-1.85836 0.52293,-1.5523 0.53045,-1.68991 0.11735,-2.14639 -0.29541,-0.32641 -0.38526,-0.71146 -0.27166,-1.1641 0.13989,-0.55735 0.0523,-0.721 -0.49781,-0.93015 -0.56352,-0.21425 -0.66756,-0.42247 -0.66756,-1.33608 0,-0.59525 -0.13024,-1.32565 -0.28944,-1.6231 -0.22624,-0.42273 -0.16148,-0.89558 0.29656,-2.16542 0.3223,-0.89353 0.67741,-1.74366 0.78914,-1.88918 0.11172,-0.14552 0.28982,-1.03849 0.39578,-1.98437 0.10595,-0.94589 0.35734,-2.0413 0.55864,-2.43426 0.20129,-0.39295 0.36599,-1.01243 0.36599,-1.37661 0,-0.96033 0.478,-1.86174 1.14175,-2.1531 0.36727,-0.16122 0.70557,-0.68788 0.92779,-1.44437 0.4635,-1.57789 1.14181,-3.16623 1.42758,-3.34285 0.12663,-0.0783 0.38553,-0.0134 0.57535,0.14414 0.25711,0.21339 0.46741,0.15131 0.82464,-0.24343 0.59799,-0.66078 0.37473,-0.93059 -0.44268,-0.53496 -1.00979,0.48874 2.97369,-3.16598 4.04834,-3.71423 0.54248,-0.27675 1.06096,-0.62395 1.15219,-0.77155 0.0912,-0.1476 0.46431,-0.26837 0.82909,-0.26837 0.36478,0 0.88862,-0.12062 1.16409,-0.26804 0.9297,-0.49757 4.7784,-0.49104 5.94665,0.0101 1.32347,0.5677 2.0889,1.40453 2.10458,2.30089 0.0152,0.87178 0.67194,1.15692 0.6776,0.29423 0.007,-1.07921 0.37517,-1.40181 1.22828,-1.07648 0.41363,0.15774 1.18547,0.35828 1.71522,0.44565 0.67873,0.11194 1.45672,0.61278 2.63432,1.69587 l 1.67114,1.53702 -0.29744,1.29983 c -0.30054,1.31333 -0.11988,1.95794 0.5513,1.96712 0.50459,0.007 3.23964,2.69465 2.87802,2.82825 -0.61186,0.22604 -0.33817,0.50004 0.96903,0.9701 1.08918,0.39167 1.47497,0.72832 2.38125,2.07799 1.15095,1.71404 1.35315,2.67251 0.64715,3.0676 -0.29518,0.1652 -0.39171,0.46611 -0.30127,0.93919 0.17401,0.91029 -0.0138,0.87906 -1.29172,-0.21484 -0.65859,-0.56373 -1.24597,-1.39576 -1.54099,-2.18281 -0.2622,-0.69952 -0.75722,-1.75857 -1.10004,-2.35343 -0.34281,-0.59487 -0.6233,-1.32921 -0.6233,-1.63186 0,-0.38288 -0.31841,-0.69776 -1.04669,-1.03509 -0.64121,-0.297 -1.17135,-0.77928 -1.36849,-1.24496 -0.265,-0.62595 -1.54382,-1.48881 -2.20653,-1.48881 -0.31936,0 -0.10592,0.76672 0.38837,1.39512 0.72635,0.92339 0.66626,1.2851 -0.19843,1.19459 -0.64081,-0.0671 -0.7372,0.0224 -0.80798,0.74972 -0.0747,0.76742 -0.16833,0.83798 -1.32292,0.99673 -1.10328,0.1517 -1.48534,0.0501 -3.4089,-0.90673 l -2.16636,-1.07757 h -3.16477 c -3.35744,0 -4.79946,0.34494 -5.28318,1.26377 -0.14055,0.26698 -0.6349,2.02491 -1.09857,3.90652 -0.46366,1.88161 -1.05572,3.84614 -1.3157,4.36563 -0.25997,0.51948 -0.55138,1.27194 -0.64756,1.67212 -0.15445,0.64262 -0.2979,0.7276 -1.22817,0.7276 -0.85423,0 -1.05329,0.0939 -1.05329,0.49707 0,0.31418 0.31638,0.62303 0.8599,0.83942 0.47294,0.18829 0.89082,0.36264 0.92863,0.38746 0.18094,0.11877 -1.20021,3.05231 -1.97399,4.19272 -0.48008,0.70756 -0.87287,1.38586 -0.87287,1.50734 0,0.12148 -0.46393,0.20237 -1.03094,0.17976 -1.05315,-0.042 -1.87948,0.39735 -1.87948,0.99928 0,0.42783 -0.61061,0.6695 -1.0326,0.40869 z m 17.06638,-25.72334 c 0.28186,-0.45607 -0.93224,-1.31938 -1.72572,-1.22709 -0.97832,0.11378 -0.84057,0.76864 0.24402,1.16006 1.19237,0.43033 1.2554,0.43318 1.4817,0.067 z m 6.41839,-2.65446 c -0.29519,-0.5354 -0.34849,-0.55181 -0.43588,-0.13425 -0.0548,0.26166 0.0547,0.66166 0.24334,0.88891 0.47019,0.56655 0.61281,0.008 0.19254,-0.75466 z m -8.69384,0.43983 c 0,-0.4465 -0.99922,-0.92081 -1.52135,-0.72215 -0.49704,0.18911 -0.40005,0.48409 0.26458,0.80463 0.85076,0.4103 1.25677,0.38366 1.25677,-0.0825 z m -17.1383,26.41677 c -0.2269,-0.40362 -0.23985,-0.63227 -0.0427,-0.7541 0.40524,-0.25045 0.5692,0.004 0.4617,0.71533 l -0.0933,0.61803 z m 20.3133,0.005 c 0,-0.0977 0.19705,-0.39534 0.43789,-0.66146 0.4156,-0.45924 0.39452,-0.48386 -0.41427,-0.48386 -1.12388,0 -1.8757,-0.42591 -1.8757,-1.0626 0,-0.67799 -0.91666,-0.89454 -3.05881,-0.72259 -1.21276,0.0973 -1.772,0.0373 -1.97931,-0.21248 -0.29244,-0.35237 -0.2715,-0.37122 1.82029,-1.63892 0.48625,-0.29468 0.58215,-0.52028 0.44813,-1.05424 l -0.1705,-0.67933 1.62076,0.16941 c 0.89142,0.0932 1.87711,0.34895 2.19043,0.56841 0.31332,0.21946 0.76742,0.39901 1.00911,0.39901 0.24169,0 0.50465,0.24939 0.58436,0.55419 0.11958,0.45727 0.27956,0.52462 0.91474,0.38512 0.52657,-0.11566 0.87343,-0.0442 1.09772,0.22602 0.18035,0.21731 0.74257,0.53195 1.24938,0.69921 0.76784,0.25342 0.99936,0.23362 1.38873,-0.11875 0.25699,-0.23258 0.69601,-0.42709 0.9756,-0.43225 0.27958,-0.005 0.80599,-0.17953 1.16979,-0.3875 0.8943,-0.51123 2.10221,-0.49197 2.69328,0.043 0.4389,0.39719 0.44661,0.48335 0.0795,0.88896 -0.37116,0.41013 -0.32539,0.51097 0.52702,1.16114 0.51342,0.3916 0.93374,0.79525 0.93405,0.89698 2.6e-4,0.10174 -0.7633,0.14551 -1.6969,0.0973 -0.96334,-0.0498 -1.947,0.0459 -2.27447,0.22111 -0.4835,0.25876 -0.67354,0.21815 -1.17239,-0.2505 -0.36025,-0.33843 -0.76835,-0.49294 -1.03337,-0.39124 -0.24161,0.0927 -0.43801,0.0395 -0.43801,-0.11871 0,-0.15773 -0.30253,-0.48502 -0.6723,-0.7273 -0.91071,-0.59672 -1.73942,-0.19926 -2.66486,1.27812 -0.69633,1.11163 -1.0944,1.51928 -1.49149,1.52739 -0.10914,0.002 -0.19844,-0.0759 -0.19844,-0.17355 z m -8.79739,-5.48238 c -0.67928,-0.51564 -0.59784,-0.6049 0.87418,-0.95803 1.64016,-0.39347 1.9335,-0.17638 0.90142,0.66708 -0.90155,0.73678 -1.13739,0.77542 -1.7756,0.29095 z"
       style="fill:#008080;fill-opacity:1;stroke-width:0.264583"
       sodipodi:nodetypes="cssccssccssssssccsscscsccssscscsscccscscsccsscscssssssscscsccccssccssccssscscsccccsccscscsscccsccsscscccssccsssscsccccsssccccsssccscsscscccsccsscssssssssssccccccccccccsccccccccccssccssccssscccscsccscccscssscccssss" />
  </g>
</svg>
