%YAML 1.1
%TAG !u! tag:unity3d.com,2011:
--- !u!114 &11400000
MonoBehaviour:
  m_ObjectHideFlags: 0
  m_CorrespondingSourceObject: {fileID: 0}
  m_PrefabInstance: {fileID: 0}
  m_PrefabAsset: {fileID: 0}
  m_GameObject: {fileID: 0}
  m_Enabled: 1
  m_EditorHideFlags: 0
  m_Script: {fileID: 11500000, guid: 03f9522b1b0f53b4c87d047ac5c3794f, type: 3}
  m_Name: All_man_DashForward
  m_EditorClassIdentifier: 
  gameplayType: 0
  animMap:
    animationMaps:
    - frame: 0
      hitBoxMaps:
      - bodyPart: 1
        mappedPosition:
          x:
            _serializedValue: 4654123008
          y:
            _serializedValue: 18105798656
          z:
            _serializedValue: -1595929088
      - bodyPart: 2
        mappedPosition:
          x:
            _serializedValue: 1659091712
          y:
            _serializedValue: 17270274048
          z:
            _serializedValue: -562590592
      - bodyPart: 3
        mappedPosition:
          x:
            _serializedValue: -2103307520
          y:
            _serializedValue: 14484957184
          z:
            _serializedValue: 575827328
      - bodyPart: 4
        mappedPosition:
          x:
            _serializedValue: 3910713600
          y:
            _serializedValue: 17429995520
          z:
            _serializedValue: 2127821312
      - bodyPart: 5
        mappedPosition:
          x:
            _serializedValue: 1741261952
          y:
            _serializedValue: 19765426176
          z:
            _serializedValue: -2893330688
      - bodyPart: 6
        mappedPosition:
          x:
            _serializedValue: 842105152
          y:
            _serializedValue: 16480706560
          z:
            _serializedValue: 3338910464
      - bodyPart: 7
        mappedPosition:
          x:
            _serializedValue: -1561876480
          y:
            _serializedValue: 19951915008
          z:
            _serializedValue: -1977498368
      - bodyPart: 8
        mappedPosition:
          x:
            _serializedValue: -2751609600
          y:
            _serializedValue: 14830879744
          z:
            _serializedValue: 4847375360
      - bodyPart: 9
        mappedPosition:
          x:
            _serializedValue: -5624738304
          y:
            _serializedValue: 19078471680
          z:
            _serializedValue: -1175971840
      - bodyPart: 10
        mappedPosition:
          x:
            _serializedValue: -1819033472
          y:
            _serializedValue: 12577528832
          z:
            _serializedValue: 1805153792
      - bodyPart: 11
        mappedPosition:
          x:
            _serializedValue: -2571965696
          y:
            _serializedValue: 12713122816
          z:
            _serializedValue: -792091904
      - bodyPart: 12
        mappedPosition:
          x:
            _serializedValue: -4013196800
          y:
            _serializedValue: 6616104960
          z:
            _serializedValue: 2580979968
      - bodyPart: 13
        mappedPosition:
          x:
            _serializedValue: 3133961472
          y:
            _serializedValue: 10298673152
          z:
            _serializedValue: -2394628608
      - bodyPart: 14
        mappedPosition:
          x:
            _serializedValue: -7868939264
          y:
            _serializedValue: 11263791104
          z:
            _serializedValue: 2791660032
      - bodyPart: 15
        mappedPosition:
          x:
            _serializedValue: 3730620416
          y:
            _serializedValue: 4375865344
          z:
            _serializedValue: -1356998912
      - bodyPart: 0
        mappedPosition:
          x:
            _serializedValue: -2266771200
          y:
            _serializedValue: 12863734784
          z:
            _serializedValue: 538592256
      deltaDisplacement:
        x:
          _serializedValue: 0
        y:
          _serializedValue: 0
        z:
          _serializedValue: 0
    - frame: 1
      hitBoxMaps:
      - bodyPart: 1
        mappedPosition:
          x:
            _serializedValue: 4581117952
          y:
            _serializedValue: 18016358400
          z:
            _serializedValue: -1734214144
      - bodyPart: 2
        mappedPosition:
          x:
            _serializedValue: 1588212736
          y:
            _serializedValue: 17170151424
          z:
            _serializedValue: -703404096
      - bodyPart: 3
        mappedPosition:
          x:
            _serializedValue: -2181931520
          y:
            _serializedValue: 14388058112
          z:
            _serializedValue: 432737792
      - bodyPart: 4
        mappedPosition:
          x:
            _serializedValue: 3922257664
          y:
            _serializedValue: 17377570816
          z:
            _serializedValue: 1977356288
      - bodyPart: 5
        mappedPosition:
          x:
            _serializedValue: 1721612672
          y:
            _serializedValue: 19650537472
          z:
            _serializedValue: -3126273536
      - bodyPart: 6
        mappedPosition:
          x:
            _serializedValue: 830906688
          y:
            _serializedValue: 16534310912
          z:
            _serializedValue: 3208901888
      - bodyPart: 7
        mappedPosition:
          x:
            _serializedValue: -1568781056
          y:
            _serializedValue: 19900504064
          z:
            _serializedValue: -2180181504
      - bodyPart: 8
        mappedPosition:
          x:
            _serializedValue: -2813041152
          y:
            _serializedValue: 15035262976
          z:
            _serializedValue: 4753793024
      - bodyPart: 9
        mappedPosition:
          x:
            _serializedValue: -5641224704
          y:
            _serializedValue: 19129823232
          z:
            _serializedValue: -1323777536
      - bodyPart: 10
        mappedPosition:
          x:
            _serializedValue: -1902150912
          y:
            _serializedValue: 12484769792
          z:
            _serializedValue: 1669487360
      - bodyPart: 11
        mappedPosition:
          x:
            _serializedValue: -2658073088
          y:
            _serializedValue: 12612161536
          z:
            _serializedValue: -927307008
      - bodyPart: 12
        mappedPosition:
          x:
            _serializedValue: -3519899392
          y:
            _serializedValue: 6335779840
          z:
            _serializedValue: 2395897600
      - bodyPart: 13
        mappedPosition:
          x:
            _serializedValue: 2744444160
          y:
            _serializedValue: 9494818816
          z:
            _serializedValue: -2359194624
      - bodyPart: 14
        mappedPosition:
          x:
            _serializedValue: -7117603840
          y:
            _serializedValue: 11184770048
          z:
            _serializedValue: 2632426496
      - bodyPart: 15
        mappedPosition:
          x:
            _serializedValue: 2188004352
          y:
            _serializedValue: 3687899648
          z:
            _serializedValue: -783639680
      - bodyPart: 0
        mappedPosition:
          x:
            _serializedValue: -2350640384
          y:
            _serializedValue: 12767232000
          z:
            _serializedValue: 402350848
      deltaDisplacement:
        x:
          _serializedValue: 0
        y:
          _serializedValue: 0
        z:
          _serializedValue: 0
    - frame: 2
      hitBoxMaps:
      - bodyPart: 1
        mappedPosition:
          x:
            _serializedValue: 4441585664
          y:
            _serializedValue: 17826725888
          z:
            _serializedValue: -1856642048
      - bodyPart: 2
        mappedPosition:
          x:
            _serializedValue: 1459534464
          y:
            _serializedValue: 16931912704
          z:
            _serializedValue: -835472320
      - bodyPart: 3
        mappedPosition:
          x:
            _serializedValue: -2303468544
          y:
            _serializedValue: 14124556288
          z:
            _serializedValue: 294944640
      - bodyPart: 4
        mappedPosition:
          x:
            _serializedValue: 3835066112
          y:
            _serializedValue: 17260576768
          z:
            _serializedValue: 1843475968
      - bodyPart: 5
        mappedPosition:
          x:
            _serializedValue: 1593330176
          y:
            _serializedValue: 19369287680
          z:
            _serializedValue: -3360589312
      - bodyPart: 6
        mappedPosition:
          x:
            _serializedValue: 721671680
          y:
            _serializedValue: 16537536512
          z:
            _serializedValue: 3095771648
      - bodyPart: 7
        mappedPosition:
          x:
            _serializedValue: -1683284608
          y:
            _serializedValue: 19681495040
          z:
            _serializedValue: -2385617408
      - bodyPart: 8
        mappedPosition:
          x:
            _serializedValue: -2978888192
          y:
            _serializedValue: 15245088768
          z:
            _serializedValue: 4691900416
      - bodyPart: 9
        mappedPosition:
          x:
            _serializedValue: -5762819072
          y:
            _serializedValue: 19048960000
          z:
            _serializedValue: -1453156864
      - bodyPart: 10
        mappedPosition:
          x:
            _serializedValue: -2022606592
          y:
            _serializedValue: 12227746816
          z:
            _serializedValue: 1541365888
      - bodyPart: 11
        mappedPosition:
          x:
            _serializedValue: -2780281344
          y:
            _serializedValue: 12341565440
          z:
            _serializedValue: -1055549184
      - bodyPart: 12
        mappedPosition:
          x:
            _serializedValue: -2950380288
          y:
            _serializedValue: 5936764928
          z:
            _serializedValue: 2260869120
      - bodyPart: 13
        mappedPosition:
          x:
            _serializedValue: 2113413760
          y:
            _serializedValue: 8400596992
          z:
            _serializedValue: -2270412032
      - bodyPart: 14
        mappedPosition:
          x:
            _serializedValue: -6304177152
          y:
            _serializedValue: 10959474688
          z:
            _serializedValue: 2452068608
      - bodyPart: 15
        mappedPosition:
          x:
            _serializedValue: 645418240
          y:
            _serializedValue: 2915063296
          z:
            _serializedValue: -204923360
      - bodyPart: 0
        mappedPosition:
          x:
            _serializedValue: -2471981056
          y:
            _serializedValue: 12503572480
          z:
            _serializedValue: 273080576
      deltaDisplacement:
        x:
          _serializedValue: 0
        y:
          _serializedValue: 0
        z:
          _serializedValue: 0
    - frame: 3
      hitBoxMaps:
      - bodyPart: 1
        mappedPosition:
          x:
            _serializedValue: 4261477632
          y:
            _serializedValue: 17602105344
          z:
            _serializedValue: -1953507840
      - bodyPart: 2
        mappedPosition:
          x:
            _serializedValue: 1296394368
          y:
            _serializedValue: 16635229184
          z:
            _serializedValue: -948751808
      - bodyPart: 3
        mappedPosition:
          x:
            _serializedValue: -2447942400
          y:
            _serializedValue: 13782283264
          z:
            _serializedValue: 168821504
      - bodyPart: 4
        mappedPosition:
          x:
            _serializedValue: 3654083072
          y:
            _serializedValue: 17120026624
          z:
            _serializedValue: 1737223936
      - bodyPart: 5
        mappedPosition:
          x:
            _serializedValue: 1377894144
          y:
            _serializedValue: 19011731456
          z:
            _serializedValue: -3555448576
      - bodyPart: 6
        mappedPosition:
          x:
            _serializedValue: 529056800
          y:
            _serializedValue: 16477186048
          z:
            _serializedValue: 3004199936
      - bodyPart: 7
        mappedPosition:
          x:
            _serializedValue: -1900374656
          y:
            _serializedValue: 19332100096
          z:
            _serializedValue: -2588717056
      - bodyPart: 8
        mappedPosition:
          x:
            _serializedValue: -3206673664
          y:
            _serializedValue: 15359291392
          z:
            _serializedValue: 4649438208
      - bodyPart: 9
        mappedPosition:
          x:
            _serializedValue: -5985718272
          y:
            _serializedValue: 18788405248
          z:
            _serializedValue: -1626138112
      - bodyPart: 10
        mappedPosition:
          x:
            _serializedValue: -2160948224
          y:
            _serializedValue: 11892850688
          z:
            _serializedValue: 1425010432
      - bodyPart: 11
        mappedPosition:
          x:
            _serializedValue: -2918178304
          y:
            _serializedValue: 11990777856
          z:
            _serializedValue: -1172676864
      - bodyPart: 12
        mappedPosition:
          x:
            _serializedValue: -2166911744
          y:
            _serializedValue: 5537969664
          z:
            _serializedValue: 2180165632
      - bodyPart: 13
        mappedPosition:
          x:
            _serializedValue: 1630176768
          y:
            _serializedValue: 7603017728
          z:
            _serializedValue: -2180302336
      - bodyPart: 14
        mappedPosition:
          x:
            _serializedValue: -5465997312
          y:
            _serializedValue: 10599752704
          z:
            _serializedValue: 2260803328
      - bodyPart: 15
        mappedPosition:
          x:
            _serializedValue: -1170057856
          y:
            _serializedValue: 2868051200
          z:
            _serializedValue: 319915136
      - bodyPart: 0
        mappedPosition:
          x:
            _serializedValue: -2610863872
          y:
            _serializedValue: 12160636928
          z:
            _serializedValue: 155197696
      deltaDisplacement:
        x:
          _serializedValue: 0
        y:
          _serializedValue: 0
        z:
          _serializedValue: 0
    - frame: 4
      hitBoxMaps:
      - bodyPart: 1
        mappedPosition:
          x:
            _serializedValue: 4076476672
          y:
            _serializedValue: 17402259456
          z:
            _serializedValue: -2020575232
      - bodyPart: 2
        mappedPosition:
          x:
            _serializedValue: 1131234688
          y:
            _serializedValue: 16357203968
          z:
            _serializedValue: -1035926784
      - bodyPart: 3
        mappedPosition:
          x:
            _serializedValue: -2588015872
          y:
            _serializedValue: 13450231808
          z:
            _serializedValue: 62980864
      - bodyPart: 4
        mappedPosition:
          x:
            _serializedValue: 3415483648
          y:
            _serializedValue: 17002958848
          z:
            _serializedValue: 1662237696
      - bodyPart: 5
        mappedPosition:
          x:
            _serializedValue: 1120820992
          y:
            _serializedValue: 18657347584
          z:
            _serializedValue: -3696740096
      - bodyPart: 6
        mappedPosition:
          x:
            _serializedValue: 286274816
          y:
            _serializedValue: 16395303936
          z:
            _serializedValue: 2936228096
      - bodyPart: 7
        mappedPosition:
          x:
            _serializedValue: -2170389504
          y:
            _serializedValue: 18930204672
          z:
            _serializedValue: -2759866624
      - bodyPart: 8
        mappedPosition:
          x:
            _serializedValue: -3464746240
          y:
            _serializedValue: 15392338944
          z:
            _serializedValue: 4620296704
      - bodyPart: 9
        mappedPosition:
          x:
            _serializedValue: -6259923968
          y:
            _serializedValue: 18403983360
          z:
            _serializedValue: -1805412352
      - bodyPart: 10
        mappedPosition:
          x:
            _serializedValue: -2291310592
          y:
            _serializedValue: 11568287744
          z:
            _serializedValue: 1328123264
      - bodyPart: 11
        mappedPosition:
          x:
            _serializedValue: -3046288384
          y:
            _serializedValue: 11649874944
          z:
            _serializedValue: -1270787072
      - bodyPart: 12
        mappedPosition:
          x:
            _serializedValue: -942933888
          y:
            _serializedValue: 5340892672
          z:
            _serializedValue: 1924984704
      - bodyPart: 13
        mappedPosition:
          x:
            _serializedValue: 784270656
          y:
            _serializedValue: 6563720192
          z:
            _serializedValue: -1913594112
      - bodyPart: 14
        mappedPosition:
          x:
            _serializedValue: -4616264704
          y:
            _serializedValue: 10136712192
          z:
            _serializedValue: 2062392832
      - bodyPart: 15
        mappedPosition:
          x:
            _serializedValue: -3062975488
          y:
            _serializedValue: 2805466112
          z:
            _serializedValue: 840773632
      - bodyPart: 0
        mappedPosition:
          x:
            _serializedValue: -2741411840
          y:
            _serializedValue: 11827613696
          z:
            _serializedValue: 56620288
      deltaDisplacement:
        x:
          _serializedValue: 0
        y:
          _serializedValue: 0
        z:
          _serializedValue: 0
    - frame: 5
      hitBoxMaps:
      - bodyPart: 1
        mappedPosition:
          x:
            _serializedValue: 3924857600
          y:
            _serializedValue: 17283897344
          z:
            _serializedValue: -2063784448
      - bodyPart: 2
        mappedPosition:
          x:
            _serializedValue: 997596288
          y:
            _serializedValue: 16173808640
          z:
            _serializedValue: -1096845312
      - bodyPart: 3
        mappedPosition:
          x:
            _serializedValue: -2697250816
          y:
            _serializedValue: 13218840576
          z:
            _serializedValue: -16596480
      - bodyPart: 4
        mappedPosition:
          x:
            _serializedValue: 3178109440
          y:
            _serializedValue: 16971630592
          z:
            _serializedValue: 1609549312
      - bodyPart: 5
        mappedPosition:
          x:
            _serializedValue: 884958016
          y:
            _serializedValue: 18380451840
          z:
            _serializedValue: -3797103360
      - bodyPart: 6
        mappedPosition:
          x:
            _serializedValue: 45429980
          y:
            _serializedValue: 16386155520
          z:
            _serializedValue: 2885398016
      - bodyPart: 7
        mappedPosition:
          x:
            _serializedValue: -2418199808
          y:
            _serializedValue: 18591375360
          z:
            _serializedValue: -2886659072
      - bodyPart: 8
        mappedPosition:
          x:
            _serializedValue: -3713985536
          y:
            _serializedValue: 15462506496
          z:
            _serializedValue: 4595907584
      - bodyPart: 9
        mappedPosition:
          x:
            _serializedValue: -6508700672
          y:
            _serializedValue: 18044813312
          z:
            _serializedValue: -1947900928
      - bodyPart: 10
        mappedPosition:
          x:
            _serializedValue: -2389555200
          y:
            _serializedValue: 11344312320
          z:
            _serializedValue: 1256905600
      - bodyPart: 11
        mappedPosition:
          x:
            _serializedValue: -3141691904
          y:
            _serializedValue: 11409803264
          z:
            _serializedValue: -1343285248
      - bodyPart: 12
        mappedPosition:
          x:
            _serializedValue: 950138112
          y:
            _serializedValue: 5885288960
          z:
            _serializedValue: 1238492032
      - bodyPart: 13
        mappedPosition:
          x:
            _serializedValue: -512580896
          y:
            _serializedValue: 5578059776
          z:
            _serializedValue: -1527323776
      - bodyPart: 14
        mappedPosition:
          x:
            _serializedValue: -3753914368
          y:
            _serializedValue: 9627480064
          z:
            _serializedValue: 1854938496
      - bodyPart: 15
        mappedPosition:
          x:
            _serializedValue: -4972087808
          y:
            _serializedValue: 2693411840
          z:
            _serializedValue: 1354325248
      - bodyPart: 0
        mappedPosition:
          x:
            _serializedValue: -2839739904
          y:
            _serializedValue: 11595214848
          z:
            _serializedValue: -16258304
      deltaDisplacement:
        x:
          _serializedValue: 0
        y:
          _serializedValue: 0
        z:
          _serializedValue: 0
    - frame: 6
      hitBoxMaps:
      - bodyPart: 1
        mappedPosition:
          x:
            _serializedValue: 3847136512
          y:
            _serializedValue: 17305847808
          z:
            _serializedValue: -2092079488
      - bodyPart: 2
        mappedPosition:
          x:
            _serializedValue: 929923264
          y:
            _serializedValue: 16160925696
          z:
            _serializedValue: -1135449728
      - bodyPart: 3
        mappedPosition:
          x:
            _serializedValue: -2748128256
          y:
            _serializedValue: 13175881728
          z:
            _serializedValue: -69965312
      - bodyPart: 4
        mappedPosition:
          x:
            _serializedValue: 2995597824
          y:
            _serializedValue: 17086701568
          z:
            _serializedValue: 1569312768
      - bodyPart: 5
        mappedPosition:
          x:
            _serializedValue: 721846528
          y:
            _serializedValue: 18261839872
          z:
            _serializedValue: -3861434368
      - bodyPart: 6
        mappedPosition:
          x:
            _serializedValue: -139803696
          y:
            _serializedValue: 16510758912
          z:
            _serializedValue: 2842806528
      - bodyPart: 7
        mappedPosition:
          x:
            _serializedValue: -2590566144
          y:
            _serializedValue: 18402463744
          z:
            _serializedValue: -2971262464
      - bodyPart: 8
        mappedPosition:
          x:
            _serializedValue: -3903471616
          y:
            _serializedValue: 15621270528
          z:
            _serializedValue: 4562059264
      - bodyPart: 9
        mappedPosition:
          x:
            _serializedValue: -6676929536
          y:
            _serializedValue: 17791762432
          z:
            _serializedValue: -2054274048
      - bodyPart: 10
        mappedPosition:
          x:
            _serializedValue: -2429655552
          y:
            _serializedValue: 11308284928
          z:
            _serializedValue: 1211046528
      - bodyPart: 11
        mappedPosition:
          x:
            _serializedValue: -3179223552
          y:
            _serializedValue: 11358923776
          z:
            _serializedValue: -1390214144
      - bodyPart: 12
        mappedPosition:
          x:
            _serializedValue: 2827260928
          y:
            _serializedValue: 7807537152
          z:
            _serializedValue: 179353856
      - bodyPart: 13
        mappedPosition:
          x:
            _serializedValue: -2265867264
          y:
            _serializedValue: 5034093056
          z:
            _serializedValue: -1047305984
      - bodyPart: 14
        mappedPosition:
          x:
            _serializedValue: -2888260608
          y:
            _serializedValue: 9115919360
          z:
            _serializedValue: 1639861504
      - bodyPart: 15
        mappedPosition:
          x:
            _serializedValue: -6912179200
          y:
            _serializedValue: 2524016384
          z:
            _serializedValue: 1889293312
      - bodyPart: 0
        mappedPosition:
          x:
            _serializedValue: -2880008704
          y:
            _serializedValue: 11551373312
          z:
            _serializedValue: -63570944
      deltaDisplacement:
        x:
          _serializedValue: 0
        y:
          _serializedValue: 0
        z:
          _serializedValue: 0
    - frame: 7
      hitBoxMaps:
      - bodyPart: 1
        mappedPosition:
          x:
            _serializedValue: 3848036096
          y:
            _serializedValue: 17528918016
          z:
            _serializedValue: -2122007424
      - bodyPart: 2
        mappedPosition:
          x:
            _serializedValue: 930242240
          y:
            _serializedValue: 16388207616
          z:
            _serializedValue: -1162118144
      - bodyPart: 3
        mappedPosition:
          x:
            _serializedValue: -2722936320
          y:
            _serializedValue: 13377574912
          z:
            _serializedValue: -109202176
      - bodyPart: 4
        mappedPosition:
          x:
            _serializedValue: 2723692544
          y:
            _serializedValue: 17394386944
          z:
            _serializedValue: 1530492160
      - bodyPart: 5
        mappedPosition:
          x:
            _serializedValue: 500151072
          y:
            _serializedValue: 18341660672
          z:
            _serializedValue: -3771807488
      - bodyPart: 6
        mappedPosition:
          x:
            _serializedValue: -394911040
          y:
            _serializedValue: 16696475648
          z:
            _serializedValue: 2784076544
      - bodyPart: 7
        mappedPosition:
          x:
            _serializedValue: -2823584256
          y:
            _serializedValue: 18298220544
          z:
            _serializedValue: -2914392832
      - bodyPart: 8
        mappedPosition:
          x:
            _serializedValue: -4131728384
          y:
            _serializedValue: 15666534400
          z:
            _serializedValue: 4483373568
      - bodyPart: 9
        mappedPosition:
          x:
            _serializedValue: -6882978816
          y:
            _serializedValue: 17463908352
          z:
            _serializedValue: -2055649280
      - bodyPart: 10
        mappedPosition:
          x:
            _serializedValue: -2378302464
          y:
            _serializedValue: 11514113024
          z:
            _serializedValue: 1171062912
      - bodyPart: 11
        mappedPosition:
          x:
            _serializedValue: -3126211072
          y:
            _serializedValue: 11555249152
          z:
            _serializedValue: -1430848256
      - bodyPart: 12
        mappedPosition:
          x:
            _serializedValue: 3532327168
          y:
            _serializedValue: 9809487872
          z:
            _serializedValue: -593453312
      - bodyPart: 13
        mappedPosition:
          x:
            _serializedValue: -3264093184
          y:
            _serializedValue: 5183143424
          z:
            _serializedValue: -854121984
      - bodyPart: 14
        mappedPosition:
          x:
            _serializedValue: -2030750336
          y:
            _serializedValue: 8579320832
          z:
            _serializedValue: 1419250048
      - bodyPart: 15
        mappedPosition:
          x:
            _serializedValue: -8051502080
          y:
            _serializedValue: 3117522688
          z:
            _serializedValue: 2199766528
      - bodyPart: 0
        mappedPosition:
          x:
            _serializedValue: -2831029760
          y:
            _serializedValue: 11751304192
          z:
            _serializedValue: -103827456
      deltaDisplacement:
        x:
          _serializedValue: 0
        y:
          _serializedValue: 0
        z:
          _serializedValue: 0
    - frame: 8
      hitBoxMaps:
      - bodyPart: 1
        mappedPosition:
          x:
            _serializedValue: 3874373376
          y:
            _serializedValue: 17861144576
          z:
            _serializedValue: -2154398464
      - bodyPart: 2
        mappedPosition:
          x:
            _serializedValue: 955550592
          y:
            _serializedValue: 16733602816
          z:
            _serializedValue: -1182151040
      - bodyPart: 3
        mappedPosition:
          x:
            _serializedValue: -2649917696
          y:
            _serializedValue: 13680338944
          z:
            _serializedValue: -142414592
      - bodyPart: 4
        mappedPosition:
          x:
            _serializedValue: 2353769984
          y:
            _serializedValue: 17805479936
          z:
            _serializedValue: 1446332928
      - bodyPart: 5
        mappedPosition:
          x:
            _serializedValue: 231524864
          y:
            _serializedValue: 18518761472
          z:
            _serializedValue: -3514451968
      - bodyPart: 6
        mappedPosition:
          x:
            _serializedValue: -716863616
          y:
            _serializedValue: 16875980800
          z:
            _serializedValue: 2667597312
      - bodyPart: 7
        mappedPosition:
          x:
            _serializedValue: -3103686400
          y:
            _serializedValue: 18203170816
          z:
            _serializedValue: -2765428736
      - bodyPart: 8
        mappedPosition:
          x:
            _serializedValue: -4384340480
          y:
            _serializedValue: 15578947584
          z:
            _serializedValue: 4334779392
      - bodyPart: 9
        mappedPosition:
          x:
            _serializedValue: -7113285632
          y:
            _serializedValue: 17040496640
          z:
            _serializedValue: -2070102016
      - bodyPart: 10
        mappedPosition:
          x:
            _serializedValue: -2258985472
          y:
            _serializedValue: 11818121216
          z:
            _serializedValue: 1126309504
      - bodyPart: 11
        mappedPosition:
          x:
            _serializedValue: -3007897600
          y:
            _serializedValue: 11856776192
          z:
            _serializedValue: -1475349504
      - bodyPart: 12
        mappedPosition:
          x:
            _serializedValue: 3686220288
          y:
            _serializedValue: 10791063552
          z:
            _serializedValue: -1007818240
      - bodyPart: 13
        mappedPosition:
          x:
            _serializedValue: -3446120960
          y:
            _serializedValue: 5493484032
          z:
            _serializedValue: -953989888
      - bodyPart: 14
        mappedPosition:
          x:
            _serializedValue: -1192242944
          y:
            _serializedValue: 7987664384
          z:
            _serializedValue: 1195290240
      - bodyPart: 15
        mappedPosition:
          x:
            _serializedValue: -8148859904
          y:
            _serializedValue: 3433878784
          z:
            _serializedValue: 2232640000
      - bodyPart: 0
        mappedPosition:
          x:
            _serializedValue: -2717571072
          y:
            _serializedValue: 12051884032
          z:
            _serializedValue: -147119104
      deltaDisplacement:
        x:
          _serializedValue: 0
        y:
          _serializedValue: 0
        z:
          _serializedValue: 0
    - frame: 9
      hitBoxMaps:
      - bodyPart: 1
        mappedPosition:
          x:
            _serializedValue: 3922712320
          y:
            _serializedValue: 18106732544
          z:
            _serializedValue: -2186576896
      - bodyPart: 2
        mappedPosition:
          x:
            _serializedValue: 1003529600
          y:
            _serializedValue: 16989244416
          z:
            _serializedValue: -1203870080
      - bodyPart: 3
        mappedPosition:
          x:
            _serializedValue: -2570107392
          y:
            _serializedValue: 13910216704
          z:
            _serializedValue: -169389056
      - bodyPart: 4
        mappedPosition:
          x:
            _serializedValue: 2182818304
          y:
            _serializedValue: 18114920448
          z:
            _serializedValue: 1355292160
      - bodyPart: 5
        mappedPosition:
          x:
            _serializedValue: 139883760
          y:
            _serializedValue: 18676094976
          z:
            _serializedValue: -3361642240
      - bodyPart: 6
        mappedPosition:
          x:
            _serializedValue: -855492800
          y:
            _serializedValue: 17062635520
          z:
            _serializedValue: 2557627648
      - bodyPart: 7
        mappedPosition:
          x:
            _serializedValue: -3198087168
          y:
            _serializedValue: 18222000128
          z:
            _serializedValue: -2701337856
      - bodyPart: 8
        mappedPosition:
          x:
            _serializedValue: -4477149184
          y:
            _serializedValue: 15617497088
          z:
            _serializedValue: 4203034112
      - bodyPart: 9
        mappedPosition:
          x:
            _serializedValue: -7173824512
          y:
            _serializedValue: 16886281216
          z:
            _serializedValue: -2134274560
      - bodyPart: 10
        mappedPosition:
          x:
            _serializedValue: -2148725760
          y:
            _serializedValue: 12049217536
          z:
            _serializedValue: 1091346816
      - bodyPart: 11
        mappedPosition:
          x:
            _serializedValue: -2900041728
          y:
            _serializedValue: 12086724608
          z:
            _serializedValue: -1509634304
      - bodyPart: 12
        mappedPosition:
          x:
            _serializedValue: 3763685888
          y:
            _serializedValue: 11195938816
          z:
            _serializedValue: -1204328704
      - bodyPart: 13
        mappedPosition:
          x:
            _serializedValue: -4383020544
          y:
            _serializedValue: 5903888896
          z:
            _serializedValue: -782595584
      - bodyPart: 14
        mappedPosition:
          x:
            _serializedValue: -381439808
          y:
            _serializedValue: 7374430720
          z:
            _serializedValue: 969640128
      - bodyPart: 15
        mappedPosition:
          x:
            _serializedValue: -9035432960
          y:
            _serializedValue: 3878426624
          z:
            _serializedValue: 2498392064
      - bodyPart: 0
        mappedPosition:
          x:
            _serializedValue: -2611887872
          y:
            _serializedValue: 12280926208
          z:
            _serializedValue: -180798720
      deltaDisplacement:
        x:
          _serializedValue: 0
        y:
          _serializedValue: 0
        z:
          _serializedValue: 0
    - frame: 10
      hitBoxMaps:
      - bodyPart: 1
        mappedPosition:
          x:
            _serializedValue: 4009672960
          y:
            _serializedValue: 18208352256
          z:
            _serializedValue: -2227276800
      - bodyPart: 2
        mappedPosition:
          x:
            _serializedValue: 1085438336
          y:
            _serializedValue: 17109518336
          z:
            _serializedValue: -1238580992
      - bodyPart: 3
        mappedPosition:
          x:
            _serializedValue: -2483701760
          y:
            _serializedValue: 14039106560
          z:
            _serializedValue: -175968768
      - bodyPart: 4
        mappedPosition:
          x:
            _serializedValue: 2234103808
          y:
            _serializedValue: 18310475776
          z:
            _serializedValue: 1292105472
      - bodyPart: 5
        mappedPosition:
          x:
            _serializedValue: 231514112
          y:
            _serializedValue: 18743054336
          z:
            _serializedValue: -3441213440
      - bodyPart: 6
        mappedPosition:
          x:
            _serializedValue: -811897024
          y:
            _serializedValue: 17274384384
          z:
            _serializedValue: 2489036544
      - bodyPart: 7
        mappedPosition:
          x:
            _serializedValue: -3107462144
          y:
            _serializedValue: 18293716992
          z:
            _serializedValue: -2782741760
      - bodyPart: 8
        mappedPosition:
          x:
            _serializedValue: -4437320704
          y:
            _serializedValue: 15817649152
          z:
            _serializedValue: 4115811840
      - bodyPart: 9
        mappedPosition:
          x:
            _serializedValue: -7076721664
          y:
            _serializedValue: 16933081088
          z:
            _serializedValue: -2229714432
      - bodyPart: 10
        mappedPosition:
          x:
            _serializedValue: -2060541440
          y:
            _serializedValue: 12181118976
          z:
            _serializedValue: 1088605440
      - bodyPart: 11
        mappedPosition:
          x:
            _serializedValue: -2812781056
          y:
            _serializedValue: 12212508672
          z:
            _serializedValue: -1512188416
      - bodyPart: 12
        mappedPosition:
          x:
            _serializedValue: 3861171712
          y:
            _serializedValue: 11496385536
          z:
            _serializedValue: -1239322112
      - bodyPart: 13
        mappedPosition:
          x:
            _serializedValue: -5721736704
          y:
            _serializedValue: 6627302400
          z:
            _serializedValue: -372580352
      - bodyPart: 14
        mappedPosition:
          x:
            _serializedValue: 429012832
          y:
            _serializedValue: 6926008832
          z:
            _serializedValue: 721304704
      - bodyPart: 15
        mappedPosition:
          x:
            _serializedValue: -10636475392
          y:
            _serializedValue: 4836378624
          z:
            _serializedValue: 2652357632
      - bodyPart: 0
        mappedPosition:
          x:
            _serializedValue: -2524309248
          y:
            _serializedValue: 12409765888
          z:
            _serializedValue: -183873280
      deltaDisplacement:
        x:
          _serializedValue: 0
        y:
          _serializedValue: 0
        z:
          _serializedValue: 0
    - frame: 11
      hitBoxMaps:
      - bodyPart: 1
        mappedPosition:
          x:
            _serializedValue: 4102675712
          y:
            _serializedValue: 18271815680
          z:
            _serializedValue: -2259106048
      - bodyPart: 2
        mappedPosition:
          x:
            _serializedValue: 1169839744
          y:
            _serializedValue: 17201219584
          z:
            _serializedValue: -1264916352
      - bodyPart: 3
        mappedPosition:
          x:
            _serializedValue: -2397580032
          y:
            _serializedValue: 14151013376
          z:
            _serializedValue: -150953472
      - bodyPart: 4
        mappedPosition:
          x:
            _serializedValue: 2313496576
          y:
            _serializedValue: 18511147008
          z:
            _serializedValue: 1234760448
      - bodyPart: 5
        mappedPosition:
          x:
            _serializedValue: 363122176
          y:
            _serializedValue: 18766639104
          z:
            _serializedValue: -3574763008
      - bodyPart: 6
        mappedPosition:
          x:
            _serializedValue: -745634176
          y:
            _serializedValue: 17505138688
          z:
            _serializedValue: 2423846400
      - bodyPart: 7
        mappedPosition:
          x:
            _serializedValue: -2979386112
          y:
            _serializedValue: 18342248448
          z:
            _serializedValue: -2917661696
      - bodyPart: 8
        mappedPosition:
          x:
            _serializedValue: -4376206336
          y:
            _serializedValue: 16027203584
          z:
            _serializedValue: 4019721216
      - bodyPart: 9
        mappedPosition:
          x:
            _serializedValue: -6942959616
          y:
            _serializedValue: 16957095936
          z:
            _serializedValue: -2385088512
      - bodyPart: 10
        mappedPosition:
          x:
            _serializedValue: -1978735744
          y:
            _serializedValue: 12296980480
          z:
            _serializedValue: 1120842112
      - bodyPart: 11
        mappedPosition:
          x:
            _serializedValue: -2731484160
          y:
            _serializedValue: 12319985664
          z:
            _serializedValue: -1479891456
      - bodyPart: 12
        mappedPosition:
          x:
            _serializedValue: 3960535552
          y:
            _serializedValue: 11666919424
          z:
            _serializedValue: -1177608960
      - bodyPart: 13
        mappedPosition:
          x:
            _serializedValue: -6732259328
          y:
            _serializedValue: 7572041216
          z:
            _serializedValue: 95778304
      - bodyPart: 14
        mappedPosition:
          x:
            _serializedValue: 1053394880
          y:
            _serializedValue: 6644707840
          z:
            _serializedValue: 507044992
      - bodyPart: 15
        mappedPosition:
          x:
            _serializedValue: -11894927360
          y:
            _serializedValue: 5826185728
          z:
            _serializedValue: 2718661632
      - bodyPart: 0
        mappedPosition:
          x:
            _serializedValue: -2442224896
          y:
            _serializedValue: 12521760768
          z:
            _serializedValue: -152427008
      deltaDisplacement:
        x:
          _serializedValue: 0
        y:
          _serializedValue: 0
        z:
          _serializedValue: 0
    - frame: 12
      hitBoxMaps:
      - bodyPart: 1
        mappedPosition:
          x:
            _serializedValue: 4186174208
          y:
            _serializedValue: 18306054144
          z:
            _serializedValue: -2247037952
      - bodyPart: 2
        mappedPosition:
          x:
            _serializedValue: 1242460544
          y:
            _serializedValue: 17269399552
          z:
            _serializedValue: -1249034112
      - bodyPart: 3
        mappedPosition:
          x:
            _serializedValue: -2336297216
          y:
            _serializedValue: 14249172992
          z:
            _serializedValue: -100192256
      - bodyPart: 4
        mappedPosition:
          x:
            _serializedValue: 2427734528
          y:
            _serializedValue: 18645090304
          z:
            _serializedValue: 1237763072
      - bodyPart: 5
        mappedPosition:
          x:
            _serializedValue: 498511392
          y:
            _serializedValue: 18793367552
          z:
            _serializedValue: -3665607168
      - bodyPart: 6
        mappedPosition:
          x:
            _serializedValue: -643798400
          y:
            _serializedValue: 17675259904
          z:
            _serializedValue: 2424922112
      - bodyPart: 7
        mappedPosition:
          x:
            _serializedValue: -2847122176
          y:
            _serializedValue: 18399944704
          z:
            _serializedValue: -3005145088
      - bodyPart: 8
        mappedPosition:
          x:
            _serializedValue: -4274685952
          y:
            _serializedValue: 16168924160
          z:
            _serializedValue: 3993299968
      - bodyPart: 9
        mappedPosition:
          x:
            _serializedValue: -6802636800
          y:
            _serializedValue: 16984597504
          z:
            _serializedValue: -2492433920
      - bodyPart: 10
        mappedPosition:
          x:
            _serializedValue: -1926780288
          y:
            _serializedValue: 12397948928
          z:
            _serializedValue: 1178714368
      - bodyPart: 11
        mappedPosition:
          x:
            _serializedValue: -2679157760
          y:
            _serializedValue: 12414767104
          z:
            _serializedValue: -1422177024
      - bodyPart: 12
        mappedPosition:
          x:
            _serializedValue: 4011545600
          y:
            _serializedValue: 11589937152
          z:
            _serializedValue: -1065887744
      - bodyPart: 13
        mappedPosition:
          x:
            _serializedValue: -7089659392
          y:
            _serializedValue: 8069873152
          z:
            _serializedValue: 219506688
      - bodyPart: 14
        mappedPosition:
          x:
            _serializedValue: 1552491008
          y:
            _serializedValue: 6243050496
          z:
            _serializedValue: 303771648
      - bodyPart: 15
        mappedPosition:
          x:
            _serializedValue: -12463603712
          y:
            _serializedValue: 6876184064
          z:
            _serializedValue: 2723702784
      - bodyPart: 0
        mappedPosition:
          x:
            _serializedValue: -2389026816
          y:
            _serializedValue: 12620168192
          z:
            _serializedValue: -95457024
      deltaDisplacement:
        x:
          _serializedValue: 0
        y:
          _serializedValue: 0
        z:
          _serializedValue: 0
    - frame: 13
      hitBoxMaps:
      - bodyPart: 1
        mappedPosition:
          x:
            _serializedValue: 4264174336
          y:
            _serializedValue: 18312931328
          z:
            _serializedValue: -2194311424
      - bodyPart: 2
        mappedPosition:
          x:
            _serializedValue: 1307873920
          y:
            _serializedValue: 17315395584
          z:
            _serializedValue: -1193657728
      - bodyPart: 3
        mappedPosition:
          x:
            _serializedValue: -2296232448
          y:
            _serializedValue: 14333800448
          z:
            _serializedValue: -31662080
      - bodyPart: 4
        mappedPosition:
          x:
            _serializedValue: 2585837568
          y:
            _serializedValue: 18705002496
          z:
            _serializedValue: 1302775808
      - bodyPart: 5
        mappedPosition:
          x:
            _serializedValue: 642697472
          y:
            _serializedValue: 18832621568
          z:
            _serializedValue: -3713685248
      - bodyPart: 6
        mappedPosition:
          x:
            _serializedValue: -496838240
          y:
            _serializedValue: 17778100224
          z:
            _serializedValue: 2495339776
      - bodyPart: 7
        mappedPosition:
          x:
            _serializedValue: -2705514752
          y:
            _serializedValue: 18475728896
          z:
            _serializedValue: -3045583872
      - bodyPart: 8
        mappedPosition:
          x:
            _serializedValue: -4126296064
          y:
            _serializedValue: 16250398720
          z:
            _serializedValue: 4046261760
      - bodyPart: 9
        mappedPosition:
          x:
            _serializedValue: -6654379008
          y:
            _serializedValue: 17036538880
          z:
            _serializedValue: -2548209664
      - bodyPart: 10
        mappedPosition:
          x:
            _serializedValue: -1901025664
          y:
            _serializedValue: 12484176896
          z:
            _serializedValue: 1254043264
      - bodyPart: 11
        mappedPosition:
          x:
            _serializedValue: -2652127232
          y:
            _serializedValue: 12497270784
          z:
            _serializedValue: -1347235840
      - bodyPart: 12
        mappedPosition:
          x:
            _serializedValue: 4025241088
          y:
            _serializedValue: 11462931456
          z:
            _serializedValue: -934845952
      - bodyPart: 13
        mappedPosition:
          x:
            _serializedValue: -6996862976
          y:
            _serializedValue: 8031109632
          z:
            _serializedValue: 112876544
      - bodyPart: 14
        mappedPosition:
          x:
            _serializedValue: 2107638016
          y:
            _serializedValue: 5819914752
          z:
            _serializedValue: 60796160
      - bodyPart: 15
        mappedPosition:
          x:
            _serializedValue: -12464236544
          y:
            _serializedValue: 7971600896
          z:
            _serializedValue: 2685153280
      - bodyPart: 0
        mappedPosition:
          x:
            _serializedValue: -2361055488
          y:
            _serializedValue: 12705259520
          z:
            _serializedValue: -21126144
      deltaDisplacement:
        x:
          _serializedValue: 0
        y:
          _serializedValue: 0
        z:
          _serializedValue: 0
    - frame: 14
      hitBoxMaps:
      - bodyPart: 1
        mappedPosition:
          x:
            _serializedValue: 4347436032
          y:
            _serializedValue: 18292535296
          z:
            _serializedValue: -2124894208
      - bodyPart: 2
        mappedPosition:
          x:
            _serializedValue: 1377330048
          y:
            _serializedValue: 17338722304
          z:
            _serializedValue: -1122494080
      - bodyPart: 3
        mappedPosition:
          x:
            _serializedValue: -2258260992
          y:
            _serializedValue: 14402995200
          z:
            _serializedValue: 51143936
      - bodyPart: 4
        mappedPosition:
          x:
            _serializedValue: 2780794368
          y:
            _serializedValue: 18732318720
          z:
            _serializedValue: 1389323264
      - bodyPart: 5
        mappedPosition:
          x:
            _serializedValue: 819571520
          y:
            _serializedValue: 18855071744
          z:
            _serializedValue: -3768051968
      - bodyPart: 6
        mappedPosition:
          x:
            _serializedValue: -314287168
          y:
            _serializedValue: 17857781760
          z:
            _serializedValue: 2589287936
      - bodyPart: 7
        mappedPosition:
          x:
            _serializedValue: -2531706112
          y:
            _serializedValue: 18545743872
          z:
            _serializedValue: -3091646976
      - bodyPart: 8
        mappedPosition:
          x:
            _serializedValue: -3949404928
          y:
            _serializedValue: 16333848576
          z:
            _serializedValue: 4130621952
      - bodyPart: 9
        mappedPosition:
          x:
            _serializedValue: -6482530304
          y:
            _serializedValue: 17109309440
          z:
            _serializedValue: -2601923072
      - bodyPart: 10
        mappedPosition:
          x:
            _serializedValue: -1881584256
          y:
            _serializedValue: 12554888192
          z:
            _serializedValue: 1344572032
      - bodyPart: 11
        mappedPosition:
          x:
            _serializedValue: -2630806016
          y:
            _serializedValue: 12564648960
          z:
            _serializedValue: -1257267200
      - bodyPart: 12
        mappedPosition:
          x:
            _serializedValue: 4033745920
          y:
            _serializedValue: 11362980864
          z:
            _serializedValue: -786869248
      - bodyPart: 13
        mappedPosition:
          x:
            _serializedValue: -6908879360
          y:
            _serializedValue: 7985906688
          z:
            _serializedValue: 42140160
      - bodyPart: 14
        mappedPosition:
          x:
            _serializedValue: 2615697408
          y:
            _serializedValue: 5520312832
          z:
            _serializedValue: -183162880
      - bodyPart: 15
        mappedPosition:
          x:
            _serializedValue: -12285333504
          y:
            _serializedValue: 9020901376
          z:
            _serializedValue: 2598470656
      - bodyPart: 0
        mappedPosition:
          x:
            _serializedValue: -2338638336
          y:
            _serializedValue: 12775200768
          z:
            _serializedValue: 68198912
      deltaDisplacement:
        x:
          _serializedValue: 0
        y:
          _serializedValue: 0
        z:
          _serializedValue: 0
    - frame: 15
      hitBoxMaps:
      - bodyPart: 1
        mappedPosition:
          x:
            _serializedValue: 4429538304
          y:
            _serializedValue: 18251986944
          z:
            _serializedValue: -2040330496
      - bodyPart: 2
        mappedPosition:
          x:
            _serializedValue: 1446216320
          y:
            _serializedValue: 17342021632
          z:
            _serializedValue: -1036402816
      - bodyPart: 3
        mappedPosition:
          x:
            _serializedValue: -2222376960
          y:
            _serializedValue: 14454151168
          z:
            _serializedValue: 147785600
      - bodyPart: 4
        mappedPosition:
          x:
            _serializedValue: 2994992128
          y:
            _serializedValue: 18731905024
          z:
            _serializedValue: 1490300416
      - bodyPart: 5
        mappedPosition:
          x:
            _serializedValue: 1014958592
          y:
            _serializedValue: 18859638784
          z:
            _serializedValue: -3813538304
      - bodyPart: 6
        mappedPosition:
          x:
            _serializedValue: -112767800
          y:
            _serializedValue: 17915752448
          z:
            _serializedValue: 2698598144
      - bodyPart: 7
        mappedPosition:
          x:
            _serializedValue: -2338969344
          y:
            _serializedValue: 18605029376
          z:
            _serializedValue: -3127532544
      - bodyPart: 8
        mappedPosition:
          x:
            _serializedValue: -3764541440
          y:
            _serializedValue: 16432095232
          z:
            _serializedValue: 4239854080
      - bodyPart: 9
        mappedPosition:
          x:
            _serializedValue: -6302750720
          y:
            _serializedValue: 17207926784
          z:
            _serializedValue: -2628804096
      - bodyPart: 10
        mappedPosition:
          x:
            _serializedValue: -1865847808
          y:
            _serializedValue: 12607439872
          z:
            _serializedValue: 1448892800
      - bodyPart: 11
        mappedPosition:
          x:
            _serializedValue: -2613082624
          y:
            _serializedValue: 12614535168
          z:
            _serializedValue: -1153521408
      - bodyPart: 12
        mappedPosition:
          x:
            _serializedValue: 4050299392
          y:
            _serializedValue: 11331422208
          z:
            _serializedValue: -630960128
      - bodyPart: 13
        mappedPosition:
          x:
            _serializedValue: -6810092544
          y:
            _serializedValue: 7923165184
          z:
            _serializedValue: 336384
      - bodyPart: 14
        mappedPosition:
          x:
            _serializedValue: 3046804480
          y:
            _serializedValue: 5376702976
          z:
            _serializedValue: -415444224
      - bodyPart: 15
        mappedPosition:
          x:
            _serializedValue: -11937340416
          y:
            _serializedValue: 9957853184
          z:
            _serializedValue: 2466845696
      - bodyPart: 0
        mappedPosition:
          x:
            _serializedValue: -2319681792
          y:
            _serializedValue: 12827361280
          z:
            _serializedValue: 171305728
      deltaDisplacement:
        x:
          _serializedValue: 0
        y:
          _serializedValue: 0
        z:
          _serializedValue: 0
    - frame: 16
      hitBoxMaps:
      - bodyPart: 1
        mappedPosition:
          x:
            _serializedValue: 4505578496
          y:
            _serializedValue: 18196979712
          z:
            _serializedValue: -1943869184
      - bodyPart: 2
        mappedPosition:
          x:
            _serializedValue: 1511038336
          y:
            _serializedValue: 17326899200
          z:
            _serializedValue: -937976064
      - bodyPart: 3
        mappedPosition:
          x:
            _serializedValue: -2188082688
          y:
            _serializedValue: 14484006912
          z:
            _serializedValue: 256296192
      - bodyPart: 4
        mappedPosition:
          x:
            _serializedValue: 3211345920
          y:
            _serializedValue: 18708078592
          z:
            _serializedValue: 1598607104
      - bodyPart: 5
        mappedPosition:
          x:
            _serializedValue: 1213078528
          y:
            _serializedValue: 18845814784
          z:
            _serializedValue: -3838721536
      - bodyPart: 6
        mappedPosition:
          x:
            _serializedValue: 91448544
          y:
            _serializedValue: 17953140736
          z:
            _serializedValue: 2815387392
      - bodyPart: 7
        mappedPosition:
          x:
            _serializedValue: -2142429056
          y:
            _serializedValue: 18649704448
          z:
            _serializedValue: -3141336576
      - bodyPart: 8
        mappedPosition:
          x:
            _serializedValue: -3583714304
          y:
            _serializedValue: 16535316480
          z:
            _serializedValue: 4363013120
      - bodyPart: 9
        mappedPosition:
          x:
            _serializedValue: -6125388800
          y:
            _serializedValue: 17316706304
          z:
            _serializedValue: -2620418560
      - bodyPart: 10
        mappedPosition:
          x:
            _serializedValue: -1850973312
          y:
            _serializedValue: 12638520320
          z:
            _serializedValue: 1564295808
      - bodyPart: 11
        mappedPosition:
          x:
            _serializedValue: -2596513792
          y:
            _serializedValue: 12643724288
          z:
            _serializedValue: -1038608384
      - bodyPart: 12
        mappedPosition:
          x:
            _serializedValue: 4047204864
          y:
            _serializedValue: 11168928768
          z:
            _serializedValue: -437350656
      - bodyPart: 13
        mappedPosition:
          x:
            _serializedValue: -6678843392
          y:
            _serializedValue: 7820751360
          z:
            _serializedValue: -24351232
      - bodyPart: 14
        mappedPosition:
          x:
            _serializedValue: 3376811008
          y:
            _serializedValue: 5166639104
          z:
            _serializedValue: -624898816
      - bodyPart: 15
        mappedPosition:
          x:
            _serializedValue: -11449465856
          y:
            _serializedValue: 10710226944
          z:
            _serializedValue: 2300384256
      - bodyPart: 0
        mappedPosition:
          x:
            _serializedValue: -2301791232
          y:
            _serializedValue: 12858376192
          z:
            _serializedValue: 285629824
      deltaDisplacement:
        x:
          _serializedValue: 0
        y:
          _serializedValue: 0
        z:
          _serializedValue: 0
    - frame: 17
      hitBoxMaps:
      - bodyPart: 1
        mappedPosition:
          x:
            _serializedValue: 4573476864
          y:
            _serializedValue: 18131496960
          z:
            _serializedValue: -1837605888
      - bodyPart: 2
        mappedPosition:
          x:
            _serializedValue: 1570566784
          y:
            _serializedValue: 17293932544
          z:
            _serializedValue: -829073984
      - bodyPart: 3
        mappedPosition:
          x:
            _serializedValue: -2153562368
          y:
            _serializedValue: 14489028608
          z:
            _serializedValue: 375347712
      - bodyPart: 4
        mappedPosition:
          x:
            _serializedValue: 3414566144
          y:
            _serializedValue: 18664220672
          z:
            _serializedValue: 1710722560
      - bodyPart: 5
        mappedPosition:
          x:
            _serializedValue: 1398072064
          y:
            _serializedValue: 18813886464
          z:
            _serializedValue: -3834187008
      - bodyPart: 6
        mappedPosition:
          x:
            _serializedValue: 283665664
          y:
            _serializedValue: 17970458624
          z:
            _serializedValue: 2935635456
      - bodyPart: 7
        mappedPosition:
          x:
            _serializedValue: -1957535872
          y:
            _serializedValue: 18677313536
          z:
            _serializedValue: -3123203584
      - bodyPart: 8
        mappedPosition:
          x:
            _serializedValue: -3414425856
          y:
            _serializedValue: 16623590400
          z:
            _serializedValue: 4491994112
      - bodyPart: 9
        mappedPosition:
          x:
            _serializedValue: -5959192576
          y:
            _serializedValue: 17412362240
          z:
            _serializedValue: -2576589824
      - bodyPart: 10
        mappedPosition:
          x:
            _serializedValue: -1833235072
          y:
            _serializedValue: 12644502528
          z:
            _serializedValue: 1688910336
      - bodyPart: 11
        mappedPosition:
          x:
            _serializedValue: -2577646592
          y:
            _serializedValue: 12648610816
          z:
            _serializedValue: -914323200
      - bodyPart: 12
        mappedPosition:
          x:
            _serializedValue: 3963579392
          y:
            _serializedValue: 10697526272
          z:
            _serializedValue: -198158592
      - bodyPart: 13
        mappedPosition:
          x:
            _serializedValue: -6475682304
          y:
            _serializedValue: 7645121536
          z:
            _serializedValue: -62462976
      - bodyPart: 14
        mappedPosition:
          x:
            _serializedValue: 3590858752
          y:
            _serializedValue: 4696896000
          z:
            _serializedValue: -802830592
      - bodyPart: 15
        mappedPosition:
          x:
            _serializedValue: -10847213568
          y:
            _serializedValue: 11207417856
          z:
            _serializedValue: 2108272640
      - bodyPart: 0
        mappedPosition:
          x:
            _serializedValue: -2281582080
          y:
            _serializedValue: 12864556032
          z:
            _serializedValue: 409407744
      deltaDisplacement:
        x:
          _serializedValue: 0
        y:
          _serializedValue: 0
        z:
          _serializedValue: 0
    - frame: 18
      hitBoxMaps:
      - bodyPart: 1
        mappedPosition:
          x:
            _serializedValue: 4631546880
          y:
            _serializedValue: 18058977280
          z:
            _serializedValue: -1721585152
      - bodyPart: 2
        mappedPosition:
          x:
            _serializedValue: 1623631616
          y:
            _serializedValue: 17243848704
          z:
            _serializedValue: -709595584
      - bodyPart: 3
        mappedPosition:
          x:
            _serializedValue: -2117684736
          y:
            _serializedValue: 14466646016
          z:
            _serializedValue: 505691008
      - bodyPart: 4
        mappedPosition:
          x:
            _serializedValue: 3589612288
          y:
            _serializedValue: 18603749376
          z:
            _serializedValue: 1827879936
      - bodyPart: 5
        mappedPosition:
          x:
            _serializedValue: 1552302336
          y:
            _serializedValue: 18765529088
          z:
            _serializedValue: -3791388416
      - bodyPart: 6
        mappedPosition:
          x:
            _serializedValue: 449271584
          y:
            _serializedValue: 17968584704
          z:
            _serializedValue: 3060391168
      - bodyPart: 7
        mappedPosition:
          x:
            _serializedValue: -1801674880
          y:
            _serializedValue: 18687328256
          z:
            _serializedValue: -3064081920
      - bodyPart: 8
        mappedPosition:
          x:
            _serializedValue: -3270024704
          y:
            _serializedValue: 16694763520
          z:
            _serializedValue: 4627675136
      - bodyPart: 9
        mappedPosition:
          x:
            _serializedValue: -5820527616
          y:
            _serializedValue: 17491619840
          z:
            _serializedValue: -2488500224
      - bodyPart: 10
        mappedPosition:
          x:
            _serializedValue: -1810018816
          y:
            _serializedValue: 12622700544
          z:
            _serializedValue: 1823087616
      - bodyPart: 11
        mappedPosition:
          x:
            _serializedValue: -2554103040
          y:
            _serializedValue: 12626493440
          z:
            _serializedValue: -780236544
      - bodyPart: 12
        mappedPosition:
          x:
            _serializedValue: 3755933696
          y:
            _serializedValue: 10001672192
          z:
            _serializedValue: 60930816
      - bodyPart: 13
        mappedPosition:
          x:
            _serializedValue: -6136144896
          y:
            _serializedValue: 7359568896
          z:
            _serializedValue: -160757760
      - bodyPart: 14
        mappedPosition:
          x:
            _serializedValue: 3672307200
          y:
            _serializedValue: 4043262720
          z:
            _serializedValue: -940304640
      - bodyPart: 15
        mappedPosition:
          x:
            _serializedValue: -10142511104
          y:
            _serializedValue: 11389102080
          z:
            _serializedValue: 1894533120
      - bodyPart: 0
        mappedPosition:
          x:
            _serializedValue: -2256724224
          y:
            _serializedValue: 12843152384
          z:
            _serializedValue: 543081600
      deltaDisplacement:
        x:
          _serializedValue: 0
        y:
          _serializedValue: 0
        z:
          _serializedValue: 0
    - frame: 19
      hitBoxMaps:
      - bodyPart: 1
        mappedPosition:
          x:
            _serializedValue: 4630676480
          y:
            _serializedValue: 17929967616
          z:
            _serializedValue: -1588711936
      - bodyPart: 2
        mappedPosition:
          x:
            _serializedValue: 1627177984
          y:
            _serializedValue: 17105440768
          z:
            _serializedValue: -571233472
      - bodyPart: 3
        mappedPosition:
          x:
            _serializedValue: -2115305984
          y:
            _serializedValue: 14331777024
          z:
            _serializedValue: 662262528
      - bodyPart: 4
        mappedPosition:
          x:
            _serializedValue: 3691910400
          y:
            _serializedValue: 18449866752
          z:
            _serializedValue: 1967960064
      - bodyPart: 5
        mappedPosition:
          x:
            _serializedValue: 1624503936
          y:
            _serializedValue: 18652717056
          z:
            _serializedValue: -3698286336
      - bodyPart: 6
        mappedPosition:
          x:
            _serializedValue: 540387584
          y:
            _serializedValue: 17889116160
          z:
            _serializedValue: 3208003840
      - bodyPart: 7
        mappedPosition:
          x:
            _serializedValue: -1720443520
          y:
            _serializedValue: 18660368384
          z:
            _serializedValue: -2926574592
      - bodyPart: 8
        mappedPosition:
          x:
            _serializedValue: -3209806080
          y:
            _serializedValue: 16735025152
          z:
            _serializedValue: 4794290176
      - bodyPart: 9
        mappedPosition:
          x:
            _serializedValue: -5763652608
          y:
            _serializedValue: 17592864768
          z:
            _serializedValue: -2274589184
      - bodyPart: 10
        mappedPosition:
          x:
            _serializedValue: -1816297088
          y:
            _serializedValue: 12486503424
          z:
            _serializedValue: 1979795840
      - bodyPart: 11
        mappedPosition:
          x:
            _serializedValue: -2560450304
          y:
            _serializedValue: 12493600768
          z:
            _serializedValue: -623502848
      - bodyPart: 12
        mappedPosition:
          x:
            _serializedValue: 3390476032
          y:
            _serializedValue: 9209275392
          z:
            _serializedValue: 217947136
      - bodyPart: 13
        mappedPosition:
          x:
            _serializedValue: -5689766912
          y:
            _serializedValue: 6917254656
          z:
            _serializedValue: -364653568
      - bodyPart: 14
        mappedPosition:
          x:
            _serializedValue: 1913416960
          y:
            _serializedValue: 3400814592
          z:
            _serializedValue: -551587840
      - bodyPart: 15
        mappedPosition:
          x:
            _serializedValue: -9348976640
          y:
            _serializedValue: 11277335552
          z:
            _serializedValue: 1663200256
      - bodyPart: 0
        mappedPosition:
          x:
            _serializedValue: -2262004480
          y:
            _serializedValue: 12708960256
          z:
            _serializedValue: 699788032
      deltaDisplacement:
        x:
          _serializedValue: 0
        y:
          _serializedValue: 0
        z:
          _serializedValue: 0
    - frame: 20
      hitBoxMaps:
      - bodyPart: 1
        mappedPosition:
          x:
            _serializedValue: 4562580480
          y:
            _serializedValue: 17734633472
          z:
            _serializedValue: -1432390656
      - bodyPart: 2
        mappedPosition:
          x:
            _serializedValue: 1575799552
          y:
            _serializedValue: 16858533888
          z:
            _serializedValue: -408815872
      - bodyPart: 3
        mappedPosition:
          x:
            _serializedValue: -2149044736
          y:
            _serializedValue: 14057410560
          z:
            _serializedValue: 847457280
      - bodyPart: 4
        mappedPosition:
          x:
            _serializedValue: 3711099136
          y:
            _serializedValue: 18173825024
          z:
            _serializedValue: 2144111104
      - bodyPart: 5
        mappedPosition:
          x:
            _serializedValue: 1604277504
          y:
            _serializedValue: 18476279808
          z:
            _serializedValue: -3541984768
      - bodyPart: 6
        mappedPosition:
          x:
            _serializedValue: 551184640
          y:
            _serializedValue: 17684670464
          z:
            _serializedValue: 3393065216
      - bodyPart: 7
        mappedPosition:
          x:
            _serializedValue: -1726170752
          y:
            _serializedValue: 18593525760
          z:
            _serializedValue: -2718199808
      - bodyPart: 8
        mappedPosition:
          x:
            _serializedValue: -3229926912
          y:
            _serializedValue: 16682516480
          z:
            _serializedValue: 5008953856
      - bodyPart: 9
        mappedPosition:
          x:
            _serializedValue: -5798246400
          y:
            _serializedValue: 17720680448
          z:
            _serializedValue: -1964175872
      - bodyPart: 10
        mappedPosition:
          x:
            _serializedValue: -1854332288
          y:
            _serializedValue: 12207882240
          z:
            _serializedValue: 2159984640
      - bodyPart: 11
        mappedPosition:
          x:
            _serializedValue: -2599059968
          y:
            _serializedValue: 12223792128
          z:
            _serializedValue: -443111168
      - bodyPart: 12
        mappedPosition:
          x:
            _serializedValue: 2771457024
          y:
            _serializedValue: 8139935232
          z:
            _serializedValue: 425427712
      - bodyPart: 13
        mappedPosition:
          x:
            _serializedValue: -5147508736
          y:
            _serializedValue: 6355964416
          z:
            _serializedValue: -614282752
      - bodyPart: 14
        mappedPosition:
          x:
            _serializedValue: 131374040
          y:
            _serializedValue: 2734841088
          z:
            _serializedValue: -146442944
      - bodyPart: 15
        mappedPosition:
          x:
            _serializedValue: -8482727936
          y:
            _serializedValue: 10967365632
          z:
            _serializedValue: 1416390144
      - bodyPart: 0
        mappedPosition:
          x:
            _serializedValue: -2299776000
          y:
            _serializedValue: 12434869248
          z:
            _serializedValue: 880680576
      deltaDisplacement:
        x:
          _serializedValue: 0
        y:
          _serializedValue: 0
        z:
          _serializedValue: 0
    - frame: 21
      hitBoxMaps:
      - bodyPart: 1
        mappedPosition:
          x:
            _serializedValue: 4450963968
          y:
            _serializedValue: 17530032128
          z:
            _serializedValue: -1258171392
      - bodyPart: 2
        mappedPosition:
          x:
            _serializedValue: 1488910848
          y:
            _serializedValue: 16575832064
          z:
            _serializedValue: -232570368
      - bodyPart: 3
        mappedPosition:
          x:
            _serializedValue: -2206302720
          y:
            _serializedValue: 13724860416
          z:
            _serializedValue: 1037040640
      - bodyPart: 4
        mappedPosition:
          x:
            _serializedValue: 3648945408
          y:
            _serializedValue: 17839417344
          z:
            _serializedValue: 2349519872
      - bodyPart: 5
        mappedPosition:
          x:
            _serializedValue: 1498407936
          y:
            _serializedValue: 18301165568
          z:
            _serializedValue: -3320043008
      - bodyPart: 6
        mappedPosition:
          x:
            _serializedValue: 490925088
          y:
            _serializedValue: 17360363520
          z:
            _serializedValue: 3607157760
      - bodyPart: 7
        mappedPosition:
          x:
            _serializedValue: -1822411904
          y:
            _serializedValue: 18490818560
          z:
            _serializedValue: -2471254528
      - bodyPart: 8
        mappedPosition:
          x:
            _serializedValue: -3298886656
          y:
            _serializedValue: 16448203776
          z:
            _serializedValue: 5255633920
      - bodyPart: 9
        mappedPosition:
          x:
            _serializedValue: -5913741312
          y:
            _serializedValue: 17785456640
          z:
            _serializedValue: -1649253376
      - bodyPart: 10
        mappedPosition:
          x:
            _serializedValue: -1910107392
          y:
            _serializedValue: 11868807168
          z:
            _serializedValue: 2339989248
      - bodyPart: 11
        mappedPosition:
          x:
            _serializedValue: -2656742656
          y:
            _serializedValue: 11897659392
          z:
            _serializedValue: -262450432
      - bodyPart: 12
        mappedPosition:
          x:
            _serializedValue: 2236166144
          y:
            _serializedValue: 7321357312
          z:
            _serializedValue: 583870976
      - bodyPart: 13
        mappedPosition:
          x:
            _serializedValue: -4391001088
          y:
            _serializedValue: 5764305408
          z:
            _serializedValue: -836605952
      - bodyPart: 14
        mappedPosition:
          x:
            _serializedValue: -1697352832
          y:
            _serializedValue: 2739449600
          z:
            _serializedValue: 370171904
      - bodyPart: 15
        mappedPosition:
          x:
            _serializedValue: -7558863872
          y:
            _serializedValue: 10508869632
          z:
            _serializedValue: 1154900992
      - bodyPart: 0
        mappedPosition:
          x:
            _serializedValue: -2356551168
          y:
            _serializedValue: 12102129664
          z:
            _serializedValue: 1062173440
      deltaDisplacement:
        x:
          _serializedValue: 0
        y:
          _serializedValue: 0
        z:
          _serializedValue: 0
    - frame: 22
      hitBoxMaps:
      - bodyPart: 1
        mappedPosition:
          x:
            _serializedValue: 4327699456
          y:
            _serializedValue: 17361008640
          z:
            _serializedValue: -1084916224
      - bodyPart: 2
        mappedPosition:
          x:
            _serializedValue: 1393841664
          y:
            _serializedValue: 16321369088
          z:
            _serializedValue: -61324160
      - bodyPart: 3
        mappedPosition:
          x:
            _serializedValue: -2266135040
          y:
            _serializedValue: 13411070976
          z:
            _serializedValue: 1210978432
      - bodyPart: 4
        mappedPosition:
          x:
            _serializedValue: 3538907648
          y:
            _serializedValue: 17506758656
          z:
            _serializedValue: 2560299264
      - bodyPart: 5
        mappedPosition:
          x:
            _serializedValue: 1339998976
          y:
            _serializedValue: 18170728448
          z:
            _serializedValue: -3055191040
      - bodyPart: 6
        mappedPosition:
          x:
            _serializedValue: 391176960
          y:
            _serializedValue: 16975562752
          z:
            _serializedValue: 3822779136
      - bodyPart: 7
        mappedPosition:
          x:
            _serializedValue: -1976298112
          y:
            _serializedValue: 18388447232
          z:
            _serializedValue: -2195517952
      - bodyPart: 8
        mappedPosition:
          x:
            _serializedValue: -3387918592
          y:
            _serializedValue: 16069857280
          z:
            _serializedValue: 5499187712
      - bodyPart: 9
        mappedPosition:
          x:
            _serializedValue: -6076831232
          y:
            _serializedValue: 17793765376
          z:
            _serializedValue: -1332863488
      - bodyPart: 10
        mappedPosition:
          x:
            _serializedValue: -1963831552
          y:
            _serializedValue: 11547107328
          z:
            _serializedValue: 2501166592
      - bodyPart: 11
        mappedPosition:
          x:
            _serializedValue: -2713545472
          y:
            _serializedValue: 11591465984
          z:
            _serializedValue: -100166400
      - bodyPart: 12
        mappedPosition:
          x:
            _serializedValue: 1403547264
          y:
            _serializedValue: 6368135168
          z:
            _serializedValue: 829697280
      - bodyPart: 13
        mappedPosition:
          x:
            _serializedValue: -3271053312
          y:
            _serializedValue: 5287139840
          z:
            _serializedValue: -1048790784
      - bodyPart: 14
        mappedPosition:
          x:
            _serializedValue: -3416600064
          y:
            _serializedValue: 2724373504
          z:
            _serializedValue: 865666560
      - bodyPart: 15
        mappedPosition:
          x:
            _serializedValue: -6591865344
          y:
            _serializedValue: 9951711232
          z:
            _serializedValue: 881571328
      - bodyPart: 0
        mappedPosition:
          x:
            _serializedValue: -2412329984
          y:
            _serializedValue: 11787838464
          z:
            _serializedValue: 1225448320
      deltaDisplacement:
        x:
          _serializedValue: 0
        y:
          _serializedValue: 0
        z:
          _serializedValue: 0
    - frame: 23
      hitBoxMaps:
      - bodyPart: 1
        mappedPosition:
          x:
            _serializedValue: 4220492800
          y:
            _serializedValue: 17271623680
          z:
            _serializedValue: -947058688
      - bodyPart: 2
        mappedPosition:
          x:
            _serializedValue: 1312334336
          y:
            _serializedValue: 16160965632
          z:
            _serializedValue: 75273728
      - bodyPart: 3
        mappedPosition:
          x:
            _serializedValue: -2313734144
          y:
            _serializedValue: 13198163968
          z:
            _serializedValue: 1348947584
      - bodyPart: 4
        mappedPosition:
          x:
            _serializedValue: 3428502528
          y:
            _serializedValue: 17247291392
          z:
            _serializedValue: 2733828864
      - bodyPart: 5
        mappedPosition:
          x:
            _serializedValue: 1177672448
          y:
            _serializedValue: 18128267264
          z:
            _serializedValue: -2797605888
      - bodyPart: 6
        mappedPosition:
          x:
            _serializedValue: 293428736
          y:
            _serializedValue: 16645799936
          z:
            _serializedValue: 3996273408
      - bodyPart: 7
        mappedPosition:
          x:
            _serializedValue: -2133207424
          y:
            _serializedValue: 18364733440
          z:
            _serializedValue: -1922152064
      - bodyPart: 8
        mappedPosition:
          x:
            _serializedValue: -3468598016
          y:
            _serializedValue: 15702935552
          z:
            _serializedValue: 5690477568
      - bodyPart: 9
        mappedPosition:
          x:
            _serializedValue: -6236876288
          y:
            _serializedValue: 17849573376
          z:
            _serializedValue: -1023985152
      - bodyPart: 10
        mappedPosition:
          x:
            _serializedValue: -2003946368
          y:
            _serializedValue: 11325801472
          z:
            _serializedValue: 2625124608
      - bodyPart: 11
        mappedPosition:
          x:
            _serializedValue: -2756923392
          y:
            _serializedValue: 11386766336
          z:
            _serializedValue: 25067776
      - bodyPart: 12
        mappedPosition:
          x:
            _serializedValue: 139311408
          y:
            _serializedValue: 5466522624
          z:
            _serializedValue: 1200296064
      - bodyPart: 13
        mappedPosition:
          x:
            _serializedValue: -1592132480
          y:
            _serializedValue: 5232215040
          z:
            _serializedValue: -1286464768
      - bodyPart: 14
        mappedPosition:
          x:
            _serializedValue: -5218395648
          y:
            _serializedValue: 2679116288
          z:
            _serializedValue: 1393831680
      - bodyPart: 15
        mappedPosition:
          x:
            _serializedValue: -5595314688
          y:
            _serializedValue: 9346128896
          z:
            _serializedValue: 601015808
      - bodyPart: 0
        mappedPosition:
          x:
            _serializedValue: -2454742016
          y:
            _serializedValue: 11574412288
          z:
            _serializedValue: 1351727488
      deltaDisplacement:
        x:
          _serializedValue: 0
        y:
          _serializedValue: 0
        z:
          _serializedValue: 0
    clip: {fileID: 7400000, guid: 9d32dc873e3f34ab899b495ed602ea94, type: 2}
    customHitBoxDefinition: {fileID: 0}
    length:
      _serializedValue: 4294967296
    bakeSpeed: 1
    hitBoxDefinitionType: 0
  _animationSpeed:
    _serializedValue: 10737418240
  wrapMode: 0
  characterPrefab: {fileID: 1272366937168992, guid: 01b0a963f13679544a22d6e63d5256c6,
    type: 3}
  moveName: All Man Dash Forward
  description: Man Dash Forward
  fps: 60
  ignoreGravity: 0
  ignoreFriction: 0
  cancelMoveWhenLanding: 1
  landingMoveLink: {fileID: 0}
  forceMirrorLeft: 0
  forceMirrorRight: 0
  invertRotationLeft: 0
  invertRotationRight: 0
  autoCorrectRotation: 0
  allowSideSwitch: 0
  frameWindowRotation: 0
  cooldown: 0
  cooldownFrames: 0
  disableHeadLook: 1
  speedKeyFrameToggle: 0
  fixedSpeed: 1
  animSpeedKeyFrame: []
  totalFrames: 24
  startUpFrames: 5
  activeFrames: 5
  recoveryFrames: 5
  applyRootMotion: 0
  lockXMotion: 0
  lockYMotion: 0
  lockZMotion: 0
  forceGrounded: 0
  rootMotionNode: 0
  overrideBlendingIn: 1
  overrideBlendingOut: 1
  _blendingIn:
    _serializedValue: 0
  _blendingOut:
    _serializedValue: 85899344
  defaultInputs:
    chargeMove: 0
    _chargeTiming:
      _serializedValue: 3006477056
    allowInputLeniency: 0
    allowNegativeEdge: 0
    forceAxisPrecision: 1
    leniencyBuffer: 0
    onReleaseExecution: 0
    requireButtonPress: 1
    onPressExecution: 1
    buttonSequence: 00000000
    buttonExecution: 00000000
    editorToggle: 1
    buttonSequenceToggle: 1
    buttonExecutionToggle: 1
  altInputs:
    chargeMove: 0
    _chargeTiming:
      _serializedValue: 3006477107
    allowInputLeniency: 0
    allowNegativeEdge: 1
    forceAxisPrecision: 0
    leniencyBuffer: 3
    onReleaseExecution: 0
    requireButtonPress: 1
    onPressExecution: 1
    buttonSequence: 
    buttonExecution: 
    editorToggle: 0
    buttonSequenceToggle: 0
    buttonExecutionToggle: 0
  previousMoves: []
  opponentConditions:
    basicMoveLimitation: 
    possibleMoveStates: []
    basicMovesToggle: 0
    statesToggle: 0
  selfConditions:
    basicMoveLimitation: 
    possibleMoveStates:
    - possibleState: 0
      jumpArc: 0
      jumpArcBegins: 0
      jumpArcEnds: 100
      opponentDistance: 0
      proximityRangeBegins: 0
      proximityRangeEnds: 100
      movingForward: 1
      movingBack: 1
      standBy: 1
      blocking: 0
      blockStunned: 0
      stunned: 0
      resetStunValue: 0
    basicMovesToggle: 0
    statesToggle: 0
  moveClassification:
    attackType: 2
    hitType: 0
    startupSpeed: 0
    recoverySpeed: 0
    hitConfirmType: 0
    preferableDistance: 3
    gaugeUsage: 2
    anyAttackType: 1
    anyHitType: 1
    anyHitConfirmType: 1
  frameLinks:
  - linkType: 2
    allowBuffer: 1
    onStrike: 1
    onBlock: 1
    onParry: 1
    activeFramesBegins: 4
    activeFramesEnds: 23
    counterMoveType: 0
    counterMoveFilter: {fileID: 0}
    disableHitImpact: 1
    anyHitStrength: 1
    hitStrength: 0
    anyStrokeHitBox: 1
    hitBoxType: 0
    anyHitType: 1
    hitType: 0
    ignoreInputs: 0
    ignorePlayerConditions: 0
    ignoreGauge: 0
    nextMoveStartupFrame: 1
    linkableMoves:
    - {fileID: 11400000, guid: 8a1c24468a7f74f399cc2746d0487b79, type: 2}
    linkableMovesToggle: 1
    hitConfirmToggle: 0
    counterMoveToggle: 0
  - linkType: 2
    allowBuffer: 1
    onStrike: 1
    onBlock: 1
    onParry: 1
    activeFramesBegins: 4
    activeFramesEnds: 23
    counterMoveType: 0
    counterMoveFilter: {fileID: 0}
    disableHitImpact: 1
    anyHitStrength: 1
    hitStrength: 0
    anyStrokeHitBox: 1
    hitBoxType: 0
    anyHitType: 1
    hitType: 0
    ignoreInputs: 0
    ignorePlayerConditions: 0
    ignoreGauge: 0
    nextMoveStartupFrame: 1
    linkableMoves:
    - {fileID: 11400000, guid: 0893153b8732f4d78b489d7e39b424c6, type: 2}
    linkableMovesToggle: 1
    hitConfirmToggle: 0
    counterMoveToggle: 0
  - linkType: 2
    allowBuffer: 1
    onStrike: 1
    onBlock: 1
    onParry: 1
    activeFramesBegins: 4
    activeFramesEnds: 23
    counterMoveType: 0
    counterMoveFilter: {fileID: 0}
    disableHitImpact: 1
    anyHitStrength: 1
    hitStrength: 0
    anyStrokeHitBox: 1
    hitBoxType: 0
    anyHitType: 1
    hitType: 0
    ignoreInputs: 0
    ignorePlayerConditions: 0
    ignoreGauge: 0
    nextMoveStartupFrame: 1
    linkableMoves:
    - {fileID: 11400000, guid: bf7f5d26797c749c3bf5fda9b5d654b3, type: 2}
    linkableMovesToggle: 1
    hitConfirmToggle: 0
    counterMoveToggle: 0
  - linkType: 2
    allowBuffer: 1
    onStrike: 1
    onBlock: 1
    onParry: 1
    activeFramesBegins: 4
    activeFramesEnds: 23
    counterMoveType: 0
    counterMoveFilter: {fileID: 0}
    disableHitImpact: 1
    anyHitStrength: 1
    hitStrength: 0
    anyStrokeHitBox: 1
    hitBoxType: 0
    anyHitType: 1
    hitType: 0
    ignoreInputs: 0
    ignorePlayerConditions: 0
    ignoreGauge: 0
    nextMoveStartupFrame: 1
    linkableMoves:
    - {fileID: 11400000, guid: f6fcfbd8fe1aa49699c0bf508d931d7f, type: 2}
    linkableMovesToggle: 1
    hitConfirmToggle: 0
    counterMoveToggle: 0
  - linkType: 2
    allowBuffer: 1
    onStrike: 1
    onBlock: 1
    onParry: 1
    activeFramesBegins: 4
    activeFramesEnds: 23
    counterMoveType: 0
    counterMoveFilter: {fileID: 0}
    disableHitImpact: 1
    anyHitStrength: 1
    hitStrength: 0
    anyStrokeHitBox: 1
    hitBoxType: 0
    anyHitType: 1
    hitType: 0
    ignoreInputs: 0
    ignorePlayerConditions: 0
    ignoreGauge: 0
    nextMoveStartupFrame: 1
    linkableMoves:
    - {fileID: 11400000, guid: 8d035f3d6e4454cf5851c8aa064b4574, type: 2}
    linkableMovesToggle: 1
    hitConfirmToggle: 0
    counterMoveToggle: 0
  gauges:
  - castingFrame: 0
    targetGauge: 0
    startDrainingGauge: 0
    inhibitGainWhileDraining: 0
    stopDrainingGauge: 0
    _gaugeDPS:
      _serializedValue: 0
    _totalDrain:
      _serializedValue: 0
    _gaugeRequired:
      _serializedValue: 0
    _gaugeUsage:
      _serializedValue: 0
    _gaugeGainOnMiss:
      _serializedValue: 0
    _gaugeGainOnHit:
      _serializedValue: 0
    _gaugeGainOnBlock:
      _serializedValue: 0
    _opGaugeGainOnBlock:
      _serializedValue: 0
    _opGaugeGainOnParry:
      _serializedValue: 0
    _opGaugeGainOnHit:
      _serializedValue: 0
    DCMove: {fileID: 0}
    DCStance: 0
    editorToggle: 0
  sortOrder: []
  particleEffects: []
  appliedForces:
  - castingFrame: 0
    resetPreviousVertical: 1
    resetPreviousHorizontal: 1
    affectAssists: 0
    affectCharacter: 1
    _force:
      x:
        _serializedValue: 171798691840
      y:
        _serializedValue: 0
      z:
        _serializedValue: 0
  opAppliedForces: []
  slowMoEffects: []
  bodyPartVisibilityChanges: []
  opponentOverride: []
  characterAssist: []
  soundEffects:
  - castingFrame: 0
    sounds:
    - {fileID: 8300000, guid: bd0d44255d8af48cea602c5254006e4b, type: 3}
    soundEffectsToggle: 1
  inGameAlert: []
  stanceChanges: []
  cameraMovements: []
  hits: []
  blockableArea:
    enabled: 1
    activeFramesBegin: 1
    activeFramesEnds: 2
    bodyPart: 0
    hitBoxDefinitionIndex: 0
    shape: 0
    rect:
      serializedVersion: 2
      x: 0
      y: 0
      width: 4
      height: 4
    _rect:
      _x:
        _serializedValue: 0
      _y:
        _serializedValue: 0
      topRight:
        x:
          _serializedValue: 0
        y:
          _serializedValue: 0
        z:
          _serializedValue: 0
      topLeft:
        x:
          _serializedValue: 0
        y:
          _serializedValue: 0
        z:
          _serializedValue: 0
      bottomRight:
        x:
          _serializedValue: 0
        y:
          _serializedValue: 0
        z:
          _serializedValue: 0
      bottomLeft:
        x:
          _serializedValue: 0
        y:
          _serializedValue: 0
        z:
          _serializedValue: 0
      width:
        _serializedValue: 0
      height:
        _serializedValue: 0
      xMax:
        _serializedValue: 0
      yMax:
        _serializedValue: 0
    followXBounds: 0
    followYBounds: 0
    _radius:
      _serializedValue: 0
    _offSet:
      x:
        _serializedValue: 0
      y:
        _serializedValue: 0
      z:
        _serializedValue: 0
    cuboidMin:
      x:
        _serializedValue: 0
      y:
        _serializedValue: 0
      z:
        _serializedValue: 0
    cuboidMax:
      x:
        _serializedValue: 0
      y:
        _serializedValue: 0
      z:
        _serializedValue: 0
    position:
      x:
        _serializedValue: 0
      y:
        _serializedValue: 0
      z:
        _serializedValue: 0
  lockOnTargets: []
  switchCharacterOptions: []
  invincibleBodyParts: []
  stateOverride: []
  armorOptions:
    activeFramesBegin: 0
    activeFramesEnds: 0
    overrideHitEffects: 0
    blockHits: 0
    hitEffects:
      hitParticle: {fileID: 0}
      killTime: 0
      hitSound: {fileID: 0}
      spawnPoint: 1
      _freezingTime:
        _serializedValue: 0
      _animationSpeed:
        _serializedValue: 429496736
      autoHitStop: 1
      sticky: 0
      _hitStop:
        _serializedValue: 429496736
      mirrorOn2PSide: 0
      shakeCharacterOnHit: 1
      shakeCameraOnHit: 1
      _shakeDensity:
        _serializedValue: 3435973888
      _shakeCameraDensity:
        _serializedValue: 3435973836
      editorToggle: 0
    hitAbsorption: 0
    damageAbsorption: 0
    nonAffectedBodyParts: 
  projectiles: []
  rotationPreview: {x: 0, y: 90, z: 0}
