%YAML 1.1
%TAG !u! tag:unity3d.com,2011:
--- !u!114 &11400000
MonoBehaviour:
  m_ObjectHideFlags: 0
  m_CorrespondingSourceObject: {fileID: 0}
  m_PrefabInstance: {fileID: 0}
  m_PrefabAsset: {fileID: 0}
  m_GameObject: {fileID: 0}
  m_Enabled: 1
  m_EditorHideFlags: 0
  m_Script: {fileID: 11500000, guid: 091d6461d0b837d4087073236d4200d9, type: 3}
  m_Name: ItemsIcons
  m_EditorClassIdentifier: 
  AllSprites:
  - ID: hero_cossacks
    Sprite: {fileID: 21300000, guid: 0f0bf3d24a2804c1b8385659f01b08c0, type: 3}
  - ID: hero_ninja
    Sprite: {fileID: 21300000, guid: 53bb523591da04846aaeba4532181907, type: 3}
  - ID: hero_beast
    Sprite: {fileID: 21300000, guid: ee7985fc5f96d453e90d0a01ea53e2ef, type: 3}
  - ID: hero_elchapo
    Sprite: {fileID: 21300000, guid: 60546205bf4d249bba2eb50efa375144, type: 3}
  - ID: hero_evilspirit
    Sprite: {fileID: 21300000, guid: c008307ea7d4b46b3aac2c33328deed2, type: 3}
  - ID: hero_marta
    Sprite: {fileID: 21300000, guid: 44cf2def1846f4572a6e6363ed44308a, type: 3}
  - ID: hero_monk
    Sprite: {fileID: 21300000, guid: e9806bcd10e33448a9b4e6d434ec8431, type: 3}
  - ID: hero_oldboy
    Sprite: {fileID: 21300000, guid: 3a90b87d0f0c14840934f6df0d95b28b, type: 3}
  - ID: hero_panksoldir
    Sprite: {fileID: 21300000, guid: ddcae69bc78f746f09612a5f59d3fe87, type: 3}
  - ID: hero_rhino
    Sprite: {fileID: 21300000, guid: 135ac7db885bf4f92b011bb75bbfc8f2, type: 3}
  - ID: hero_slimer
    Sprite: {fileID: 21300000, guid: 7818366db490f4b4ba1e7988a51406fb, type: 3}
  - ID: hero_sumo
    Sprite: {fileID: 21300000, guid: c636893546ce8419b8e5802885ec88a7, type: 3}
  - ID: hero_toxic
    Sprite: {fileID: 21300000, guid: 8eadc195cf0c945049fc9588ee9e4d45, type: 3}
  - ID: hero_lootbox
    Sprite: {fileID: 21300000, guid: 861eef8418f4343599535a5f459c7604, type: 3}
  - ID: herorandom
    Sprite: {fileID: 21300000, guid: 861eef8418f4343599535a5f459c7604, type: 3}
  - ID: ulti_megablast
    Sprite: {fileID: 21300000, guid: 04a2d67493b0e4076a042426a36c1126, type: 3}
  - ID: ulti_shadowhelp
    Sprite: {fileID: 21300000, guid: 36af04a0fe4434ecea18a3e7b1331499, type: 3}
  - ID: ulti_berserk
    Sprite: {fileID: 21300000, guid: 56a17094b154f42de98dd04f0262ead3, type: 3}
  - ID: skill_focus
    Sprite: {fileID: 21300000, guid: 6a3614daba30a442096bd2e2cd67d474, type: 3}
  - ID: skill_megapunch
    Sprite: {fileID: 21300000, guid: 481af696c19f7471d849e2d8449067c7, type: 3}
  - ID: skill_helperninja
    Sprite: {fileID: 21300000, guid: fb7c2ba55884c4580b4398bee1e226bc, type: 3}
  - ID: skill_blueblast
    Sprite: {fileID: 21300000, guid: 77087aaaace654e40935f10c1c6b7450, type: 3}
  - ID: skill_fireball
    Sprite: {fileID: 21300000, guid: 358a2296c4d004b01b86df6c7ac6bbb3, type: 3}
  - ID: abilityrandom
    Sprite: {fileID: 21300000, guid: 5276e82afaa8844989940cb44a5ae742, type: 3}
  - ID: abilitylootbox
    Sprite: {fileID: 21300000, guid: 5276e82afaa8844989940cb44a5ae742, type: 3}
  - ID: heroo_frog1
    Sprite: {fileID: 21300000, guid: 398f7c3428c75b34da02e9f06d63e36b, type: 3}
  - ID: hero_devastator
    Sprite: {fileID: 21300000, guid: 02baf514874ada747bbedec6a93c8753, type: 3}
  - ID: hero_tornado
    Sprite: {fileID: 21300000, guid: 4f04aadc92701cb4593def9980d64ac3, type: 3}
  - ID: hero_blitz
    Sprite: {fileID: 21300000, guid: 786e46d1d63f65649b261c998fdc37cb, type: 3}
  - ID: hero_smash
    Sprite: {fileID: 21300000, guid: 398f7c3428c75b34da02e9f06d63e36b, type: 3}
