%YAML 1.1
%TAG !u! tag:unity3d.com,2011:
--- !u!114 &11400000
MonoBehaviour:
  m_ObjectHideFlags: 0
  m_CorrespondingSourceObject: {fileID: 0}
  m_PrefabInstance: {fileID: 0}
  m_PrefabAsset: {fileID: 0}
  m_GameObject: {fileID: 0}
  m_Enabled: 1
  m_EditorHideFlags: 0
  m_Script: {fileID: 11500000, guid: 8e87d7c439487834c82e9d4aa521a1ed, type: 3}
  m_Name: Mixup_Balanced
  m_EditorClassIdentifier: 
  instructionsName: Mix-up (Balanced)
  debugMode: 1
  debug_ReactionWeight: 1
  advancedOptions:
    timeBetweenDecisions: 0
    timeBetweenActions: 0.2
    aggressiveness: 0.5
    ruleCompliance: 0.7
    comboEfficiency: 0.8
    movementDuration: 0.1
    buttonSequenceInterval: 1
    attackDesirabilityCalculation: 2
    defaultDesirability: 0
    playRandomMoves: 1
    reactionParameters:
      attackWhenEnemyIsDown: 0
      attackWhenEnemyIsBlocking: 1
      stopBlockingWhenEnemyIsStunned: 1
      inputWhenDown: 1
      inputWhenBlocking: 1
      inputWhenStunned: 1
      enableAttackTypeFilter: 1
      enableGaugeFilter: 1
      enableDistanceFilter: 1
      enableDamageFilter: 1
      enableHitConfirmTypeFilter: 1
      enableAttackSpeedFilter: 1
      enableHitTypeFilter: 1
  rulesGenerator:
    preferableCombatDistance: 3
    attacksAtPreferableDistance: 5
    autoMove: 1
    restOnLocation: 1
    moveFrequency: 3
    autoJump: 1
    jumpBackFrequency: 1
    jumpStraightFrequency: 2
    jumpForwardFrequency: 3
    autoBlock: 1
    obeyHitType: 1
    standBlockAccuracy: 5
    crouchBlockAccuracy: 5
    jumpBlockAccuracy: 1
    autoAttack: 1
    obeyPreferableDistances: 1
    attackFrequency: 4
    debugToggle: 0
  aiRules:
  - ruleName: Anti-air attack response
    events:
    - enabled: 1
      boolean: 0
      conditions:
      - enabled: 1
        boolean: 0
        targetCharacter: 1
        conditionType: 5
        horizontalMovement: 1
        verticalMovement: 1
        movementSpeed: 0
        healthStatus: 0
        gaugeStatus: 0
        playerDistance: 1
        jumping: 0
        blocking: 1
        moveClassification:
          attackType: 0
          hitType: 0
          startupSpeed: 0
          recoverySpeed: 0
          hitConfirmType: 0
          preferableDistance: 0
          gaugeUsage: 0
          anyAttackType: 1
          anyHitType: 1
          anyHitConfirmType: 1
        moveFrameData: 0
        moveDamage: 0
      - enabled: 1
        boolean: 0
        targetCharacter: 1
        conditionType: 2
        horizontalMovement: 1
        verticalMovement: 2
        movementSpeed: 0
        healthStatus: 0
        gaugeStatus: 0
        playerDistance: 3
        jumping: 0
        blocking: 1
        moveClassification:
          attackType: 0
          hitType: 0
          startupSpeed: 0
          recoverySpeed: 0
          hitConfirmType: 0
          preferableDistance: 0
          gaugeUsage: 0
          anyAttackType: 1
          anyHitType: 0
          anyHitConfirmType: 1
        moveFrameData: 0
        moveDamage: 0
      conditionsToggle: 0
    - enabled: 1
      boolean: 0
      conditions:
      - enabled: 1
        boolean: 0
        targetCharacter: 1
        conditionType: 5
        horizontalMovement: 1
        verticalMovement: 1
        movementSpeed: 0
        healthStatus: 0
        gaugeStatus: 0
        playerDistance: 2
        jumping: 0
        blocking: 1
        moveClassification:
          attackType: 0
          hitType: 0
          startupSpeed: 0
          recoverySpeed: 0
          hitConfirmType: 0
          preferableDistance: 0
          gaugeUsage: 0
          anyAttackType: 1
          anyHitType: 1
          anyHitConfirmType: 1
        moveFrameData: 1
        moveDamage: 0
      - enabled: 1
        boolean: 0
        targetCharacter: 1
        conditionType: 2
        horizontalMovement: 1
        verticalMovement: 2
        movementSpeed: 0
        healthStatus: 0
        gaugeStatus: 0
        playerDistance: 3
        jumping: 0
        blocking: 1
        moveClassification:
          attackType: 0
          hitType: 0
          startupSpeed: 0
          recoverySpeed: 0
          hitConfirmType: 0
          preferableDistance: 0
          gaugeUsage: 0
          anyAttackType: 1
          anyHitType: 1
          anyHitConfirmType: 1
        moveFrameData: 0
        moveDamage: 0
      conditionsToggle: 0
    - enabled: 1
      boolean: 0
      conditions:
      - enabled: 1
        boolean: 0
        targetCharacter: 1
        conditionType: 5
        horizontalMovement: 1
        verticalMovement: 1
        movementSpeed: 0
        healthStatus: 0
        gaugeStatus: 0
        playerDistance: 3
        jumping: 0
        blocking: 1
        moveClassification:
          attackType: 0
          hitType: 0
          startupSpeed: 0
          recoverySpeed: 0
          hitConfirmType: 0
          preferableDistance: 0
          gaugeUsage: 0
          anyAttackType: 1
          anyHitType: 1
          anyHitConfirmType: 1
        moveFrameData: 1
        moveDamage: 0
      - enabled: 1
        boolean: 0
        targetCharacter: 1
        conditionType: 2
        horizontalMovement: 1
        verticalMovement: 2
        movementSpeed: 0
        healthStatus: 0
        gaugeStatus: 0
        playerDistance: 3
        jumping: 0
        blocking: 1
        moveClassification:
          attackType: 0
          hitType: 0
          startupSpeed: 0
          recoverySpeed: 0
          hitConfirmType: 0
          preferableDistance: 0
          gaugeUsage: 0
          anyAttackType: 1
          anyHitType: 1
          anyHitConfirmType: 1
        moveFrameData: 0
        moveDamage: 0
      - enabled: 1
        boolean: 0
        targetCharacter: 1
        conditionType: 1
        horizontalMovement: 0
        verticalMovement: 1
        movementSpeed: 0
        healthStatus: 0
        gaugeStatus: 0
        playerDistance: 3
        jumping: 0
        blocking: 1
        moveClassification:
          attackType: 0
          hitType: 0
          startupSpeed: 0
          recoverySpeed: 0
          hitConfirmType: 0
          preferableDistance: 0
          gaugeUsage: 0
          anyAttackType: 1
          anyHitType: 1
          anyHitConfirmType: 1
        moveFrameData: 0
        moveDamage: 0
      conditionsToggle: 0
    reactions:
    - reactionType: 10
      moveClassification:
        attackType: 5
        hitType: 0
        startupSpeed: 0
        recoverySpeed: 0
        hitConfirmType: 0
        preferableDistance: 0
        gaugeUsage: 0
        anyAttackType: 0
        anyHitType: 1
        anyHitConfirmType: 1
      moveDamage: 0
      specificMove: {fileID: 0}
      buttonPress: 4
      behavior: 0
      desirability: 6
    debugToggle: 0
    eventsToggle: 0
    reactionsToggle: 0
  - ruleName: Avoid anti-air attacks when far
    events:
    - enabled: 1
      boolean: 0
      conditions:
      - enabled: 1
        boolean: 0
        targetCharacter: 1
        conditionType: 5
        horizontalMovement: 1
        verticalMovement: 1
        movementSpeed: 0
        healthStatus: 0
        gaugeStatus: 0
        playerDistance: 3
        jumping: 0
        blocking: 1
        moveClassification:
          attackType: 0
          hitType: 0
          startupSpeed: 0
          recoverySpeed: 0
          hitConfirmType: 0
          preferableDistance: 0
          gaugeUsage: 0
          anyAttackType: 1
          anyHitType: 1
          anyHitConfirmType: 1
        moveFrameData: 0
        moveDamage: 0
      conditionsToggle: 0
    - enabled: 1
      boolean: 0
      conditions:
      - enabled: 1
        boolean: 0
        targetCharacter: 1
        conditionType: 5
        horizontalMovement: 1
        verticalMovement: 1
        movementSpeed: 0
        healthStatus: 0
        gaugeStatus: 0
        playerDistance: 4
        jumping: 0
        blocking: 1
        moveClassification:
          attackType: 0
          hitType: 0
          startupSpeed: 0
          recoverySpeed: 0
          hitConfirmType: 0
          preferableDistance: 0
          gaugeUsage: 0
          anyAttackType: 1
          anyHitType: 1
          anyHitConfirmType: 1
        moveFrameData: 1
        moveDamage: 0
      conditionsToggle: 0
    - enabled: 1
      boolean: 0
      conditions:
      - enabled: 1
        boolean: 0
        targetCharacter: 1
        conditionType: 5
        horizontalMovement: 1
        verticalMovement: 1
        movementSpeed: 0
        healthStatus: 0
        gaugeStatus: 0
        playerDistance: 5
        jumping: 0
        blocking: 1
        moveClassification:
          attackType: 0
          hitType: 0
          startupSpeed: 0
          recoverySpeed: 0
          hitConfirmType: 0
          preferableDistance: 0
          gaugeUsage: 0
          anyAttackType: 1
          anyHitType: 1
          anyHitConfirmType: 1
        moveFrameData: 1
        moveDamage: 0
      conditionsToggle: 0
    reactions:
    - reactionType: 10
      moveClassification:
        attackType: 5
        hitType: 0
        startupSpeed: 0
        recoverySpeed: 0
        hitConfirmType: 0
        preferableDistance: 0
        gaugeUsage: 0
        anyAttackType: 0
        anyHitType: 1
        anyHitConfirmType: 1
      moveDamage: 0
      specificMove: {fileID: 0}
      buttonPress: 4
      behavior: 0
      desirability: 0
    debugToggle: 0
    eventsToggle: 0
    reactionsToggle: 0
  - ruleName: Projectile (mid|far)
    events:
    - enabled: 1
      boolean: 0
      conditions:
      - enabled: 1
        boolean: 0
        targetCharacter: 1
        conditionType: 5
        horizontalMovement: 1
        verticalMovement: 1
        movementSpeed: 0
        healthStatus: 0
        gaugeStatus: 0
        playerDistance: 3
        jumping: 0
        blocking: 1
        moveClassification:
          attackType: 0
          hitType: 0
          startupSpeed: 0
          recoverySpeed: 0
          hitConfirmType: 0
          preferableDistance: 0
          gaugeUsage: 0
          anyAttackType: 1
          anyHitType: 1
          anyHitConfirmType: 1
        moveFrameData: 0
        moveDamage: 0
      conditionsToggle: 0
    - enabled: 1
      boolean: 0
      conditions:
      - enabled: 1
        boolean: 0
        targetCharacter: 1
        conditionType: 5
        horizontalMovement: 1
        verticalMovement: 1
        movementSpeed: 0
        healthStatus: 0
        gaugeStatus: 0
        playerDistance: 4
        jumping: 0
        blocking: 1
        moveClassification:
          attackType: 0
          hitType: 0
          startupSpeed: 0
          recoverySpeed: 0
          hitConfirmType: 0
          preferableDistance: 0
          gaugeUsage: 0
          anyAttackType: 1
          anyHitType: 1
          anyHitConfirmType: 1
        moveFrameData: 0
        moveDamage: 0
      conditionsToggle: 0
    reactions:
    - reactionType: 10
      moveClassification:
        attackType: 6
        hitType: 0
        startupSpeed: 0
        recoverySpeed: 0
        hitConfirmType: 0
        preferableDistance: 0
        gaugeUsage: 0
        anyAttackType: 0
        anyHitType: 1
        anyHitConfirmType: 1
      moveDamage: 0
      specificMove: {fileID: 0}
      buttonPress: 4
      behavior: 0
      desirability: 3
    debugToggle: 0
    eventsToggle: 0
    reactionsToggle: 0
  - ruleName: Jump Projectiles
    events:
    - enabled: 1
      boolean: 0
      conditions:
      - enabled: 1
        boolean: 0
        targetCharacter: 1
        conditionType: 6
        horizontalMovement: 1
        verticalMovement: 1
        movementSpeed: 0
        healthStatus: 0
        gaugeStatus: 0
        playerDistance: 3
        jumping: 0
        blocking: 1
        moveClassification:
          attackType: 6
          hitType: 0
          startupSpeed: 0
          recoverySpeed: 0
          hitConfirmType: 0
          preferableDistance: 0
          gaugeUsage: 0
          anyAttackType: 0
          anyHitType: 1
          anyHitConfirmType: 1
        moveFrameData: 0
        moveDamage: 0
      - enabled: 1
        boolean: 0
        targetCharacter: 0
        conditionType: 5
        horizontalMovement: 1
        verticalMovement: 1
        movementSpeed: 0
        healthStatus: 0
        gaugeStatus: 0
        playerDistance: 3
        jumping: 0
        blocking: 1
        moveClassification:
          attackType: 6
          hitType: 0
          startupSpeed: 0
          recoverySpeed: 0
          hitConfirmType: 0
          preferableDistance: 0
          gaugeUsage: 0
          anyAttackType: 0
          anyHitType: 1
          anyHitConfirmType: 1
        moveFrameData: 0
        moveDamage: 0
      conditionsToggle: 0
    reactions:
    - reactionType: 5
      moveClassification:
        attackType: 0
        hitType: 0
        startupSpeed: 0
        recoverySpeed: 0
        hitConfirmType: 0
        preferableDistance: 0
        gaugeUsage: 0
        anyAttackType: 1
        anyHitType: 1
        anyHitConfirmType: 1
      moveDamage: 0
      specificMove: {fileID: 0}
      buttonPress: 4
      behavior: 0
      desirability: 5
    debugToggle: 0
    eventsToggle: 0
    reactionsToggle: 0
  - ruleName: Change Behavior - Aggressive
    events:
    - enabled: 1
      boolean: 0
      conditions:
      - enabled: 1
        boolean: 0
        targetCharacter: 0
        conditionType: 3
        horizontalMovement: 1
        verticalMovement: 1
        movementSpeed: 0
        healthStatus: 3
        gaugeStatus: 0
        playerDistance: 3
        jumping: 0
        blocking: 1
        moveClassification:
          attackType: 0
          hitType: 0
          startupSpeed: 0
          recoverySpeed: 0
          hitConfirmType: 0
          preferableDistance: 0
          gaugeUsage: 0
          anyAttackType: 1
          anyHitType: 1
          anyHitConfirmType: 1
        moveFrameData: 0
        moveDamage: 0
      conditionsToggle: 0
    reactions:
    - reactionType: 11
      moveClassification:
        attackType: 0
        hitType: 0
        startupSpeed: 0
        recoverySpeed: 0
        hitConfirmType: 0
        preferableDistance: 0
        gaugeUsage: 0
        anyAttackType: 1
        anyHitType: 1
        anyHitConfirmType: 1
      moveDamage: 0
      specificMove: {fileID: 0}
      buttonPress: 4
      behavior: 4
      desirability: 4
    debugToggle: 0
    eventsToggle: 0
    reactionsToggle: 0
  - ruleName: Change Behavior - Defensive
    events:
    - enabled: 1
      boolean: 0
      conditions:
      - enabled: 1
        boolean: 0
        targetCharacter: 1
        conditionType: 3
        horizontalMovement: 1
        verticalMovement: 1
        movementSpeed: 0
        healthStatus: 2
        gaugeStatus: 0
        playerDistance: 3
        jumping: 0
        blocking: 1
        moveClassification:
          attackType: 0
          hitType: 0
          startupSpeed: 0
          recoverySpeed: 0
          hitConfirmType: 0
          preferableDistance: 0
          gaugeUsage: 0
          anyAttackType: 1
          anyHitType: 1
          anyHitConfirmType: 1
        moveFrameData: 0
        moveDamage: 0
      - enabled: 1
        boolean: 0
        targetCharacter: 0
        conditionType: 3
        horizontalMovement: 1
        verticalMovement: 1
        movementSpeed: 0
        healthStatus: 0
        gaugeStatus: 0
        playerDistance: 3
        jumping: 0
        blocking: 1
        moveClassification:
          attackType: 0
          hitType: 0
          startupSpeed: 0
          recoverySpeed: 0
          hitConfirmType: 0
          preferableDistance: 0
          gaugeUsage: 0
          anyAttackType: 1
          anyHitType: 1
          anyHitConfirmType: 1
        moveFrameData: 0
        moveDamage: 0
      conditionsToggle: 0
    - enabled: 1
      boolean: 0
      conditions:
      - enabled: 1
        boolean: 0
        targetCharacter: 1
        conditionType: 3
        horizontalMovement: 1
        verticalMovement: 1
        movementSpeed: 0
        healthStatus: 3
        gaugeStatus: 0
        playerDistance: 3
        jumping: 0
        blocking: 1
        moveClassification:
          attackType: 0
          hitType: 0
          startupSpeed: 0
          recoverySpeed: 0
          hitConfirmType: 0
          preferableDistance: 0
          gaugeUsage: 0
          anyAttackType: 1
          anyHitType: 1
          anyHitConfirmType: 1
        moveFrameData: 0
        moveDamage: 0
      - enabled: 1
        boolean: 0
        targetCharacter: 0
        conditionType: 3
        horizontalMovement: 1
        verticalMovement: 1
        movementSpeed: 0
        healthStatus: 0
        gaugeStatus: 0
        playerDistance: 3
        jumping: 0
        blocking: 1
        moveClassification:
          attackType: 0
          hitType: 0
          startupSpeed: 0
          recoverySpeed: 0
          hitConfirmType: 0
          preferableDistance: 0
          gaugeUsage: 0
          anyAttackType: 1
          anyHitType: 1
          anyHitConfirmType: 1
        moveFrameData: 0
        moveDamage: 0
      conditionsToggle: 0
    reactions:
    - reactionType: 11
      moveClassification:
        attackType: 0
        hitType: 0
        startupSpeed: 0
        recoverySpeed: 0
        hitConfirmType: 0
        preferableDistance: 0
        gaugeUsage: 0
        anyAttackType: 1
        anyHitType: 1
        anyHitConfirmType: 1
      moveDamage: 0
      specificMove: {fileID: 0}
      buttonPress: 4
      behavior: 2
      desirability: 4
    debugToggle: 0
    eventsToggle: 0
    reactionsToggle: 0
  aiDefinitions:
    damage:
      veryWeak: 0.05
      weak: 0.1
      medium: 0.15
      strong: 0.2
      veryStrong: 0.25
    distance:
      veryClose: 0.05
      close: 0.15
      mid: 0.5
      far: 0.85
      veryFar: 0.95
    desirability:
      theWorstOption: 0
      veryUndesirable: 0.15
      undesirable: 0.3
      notBad: 0.45
      desirable: 0.6
      veryDesirable: 0.8
      theBestOption: 1
    health:
      healthy: 1
      scratched: 0.9
      lightlyWounded: 0.79999995
      moderatelyWounded: 0.59999996
      seriouslyWounded: 0.39999998
      criticallyWounded: 0.19999999
      almostDead: 0.099999994
      dead: 0
    speed:
      verySlow: 0.5
      slow: 1
      normal: 3
      fast: 5
      veryFast: 7
