%YAML 1.1
%TAG !u! tag:unity3d.com,2011:
--- !u!1001 &4179182225974031729
PrefabInstance:
  m_ObjectHideFlags: 0
  serializedVersion: 2
  m_Modification:
    m_TransformParent: {fileID: 0}
    m_Modifications:
    - target: {fileID: -8679921383154817045, guid: 925475972aa6b7140b2e330f9b3df5fb, type: 3}
      propertyPath: m_RootOrder
      value: 0
      objectReference: {fileID: 0}
    - target: {fileID: -8679921383154817045, guid: 925475972aa6b7140b2e330f9b3df5fb, type: 3}
      propertyPath: m_LocalPosition.x
      value: 0
      objectReference: {fileID: 0}
    - target: {fileID: -8679921383154817045, guid: 925475972aa6b7140b2e330f9b3df5fb, type: 3}
      propertyPath: m_LocalPosition.y
      value: 0
      objectReference: {fileID: 0}
    - target: {fileID: -8679921383154817045, guid: 925475972aa6b7140b2e330f9b3df5fb, type: 3}
      propertyPath: m_LocalPosition.z
      value: 0
      objectReference: {fileID: 0}
    - target: {fileID: -8679921383154817045, guid: 925475972aa6b7140b2e330f9b3df5fb, type: 3}
      propertyPath: m_LocalRotation.w
      value: 1
      objectReference: {fileID: 0}
    - target: {fileID: -8679921383154817045, guid: 925475972aa6b7140b2e330f9b3df5fb, type: 3}
      propertyPath: m_LocalRotation.x
      value: 0
      objectReference: {fileID: 0}
    - target: {fileID: -8679921383154817045, guid: 925475972aa6b7140b2e330f9b3df5fb, type: 3}
      propertyPath: m_LocalRotation.y
      value: -0
      objectReference: {fileID: 0}
    - target: {fileID: -8679921383154817045, guid: 925475972aa6b7140b2e330f9b3df5fb, type: 3}
      propertyPath: m_LocalRotation.z
      value: -0
      objectReference: {fileID: 0}
    - target: {fileID: -8679921383154817045, guid: 925475972aa6b7140b2e330f9b3df5fb, type: 3}
      propertyPath: m_LocalEulerAnglesHint.x
      value: 0
      objectReference: {fileID: 0}
    - target: {fileID: -8679921383154817045, guid: 925475972aa6b7140b2e330f9b3df5fb, type: 3}
      propertyPath: m_LocalEulerAnglesHint.y
      value: 0
      objectReference: {fileID: 0}
    - target: {fileID: -8679921383154817045, guid: 925475972aa6b7140b2e330f9b3df5fb, type: 3}
      propertyPath: m_LocalEulerAnglesHint.z
      value: 0
      objectReference: {fileID: 0}
    - target: {fileID: -7511558181221131132, guid: 925475972aa6b7140b2e330f9b3df5fb, type: 3}
      propertyPath: m_Materials.Array.data[0]
      value: 
      objectReference: {fileID: 2100000, guid: 67599524dede4cf4d9e5c159ac7781d0, type: 2}
    - target: {fileID: -7511558181221131132, guid: 925475972aa6b7140b2e330f9b3df5fb, type: 3}
      propertyPath: m_Materials.Array.data[1]
      value: 
      objectReference: {fileID: 2100000, guid: 0ab90666702682b47b72e1e118ec2340, type: 2}
    - target: {fileID: -7511558181221131132, guid: 925475972aa6b7140b2e330f9b3df5fb, type: 3}
      propertyPath: m_Materials.Array.data[2]
      value: 
      objectReference: {fileID: 2100000, guid: c34432f1fb593154fb9879e2899cc849, type: 2}
    - target: {fileID: 919132149155446097, guid: 925475972aa6b7140b2e330f9b3df5fb, type: 3}
      propertyPath: m_Name
      value: PlatformWall00b_5 Variant
      objectReference: {fileID: 0}
    - target: {fileID: 919132149155446097, guid: 925475972aa6b7140b2e330f9b3df5fb, type: 3}
      propertyPath: m_StaticEditorFlags
      value: 2147483647
      objectReference: {fileID: 0}
    m_RemovedComponents: []
  m_SourcePrefab: {fileID: 100100000, guid: 925475972aa6b7140b2e330f9b3df5fb, type: 3}
