%YAML 1.1
%TAG !u! tag:unity3d.com,2011:
--- !u!114 &11400000
MonoBehaviour:
  m_ObjectHideFlags: 0
  m_CorrespondingSourceObject: {fileID: 0}
  m_PrefabInstance: {fileID: 0}
  m_PrefabAsset: {fileID: 0}
  m_GameObject: {fileID: 0}
  m_Enabled: 1
  m_EditorHideFlags: 0
  m_Script: {fileID: 11500000, guid: 03f9522b1b0f53b4c87d047ac5c3794f, type: 3}
  m_Name: all_woman_SuperJump
  m_EditorClassIdentifier: 
  gameplayType: 0
  animMap:
    animationMaps:
    - frame: 0
      hitBoxMaps:
      - bodyPart: 1
        mappedPosition:
          x:
            _serializedValue: 254708144
          y:
            _serializedValue: 24403740672
          z:
            _serializedValue: 543006656
      - bodyPart: 2
        mappedPosition:
          x:
            _serializedValue: 308011488
          y:
            _serializedValue: 20606889984
          z:
            _serializedValue: 1220988800
      - bodyPart: 3
        mappedPosition:
          x:
            _serializedValue: 392896512
          y:
            _serializedValue: 15861116928
          z:
            _serializedValue: 1662068480
      - bodyPart: 4
        mappedPosition:
          x:
            _serializedValue: 2850643456
          y:
            _serializedValue: 22108327936
          z:
            _serializedValue: 1493032704
      - bodyPart: 5
        mappedPosition:
          x:
            _serializedValue: -2312375296
          y:
            _serializedValue: 21994438656
          z:
            _serializedValue: 1261034880
      - bodyPart: 6
        mappedPosition:
          x:
            _serializedValue: 3203895296
          y:
            _serializedValue: 18385887232
          z:
            _serializedValue: 2483478784
      - bodyPart: 7
        mappedPosition:
          x:
            _serializedValue: -4133278208
          y:
            _serializedValue: 19456145408
          z:
            _serializedValue: -1020161024
      - bodyPart: 8
        mappedPosition:
          x:
            _serializedValue: 3354998528
          y:
            _serializedValue: 17076988928
          z:
            _serializedValue: -630051328
      - bodyPart: 9
        mappedPosition:
          x:
            _serializedValue: -1740068608
          y:
            _serializedValue: 19945863168
          z:
            _serializedValue: -3357431552
      - bodyPart: 10
        mappedPosition:
          x:
            _serializedValue: 1286631936
          y:
            _serializedValue: 13930902528
          z:
            _serializedValue: 1020798080
      - bodyPart: 11
        mappedPosition:
          x:
            _serializedValue: -1279990016
          y:
            _serializedValue: 14459337728
          z:
            _serializedValue: 1247219328
      - bodyPart: 12
        mappedPosition:
          x:
            _serializedValue: 3423787520
          y:
            _serializedValue: 11195323392
          z:
            _serializedValue: -4136448256
      - bodyPart: 13
        mappedPosition:
          x:
            _serializedValue: -3276652288
          y:
            _serializedValue: 13867044864
          z:
            _serializedValue: -4610334720
      - bodyPart: 14
        mappedPosition:
          x:
            _serializedValue: 1664051200
          y:
            _serializedValue: 7577285632
          z:
            _serializedValue: 137728640
      - bodyPart: 15
        mappedPosition:
          x:
            _serializedValue: -3472352768
          y:
            _serializedValue: 9077742592
          z:
            _serializedValue: -1222124288
      - bodyPart: 0
        mappedPosition:
          x:
            _serializedValue: 50625484
          y:
            _serializedValue: 14364537856
          z:
            _serializedValue: 1274860416
      deltaDisplacement:
        x:
          _serializedValue: 0
        y:
          _serializedValue: 0
        z:
          _serializedValue: 0
    - frame: 1
      hitBoxMaps:
      - bodyPart: 1
        mappedPosition:
          x:
            _serializedValue: 295526432
          y:
            _serializedValue: 24625506304
          z:
            _serializedValue: 724815872
      - bodyPart: 2
        mappedPosition:
          x:
            _serializedValue: 343112992
          y:
            _serializedValue: 20812113920
          z:
            _serializedValue: 1303038336
      - bodyPart: 3
        mappedPosition:
          x:
            _serializedValue: 416202368
          y:
            _serializedValue: 16056199168
          z:
            _serializedValue: 1619382144
      - bodyPart: 4
        mappedPosition:
          x:
            _serializedValue: 2893996032
          y:
            _serializedValue: 22297683968
          z:
            _serializedValue: 1584783360
      - bodyPart: 5
        mappedPosition:
          x:
            _serializedValue: -2271708160
          y:
            _serializedValue: 22206646272
          z:
            _serializedValue: 1409382400
      - bodyPart: 6
        mappedPosition:
          x:
            _serializedValue: 3330020096
          y:
            _serializedValue: 18533494784
          z:
            _serializedValue: 2361387520
      - bodyPart: 7
        mappedPosition:
          x:
            _serializedValue: -4163996672
          y:
            _serializedValue: 19965845504
          z:
            _serializedValue: -1112631552
      - bodyPart: 8
        mappedPosition:
          x:
            _serializedValue: 3318881792
          y:
            _serializedValue: 17548355584
          z:
            _serializedValue: -872726272
      - bodyPart: 9
        mappedPosition:
          x:
            _serializedValue: -1738458368
          y:
            _serializedValue: 20540289024
          z:
            _serializedValue: -3396682496
      - bodyPart: 10
        mappedPosition:
          x:
            _serializedValue: 1277438720
          y:
            _serializedValue: 14103341056
          z:
            _serializedValue: 1002669696
      - bodyPart: 11
        mappedPosition:
          x:
            _serializedValue: -1279525248
          y:
            _serializedValue: 14671283200
          z:
            _serializedValue: 1242341632
      - bodyPart: 12
        mappedPosition:
          x:
            _serializedValue: 3314770688
          y:
            _serializedValue: 11187769344
          z:
            _serializedValue: -4096032512
      - bodyPart: 13
        mappedPosition:
          x:
            _serializedValue: -3183955200
          y:
            _serializedValue: 14714150912
          z:
            _serializedValue: -4675408896
      - bodyPart: 14
        mappedPosition:
          x:
            _serializedValue: 1630300672
          y:
            _serializedValue: 7487981056
          z:
            _serializedValue: 138302208
      - bodyPart: 15
        mappedPosition:
          x:
            _serializedValue: -3354402816
          y:
            _serializedValue: 9988721664
          z:
            _serializedValue: -1197337088
      - bodyPart: 0
        mappedPosition:
          x:
            _serializedValue: 49845604
          y:
            _serializedValue: 14558356480
          z:
            _serializedValue: 1260104960
      deltaDisplacement:
        x:
          _serializedValue: 0
        y:
          _serializedValue: 0
        z:
          _serializedValue: 0
    - frame: 2
      hitBoxMaps:
      - bodyPart: 1
        mappedPosition:
          x:
            _serializedValue: 333080768
          y:
            _serializedValue: 24842246144
          z:
            _serializedValue: 899957824
      - bodyPart: 2
        mappedPosition:
          x:
            _serializedValue: 374261120
          y:
            _serializedValue: 21014921216
          z:
            _serializedValue: 1377942400
      - bodyPart: 3
        mappedPosition:
          x:
            _serializedValue: 434717408
          y:
            _serializedValue: 16252163072
          z:
            _serializedValue: 1569277952
      - bodyPart: 4
        mappedPosition:
          x:
            _serializedValue: 2933272320
          y:
            _serializedValue: 22484664320
          z:
            _serializedValue: 1668837376
      - bodyPart: 5
        mappedPosition:
          x:
            _serializedValue: -2234387456
          y:
            _serializedValue: 22414346240
          z:
            _serializedValue: 1550829696
      - bodyPart: 6
        mappedPosition:
          x:
            _serializedValue: 3447534592
          y:
            _serializedValue: 18691569664
          z:
            _serializedValue: 2225867008
      - bodyPart: 7
        mappedPosition:
          x:
            _serializedValue: -4186313728
          y:
            _serializedValue: 20493705216
          z:
            _serializedValue: -1181127936
      - bodyPart: 8
        mappedPosition:
          x:
            _serializedValue: 3263712768
          y:
            _serializedValue: 18038257664
          z:
            _serializedValue: -1086158336
      - bodyPart: 9
        mappedPosition:
          x:
            _serializedValue: -1728144128
          y:
            _serializedValue: 21145532416
          z:
            _serializedValue: -3408822016
      - bodyPart: 10
        mappedPosition:
          x:
            _serializedValue: 1263120640
          y:
            _serializedValue: 14277577728
          z:
            _serializedValue: 977267072
      - bodyPart: 11
        mappedPosition:
          x:
            _serializedValue: -1283413376
          y:
            _serializedValue: 14885062656
          z:
            _serializedValue: 1230599936
      - bodyPart: 12
        mappedPosition:
          x:
            _serializedValue: 3200546048
          y:
            _serializedValue: 11176617984
          z:
            _serializedValue: -4050506496
      - bodyPart: 13
        mappedPosition:
          x:
            _serializedValue: -3051132928
          y:
            _serializedValue: 15576217600
          z:
            _serializedValue: -4689359360
      - bodyPart: 14
        mappedPosition:
          x:
            _serializedValue: 1597948544
          y:
            _serializedValue: 7392158720
          z:
            _serializedValue: 140557056
      - bodyPart: 15
        mappedPosition:
          x:
            _serializedValue: -3228973056
          y:
            _serializedValue: 10895576064
          z:
            _serializedValue: -1151608064
      - bodyPart: 0
        mappedPosition:
          x:
            _serializedValue: 44374268
          y:
            _serializedValue: 14753878016
          z:
            _serializedValue: 1238211840
      deltaDisplacement:
        x:
          _serializedValue: 0
        y:
          _serializedValue: 0
        z:
          _serializedValue: 0
    - frame: 3
      hitBoxMaps:
      - bodyPart: 1
        mappedPosition:
          x:
            _serializedValue: 376522432
          y:
            _serializedValue: 25036818432
          z:
            _serializedValue: 1091196928
      - bodyPart: 2
        mappedPosition:
          x:
            _serializedValue: 411860704
          y:
            _serializedValue: 21198358528
          z:
            _serializedValue: 1470102400
      - bodyPart: 3
        mappedPosition:
          x:
            _serializedValue: 460169632
          y:
            _serializedValue: 16432109568
          z:
            _serializedValue: 1538194816
      - bodyPart: 4
        mappedPosition:
          x:
            _serializedValue: 2978644480
          y:
            _serializedValue: 22653157376
          z:
            _serializedValue: 1767560960
      - bodyPart: 5
        mappedPosition:
          x:
            _serializedValue: -2190249216
          y:
            _serializedValue: 22599968768
          z:
            _serializedValue: 1710598784
      - bodyPart: 6
        mappedPosition:
          x:
            _serializedValue: 3740328704
          y:
            _serializedValue: 18860814336
          z:
            _serializedValue: 1785902080
      - bodyPart: 7
        mappedPosition:
          x:
            _serializedValue: -4189138944
          y:
            _serializedValue: 21047312384
          z:
            _serializedValue: -1214494976
      - bodyPart: 8
        mappedPosition:
          x:
            _serializedValue: 3360156160
          y:
            _serializedValue: 18798325760
          z:
            _serializedValue: -1572920320
      - bodyPart: 9
        mappedPosition:
          x:
            _serializedValue: -1691324416
          y:
            _serializedValue: 21780191232
          z:
            _serializedValue: -3371790336
      - bodyPart: 10
        mappedPosition:
          x:
            _serializedValue: 1256232320
          y:
            _serializedValue: 14437191680
          z:
            _serializedValue: 970471936
      - bodyPart: 11
        mappedPosition:
          x:
            _serializedValue: -1279342464
          y:
            _serializedValue: 15083144192
          z:
            _serializedValue: 1238147584
      - bodyPart: 12
        mappedPosition:
          x:
            _serializedValue: 2958787328
          y:
            _serializedValue: 10928808960
          z:
            _serializedValue: -3871073536
      - bodyPart: 13
        mappedPosition:
          x:
            _serializedValue: -2892472064
          y:
            _serializedValue: 16202261504
          z:
            _serializedValue: -4660481024
      - bodyPart: 14
        mappedPosition:
          x:
            _serializedValue: 1438995328
          y:
            _serializedValue: 7004317696
          z:
            _serializedValue: 220878976
      - bodyPart: 15
        mappedPosition:
          x:
            _serializedValue: -3126647808
          y:
            _serializedValue: 11521667072
          z:
            _serializedValue: -1125953792
      - bodyPart: 0
        mappedPosition:
          x:
            _serializedValue: 46578120
          y:
            _serializedValue: 14934113280
          z:
            _serializedValue: 1235242496
      deltaDisplacement:
        x:
          _serializedValue: 0
        y:
          _serializedValue: 0
        z:
          _serializedValue: 0
    - frame: 4
      hitBoxMaps:
      - bodyPart: 1
        mappedPosition:
          x:
            _serializedValue: 421852896
          y:
            _serializedValue: 25222123520
          z:
            _serializedValue: 1272762240
      - bodyPart: 2
        mappedPosition:
          x:
            _serializedValue: 450607424
          y:
            _serializedValue: 21375098880
          z:
            _serializedValue: 1552327936
      - bodyPart: 3
        mappedPosition:
          x:
            _serializedValue: 485872544
          y:
            _serializedValue: 16608566272
          z:
            _serializedValue: 1497177984
      - bodyPart: 4
        mappedPosition:
          x:
            _serializedValue: 3025029888
          y:
            _serializedValue: 22815080448
          z:
            _serializedValue: 1855815680
      - bodyPart: 5
        mappedPosition:
          x:
            _serializedValue: -2144307712
          y:
            _serializedValue: 22776801280
          z:
            _serializedValue: 1860495104
      - bodyPart: 6
        mappedPosition:
          x:
            _serializedValue: 3999935488
          y:
            _serializedValue: 19110895616
          z:
            _serializedValue: 1316447232
      - bodyPart: 7
        mappedPosition:
          x:
            _serializedValue: -4174484992
          y:
            _serializedValue: 21608488960
          z:
            _serializedValue: -1217804544
      - bodyPart: 8
        mappedPosition:
          x:
            _serializedValue: 3381287936
          y:
            _serializedValue: 19633031168
          z:
            _serializedValue: -1966048128
      - bodyPart: 9
        mappedPosition:
          x:
            _serializedValue: -1636560640
          y:
            _serializedValue: 22412468224
          z:
            _serializedValue: -3301710592
      - bodyPart: 10
        mappedPosition:
          x:
            _serializedValue: 1249432704
          y:
            _serializedValue: 14594222080
          z:
            _serializedValue: 953933312
      - bodyPart: 11
        mappedPosition:
          x:
            _serializedValue: -1274443904
          y:
            _serializedValue: 15278580736
          z:
            _serializedValue: 1236314496
      - bodyPart: 12
        mappedPosition:
          x:
            _serializedValue: 2715884032
          y:
            _serializedValue: 10701103104
          z:
            _serializedValue: -3665710592
      - bodyPart: 13
        mappedPosition:
          x:
            _serializedValue: -2709641216
          y:
            _serializedValue: 16825805824
          z:
            _serializedValue: -4611311104
      - bodyPart: 14
        mappedPosition:
          x:
            _serializedValue: 1278349952
          y:
            _serializedValue: 6612754432
          z:
            _serializedValue: 293376256
      - bodyPart: 15
        mappedPosition:
          x:
            _serializedValue: -3021190656
          y:
            _serializedValue: 12143757312
          z:
            _serializedValue: -1084686848
      - bodyPart: 0
        mappedPosition:
          x:
            _serializedValue: 49271140
          y:
            _serializedValue: 15111623680
          z:
            _serializedValue: 1222639488
      deltaDisplacement:
        x:
          _serializedValue: 0
        y:
          _serializedValue: 0
        z:
          _serializedValue: 0
    - frame: 5
      hitBoxMaps:
      - bodyPart: 1
        mappedPosition:
          x:
            _serializedValue: 464730528
          y:
            _serializedValue: 25385644032
          z:
            _serializedValue: 1459826560
      - bodyPart: 2
        mappedPosition:
          x:
            _serializedValue: 488240160
          y:
            _serializedValue: 21532856320
          z:
            _serializedValue: 1644348928
      - bodyPart: 3
        mappedPosition:
          x:
            _serializedValue: 512167328
          y:
            _serializedValue: 16769065984
          z:
            _serializedValue: 1471593984
      - bodyPart: 4
        mappedPosition:
          x:
            _serializedValue: 3069345536
          y:
            _serializedValue: 22959931392
          z:
            _serializedValue: 1952011264
      - bodyPart: 5
        mappedPosition:
          x:
            _serializedValue: -2099635328
          y:
            _serializedValue: 22931585024
          z:
            _serializedValue: 2018232064
      - bodyPart: 6
        mappedPosition:
          x:
            _serializedValue: 4401245696
          y:
            _serializedValue: 19519756288
          z:
            _serializedValue: 788580352
      - bodyPart: 7
        mappedPosition:
          x:
            _serializedValue: -4138236416
          y:
            _serializedValue: 22174660608
          z:
            _serializedValue: -1180776192
      - bodyPart: 8
        mappedPosition:
          x:
            _serializedValue: 3585144320
          y:
            _serializedValue: 20647034880
          z:
            _serializedValue: -2292547072
      - bodyPart: 9
        mappedPosition:
          x:
            _serializedValue: -1553997568
          y:
            _serializedValue: 23046281216
          z:
            _serializedValue: -3178792960
      - bodyPart: 10
        mappedPosition:
          x:
            _serializedValue: 1245096448
          y:
            _serializedValue: 14737195008
          z:
            _serializedValue: 951942272
      - bodyPart: 11
        mappedPosition:
          x:
            _serializedValue: -1267095936
          y:
            _serializedValue: 15457497088
          z:
            _serializedValue: 1248765952
      - bodyPart: 12
        mappedPosition:
          x:
            _serializedValue: 2417199104
          y:
            _serializedValue: 10392567808
          z:
            _serializedValue: -3337392640
      - bodyPart: 13
        mappedPosition:
          x:
            _serializedValue: -2528940032
          y:
            _serializedValue: 17242148864
          z:
            _serializedValue: -4571131392
      - bodyPart: 14
        mappedPosition:
          x:
            _serializedValue: 983987200
          y:
            _serializedValue: 6156431872
          z:
            _serializedValue: 464779840
      - bodyPart: 15
        mappedPosition:
          x:
            _serializedValue: -2958096384
          y:
            _serializedValue: 12535250944
          z:
            _serializedValue: -1090230528
      - bodyPart: 0
        mappedPosition:
          x:
            _serializedValue: 54235904
          y:
            _serializedValue: 15273708544
          z:
            _serializedValue: 1224531328
      deltaDisplacement:
        x:
          _serializedValue: 0
        y:
          _serializedValue: 0
        z:
          _serializedValue: 0
    - frame: 6
      hitBoxMaps:
      - bodyPart: 1
        mappedPosition:
          x:
            _serializedValue: 511335360
          y:
            _serializedValue: 25536370688
          z:
            _serializedValue: 1633978880
      - bodyPart: 2
        mappedPosition:
          x:
            _serializedValue: 528891328
          y:
            _serializedValue: 21680171008
          z:
            _serializedValue: 1723396864
      - bodyPart: 3
        mappedPosition:
          x:
            _serializedValue: 540624192
          y:
            _serializedValue: 16922040320
          z:
            _serializedValue: 1433264384
      - bodyPart: 4
        mappedPosition:
          x:
            _serializedValue: 3116541952
          y:
            _serializedValue: 23094528000
          z:
            _serializedValue: 2034774272
      - bodyPart: 5
        mappedPosition:
          x:
            _serializedValue: -2051310720
          y:
            _serializedValue: 23073992704
          z:
            _serializedValue: 2162885120
      - bodyPart: 6
        mappedPosition:
          x:
            _serializedValue: 4736690688
          y:
            _serializedValue: 20053854208
          z:
            _serializedValue: 276428288
      - bodyPart: 7
        mappedPosition:
          x:
            _serializedValue: -4080694272
          y:
            _serializedValue: 22734014464
          z:
            _serializedValue: -1112554240
      - bodyPart: 8
        mappedPosition:
          x:
            _serializedValue: 3663513600
          y:
            _serializedValue: 21720520704
          z:
            _serializedValue: -2462300160
      - bodyPart: 9
        mappedPosition:
          x:
            _serializedValue: -1450129280
          y:
            _serializedValue: 23661398016
          z:
            _serializedValue: -3023101440
      - bodyPart: 10
        mappedPosition:
          x:
            _serializedValue: 1242916864
          y:
            _serializedValue: 14873470976
          z:
            _serializedValue: 937409664
      - bodyPart: 11
        mappedPosition:
          x:
            _serializedValue: -1256936576
          y:
            _serializedValue: 15629583360
          z:
            _serializedValue: 1248969216
      - bodyPart: 12
        mappedPosition:
          x:
            _serializedValue: 2122051968
          y:
            _serializedValue: 10113309696
          z:
            _serializedValue: -2963360768
      - bodyPart: 13
        mappedPosition:
          x:
            _serializedValue: -2346460672
          y:
            _serializedValue: 17644650496
          z:
            _serializedValue: -4530380800
      - bodyPart: 14
        mappedPosition:
          x:
            _serializedValue: 688241344
          y:
            _serializedValue: 5696752640
          z:
            _serializedValue: 627412864
      - bodyPart: 15
        mappedPosition:
          x:
            _serializedValue: -2896329216
          y:
            _serializedValue: 12924584960
          z:
            _serializedValue: -1084471040
      - bodyPart: 0
        mappedPosition:
          x:
            _serializedValue: 61696972
          y:
            _serializedValue: 15428931584
          z:
            _serializedValue: 1213961216
      deltaDisplacement:
        x:
          _serializedValue: 0
        y:
          _serializedValue: 0
        z:
          _serializedValue: 0
    - frame: 7
      hitBoxMaps:
      - bodyPart: 1
        mappedPosition:
          x:
            _serializedValue: 550475520
          y:
            _serializedValue: 25666406400
          z:
            _serializedValue: 1803950592
      - bodyPart: 2
        mappedPosition:
          x:
            _serializedValue: 564408896
          y:
            _serializedValue: 21809158144
          z:
            _serializedValue: 1805703680
      - bodyPart: 3
        mappedPosition:
          x:
            _serializedValue: 567159232
          y:
            _serializedValue: 17058825216
          z:
            _serializedValue: 1407640832
      - bodyPart: 4
        mappedPosition:
          x:
            _serializedValue: 3157100800
          y:
            _serializedValue: 23213637632
          z:
            _serializedValue: 2119827968
      - bodyPart: 5
        mappedPosition:
          x:
            _serializedValue: -2009002240
          y:
            _serializedValue: 23195080704
          z:
            _serializedValue: 2305792256
      - bodyPart: 6
        mappedPosition:
          x:
            _serializedValue: 5095499264
          y:
            _serializedValue: 20616327168
          z:
            _serializedValue: 8214016
      - bodyPart: 7
        mappedPosition:
          x:
            _serializedValue: -4002117632
          y:
            _serializedValue: 23272337408
          z:
            _serializedValue: -1008420864
      - bodyPart: 8
        mappedPosition:
          x:
            _serializedValue: 3907918336
          y:
            _serializedValue: 22664611840
          z:
            _serializedValue: -2405145344
      - bodyPart: 9
        mappedPosition:
          x:
            _serializedValue: -1321576448
          y:
            _serializedValue: 24247764992
          z:
            _serializedValue: -2823182080
      - bodyPart: 10
        mappedPosition:
          x:
            _serializedValue: 1241989120
          y:
            _serializedValue: 14995800064
          z:
            _serializedValue: 934083968
      - bodyPart: 11
        mappedPosition:
          x:
            _serializedValue: -1246211584
          y:
            _serializedValue: 15783954432
          z:
            _serializedValue: 1259233920
      - bodyPart: 12
        mappedPosition:
          x:
            _serializedValue: 1842229760
          y:
            _serializedValue: 9883028480
          z:
            _serializedValue: -2551218176
      - bodyPart: 13
        mappedPosition:
          x:
            _serializedValue: -2183680256
          y:
            _serializedValue: 17883797504
          z:
            _serializedValue: -4516598784
      - bodyPart: 14
        mappedPosition:
          x:
            _serializedValue: 330795104
          y:
            _serializedValue: 5349456384
          z:
            _serializedValue: 857265920
      - bodyPart: 15
        mappedPosition:
          x:
            _serializedValue: -2870018048
          y:
            _serializedValue: 13139881984
          z:
            _serializedValue: -1128396544
      - bodyPart: 0
        mappedPosition:
          x:
            _serializedValue: 69732504
          y:
            _serializedValue: 15568189440
          z:
            _serializedValue: 1214225408
      deltaDisplacement:
        x:
          _serializedValue: 0
        y:
          _serializedValue: 0
        z:
          _serializedValue: 0
    - frame: 8
      hitBoxMaps:
      - bodyPart: 1
        mappedPosition:
          x:
            _serializedValue: 588814912
          y:
            _serializedValue: 25778677760
          z:
            _serializedValue: 1966619392
      - bodyPart: 2
        mappedPosition:
          x:
            _serializedValue: 598528576
          y:
            _serializedValue: 21922369536
          z:
            _serializedValue: 1880790784
      - bodyPart: 3
        mappedPosition:
          x:
            _serializedValue: 591561728
          y:
            _serializedValue: 17182283776
          z:
            _serializedValue: 1375160192
      - bodyPart: 4
        mappedPosition:
          x:
            _serializedValue: 3196145408
          y:
            _serializedValue: 23317180416
          z:
            _serializedValue: 2197315584
      - bodyPart: 5
        mappedPosition:
          x:
            _serializedValue: -1967546880
          y:
            _serializedValue: 23298766848
          z:
            _serializedValue: 2441244672
      - bodyPart: 6
        mappedPosition:
          x:
            _serializedValue: 5514588160
          y:
            _serializedValue: 21408931840
          z:
            _serializedValue: -241074688
      - bodyPart: 7
        mappedPosition:
          x:
            _serializedValue: -3907648000
          y:
            _serializedValue: 23787171840
          z:
            _serializedValue: -869337088
      - bodyPart: 8
        mappedPosition:
          x:
            _serializedValue: 4081401344
          y:
            _serializedValue: 23766421504
          z:
            _serializedValue: -2195132672
      - bodyPart: 9
        mappedPosition:
          x:
            _serializedValue: -1177960448
          y:
            _serializedValue: 24798394368
          z:
            _serializedValue: -2588740864
      - bodyPart: 10
        mappedPosition:
          x:
            _serializedValue: 1239033216
          y:
            _serializedValue: 15105495040
          z:
            _serializedValue: 924094208
      - bodyPart: 11
        mappedPosition:
          x:
            _serializedValue: -1236995712
          y:
            _serializedValue: 15925524480
          z:
            _serializedValue: 1263044096
      - bodyPart: 12
        mappedPosition:
          x:
            _serializedValue: 1559618560
          y:
            _serializedValue: 9676938240
          z:
            _serializedValue: -2088549376
      - bodyPart: 13
        mappedPosition:
          x:
            _serializedValue: -2027041280
          y:
            _serializedValue: 18113902592
          z:
            _serializedValue: -4501957632
      - bodyPart: 14
        mappedPosition:
          x:
            _serializedValue: -26185588
          y:
            _serializedValue: 4998552064
          z:
            _serializedValue: 1082158720
      - bodyPart: 15
        mappedPosition:
          x:
            _serializedValue: -2847902720
          y:
            _serializedValue: 13355357184
          z:
            _serializedValue: -1164572672
      - bodyPart: 0
        mappedPosition:
          x:
            _serializedValue: 75992424
          y:
            _serializedValue: 15694656512
          z:
            _serializedValue: 1207871872
      deltaDisplacement:
        x:
          _serializedValue: 0
        y:
          _serializedValue: 0
        z:
          _serializedValue: 0
    - frame: 9
      hitBoxMaps:
      - bodyPart: 1
        mappedPosition:
          x:
            _serializedValue: 614850304
          y:
            _serializedValue: 25865211904
          z:
            _serializedValue: 2116558592
      - bodyPart: 2
        mappedPosition:
          x:
            _serializedValue: 623961664
          y:
            _serializedValue: 22011389952
          z:
            _serializedValue: 1953705728
      - bodyPart: 3
        mappedPosition:
          x:
            _serializedValue: 612357376
          y:
            _serializedValue: 17282334720
          z:
            _serializedValue: 1353681280
      - bodyPart: 4
        mappedPosition:
          x:
            _serializedValue: 3224452608
          y:
            _serializedValue: 23400271872
          z:
            _serializedValue: 2272690944
      - bodyPart: 5
        mappedPosition:
          x:
            _serializedValue: -1936616320
          y:
            _serializedValue: 23375673344
          z:
            _serializedValue: 2566474496
      - bodyPart: 6
        mappedPosition:
          x:
            _serializedValue: 5869652480
          y:
            _serializedValue: 21984978944
          z:
            _serializedValue: -169070592
      - bodyPart: 7
        mappedPosition:
          x:
            _serializedValue: -3799739136
          y:
            _serializedValue: 24248242176
          z:
            _serializedValue: -709176576
      - bodyPart: 8
        mappedPosition:
          x:
            _serializedValue: 4373275648
          y:
            _serializedValue: 24518455296
          z:
            _serializedValue: -1834148864
      - bodyPart: 9
        mappedPosition:
          x:
            _serializedValue: -1021055104
          y:
            _serializedValue: 25287012352
          z:
            _serializedValue: -2330897408
      - bodyPart: 10
        mappedPosition:
          x:
            _serializedValue: 1236832768
          y:
            _serializedValue: 15194248192
          z:
            _serializedValue: 922805632
      - bodyPart: 11
        mappedPosition:
          x:
            _serializedValue: -1228472832
          y:
            _serializedValue: 16041136128
          z:
            _serializedValue: 1273641984
      - bodyPart: 12
        mappedPosition:
          x:
            _serializedValue: 1355240832
          y:
            _serializedValue: 9572820992
          z:
            _serializedValue: -1729280640
      - bodyPart: 13
        mappedPosition:
          x:
            _serializedValue: -1895453312
          y:
            _serializedValue: 18229465088
          z:
            _serializedValue: -4506909184
      - bodyPart: 14
        mappedPosition:
          x:
            _serializedValue: -315577536
          y:
            _serializedValue: 4823380992
          z:
            _serializedValue: 1288442624
      - bodyPart: 15
        mappedPosition:
          x:
            _serializedValue: -2847302144
          y:
            _serializedValue: 13450402816
          z:
            _serializedValue: -1234260992
      - bodyPart: 0
        mappedPosition:
          x:
            _serializedValue: 81811920
          y:
            _serializedValue: 15797545984
          z:
            _serializedValue: 1209605248
      deltaDisplacement:
        x:
          _serializedValue: 0
        y:
          _serializedValue: 0
        z:
          _serializedValue: 0
    - frame: 10
      hitBoxMaps:
      - bodyPart: 1
        mappedPosition:
          x:
            _serializedValue: 641729984
          y:
            _serializedValue: 25944539136
          z:
            _serializedValue: 2259370752
      - bodyPart: 2
        mappedPosition:
          x:
            _serializedValue: 649777728
          y:
            _serializedValue: 22094727168
          z:
            _serializedValue: 2019640576
      - bodyPart: 3
        mappedPosition:
          x:
            _serializedValue: 632966656
          y:
            _serializedValue: 17378570240
          z:
            _serializedValue: 1325599872
      - bodyPart: 4
        mappedPosition:
          x:
            _serializedValue: 3253069824
          y:
            _serializedValue: 23477841920
          z:
            _serializedValue: 2340857088
      - bodyPart: 5
        mappedPosition:
          x:
            _serializedValue: -1904879872
          y:
            _serializedValue: 23445682176
          z:
            _serializedValue: 2684444416
      - bodyPart: 6
        mappedPosition:
          x:
            _serializedValue: 6164021760
          y:
            _serializedValue: 22589792256
          z:
            _serializedValue: -46622208
      - bodyPart: 7
        mappedPosition:
          x:
            _serializedValue: -3677881600
          y:
            _serializedValue: 24687859712
          z:
            _serializedValue: -521167872
      - bodyPart: 8
        mappedPosition:
          x:
            _serializedValue: 4547211776
          y:
            _serializedValue: 25245696000
          z:
            _serializedValue: -1374116608
      - bodyPart: 9
        mappedPosition:
          x:
            _serializedValue: -851791872
          y:
            _serializedValue: 25743433728
          z:
            _serializedValue: -2047297792
      - bodyPart: 10
        mappedPosition:
          x:
            _serializedValue: 1234606336
          y:
            _serializedValue: 15279710208
          z:
            _serializedValue: 915065728
      - bodyPart: 11
        mappedPosition:
          x:
            _serializedValue: -1219620864
          y:
            _serializedValue: 16153299968
          z:
            _serializedValue: 1277923072
      - bodyPart: 12
        mappedPosition:
          x:
            _serializedValue: 1142938112
          y:
            _serializedValue: 9484344320
          z:
            _serializedValue: -1332900352
      - bodyPart: 13
        mappedPosition:
          x:
            _serializedValue: -1774850688
          y:
            _serializedValue: 18337667072
          z:
            _serializedValue: -4515928064
      - bodyPart: 14
        mappedPosition:
          x:
            _serializedValue: -603413632
          y:
            _serializedValue: 4645089792
          z:
            _serializedValue: 1493286656
      - bodyPart: 15
        mappedPosition:
          x:
            _serializedValue: -2851258368
          y:
            _serializedValue: 13547099136
          z:
            _serializedValue: -1299174400
      - bodyPart: 0
        mappedPosition:
          x:
            _serializedValue: 87770680
          y:
            _serializedValue: 15897009152
          z:
            _serializedValue: 1204909056
      deltaDisplacement:
        x:
          _serializedValue: 0
        y:
          _serializedValue: 0
        z:
          _serializedValue: 0
    - frame: 11
      hitBoxMaps:
      - bodyPart: 1
        mappedPosition:
          x:
            _serializedValue: 649593216
          y:
            _serializedValue: 25990486016
          z:
            _serializedValue: 2381276672
      - bodyPart: 2
        mappedPosition:
          x:
            _serializedValue: 661815360
          y:
            _serializedValue: 22145142784
          z:
            _serializedValue: 2078346496
      - bodyPart: 3
        mappedPosition:
          x:
            _serializedValue: 647154176
          y:
            _serializedValue: 17440978944
          z:
            _serializedValue: 1307145344
      - bodyPart: 4
        mappedPosition:
          x:
            _serializedValue: 3265274368
          y:
            _serializedValue: 23527137280
          z:
            _serializedValue: 2402986752
      - bodyPart: 5
        mappedPosition:
          x:
            _serializedValue: -1889929856
          y:
            _serializedValue: 23480748032
          z:
            _serializedValue: 2784076544
      - bodyPart: 6
        mappedPosition:
          x:
            _serializedValue: 6375035904
          y:
            _serializedValue: 22897489920
          z:
            _serializedValue: 190461952
      - bodyPart: 7
        mappedPosition:
          x:
            _serializedValue: -3558607360
          y:
            _serializedValue: 25042995200
          z:
            _serializedValue: -336406272
      - bodyPart: 8
        mappedPosition:
          x:
            _serializedValue: 4762740224
          y:
            _serializedValue: 25633656832
          z:
            _serializedValue: -968848384
      - bodyPart: 9
        mappedPosition:
          x:
            _serializedValue: -689528320
          y:
            _serializedValue: 26110328832
          z:
            _serializedValue: -1771431936
      - bodyPart: 10
        mappedPosition:
          x:
            _serializedValue: 1231406720
          y:
            _serializedValue: 15333964800
          z:
            _serializedValue: 913633536
      - bodyPart: 11
        mappedPosition:
          x:
            _serializedValue: -1214004992
          y:
            _serializedValue: 16228018176
          z:
            _serializedValue: 1286014720
      - bodyPart: 12
        mappedPosition:
          x:
            _serializedValue: 1055258432
          y:
            _serializedValue: 9482075136
          z:
            _serializedValue: -1177404032
      - bodyPart: 13
        mappedPosition:
          x:
            _serializedValue: -1686110720
          y:
            _serializedValue: 18374313984
          z:
            _serializedValue: -4529392640
      - bodyPart: 14
        mappedPosition:
          x:
            _serializedValue: -717842048
          y:
            _serializedValue: 4614254080
          z:
            _serializedValue: 1582287104
      - bodyPart: 15
        mappedPosition:
          x:
            _serializedValue: -2865342976
          y:
            _serializedValue: 13572190208
          z:
            _serializedValue: -1366365696
      - bodyPart: 0
        mappedPosition:
          x:
            _serializedValue: 91024232
          y:
            _serializedValue: 15962036224
          z:
            _serializedValue: 1205773312
      deltaDisplacement:
        x:
          _serializedValue: 0
        y:
          _serializedValue: 0
        z:
          _serializedValue: 0
    - frame: 12
      hitBoxMaps:
      - bodyPart: 1
        mappedPosition:
          x:
            _serializedValue: 658358144
          y:
            _serializedValue: 26034511872
          z:
            _serializedValue: 2500514304
      - bodyPart: 2
        mappedPosition:
          x:
            _serializedValue: 674458752
          y:
            _serializedValue: 22194671616
          z:
            _serializedValue: 2134515840
      - bodyPart: 3
        mappedPosition:
          x:
            _serializedValue: 661562816
          y:
            _serializedValue: 17503752192
          z:
            _serializedValue: 1286445056
      - bodyPart: 4
        mappedPosition:
          x:
            _serializedValue: 3278055424
          y:
            _serializedValue: 23575629824
          z:
            _serializedValue: 2462469376
      - bodyPart: 5
        mappedPosition:
          x:
            _serializedValue: -1874097280
          y:
            _serializedValue: 23514163200
          z:
            _serializedValue: 2880925952
      - bodyPart: 6
        mappedPosition:
          x:
            _serializedValue: 6556812800
          y:
            _serializedValue: 23210321920
          z:
            _serializedValue: 442909184
      - bodyPart: 7
        mappedPosition:
          x:
            _serializedValue: -3430393856
          y:
            _serializedValue: 25379139584
          z:
            _serializedValue: -129437440
      - bodyPart: 8
        mappedPosition:
          x:
            _serializedValue: 4916550144
          y:
            _serializedValue: 26003986432
          z:
            _serializedValue: -524097536
      - bodyPart: 9
        mappedPosition:
          x:
            _serializedValue: -520247584
          y:
            _serializedValue: 26450522112
          z:
            _serializedValue: -1476024064
      - bodyPart: 10
        mappedPosition:
          x:
            _serializedValue: 1228583168
          y:
            _serializedValue: 15388917760
          z:
            _serializedValue: 910049664
      - bodyPart: 11
        mappedPosition:
          x:
            _serializedValue: -1207812992
          y:
            _serializedValue: 16303314944
          z:
            _serializedValue: 1292026240
      - bodyPart: 12
        mappedPosition:
          x:
            _serializedValue: 965603712
          y:
            _serializedValue: 9483019264
          z:
            _serializedValue: -1013287104
      - bodyPart: 13
        mappedPosition:
          x:
            _serializedValue: -1603629824
          y:
            _serializedValue: 18408355840
          z:
            _serializedValue: -4544116736
      - bodyPart: 14
        mappedPosition:
          x:
            _serializedValue: -831033152
          y:
            _serializedValue: 4581883904
          z:
            _serializedValue: 1671194368
      - bodyPart: 15
        mappedPosition:
          x:
            _serializedValue: -2882170368
          y:
            _serializedValue: 13598820352
          z:
            _serializedValue: -1431339520
      - bodyPart: 0
        mappedPosition:
          x:
            _serializedValue: 94740840
          y:
            _serializedValue: 16027666432
          z:
            _serializedValue: 1204492160
      deltaDisplacement:
        x:
          _serializedValue: 0
        y:
          _serializedValue: 0
        z:
          _serializedValue: 0
    - frame: 13
      hitBoxMaps:
      - bodyPart: 1
        mappedPosition:
          x:
            _serializedValue: 639903872
          y:
            _serializedValue: 26043269120
          z:
            _serializedValue: 2588772352
      - bodyPart: 2
        mappedPosition:
          x:
            _serializedValue: 667081280
          y:
            _serializedValue: 22208178176
          z:
            _serializedValue: 2176588800
      - bodyPart: 3
        mappedPosition:
          x:
            _serializedValue: 666020992
          y:
            _serializedValue: 17527760896
          z:
            _serializedValue: 1272263936
      - bodyPart: 4
        mappedPosition:
          x:
            _serializedValue: 3267483648
          y:
            _serializedValue: 23593777152
          z:
            _serializedValue: 2510243072
      - bodyPart: 5
        mappedPosition:
          x:
            _serializedValue: -1882628864
          y:
            _serializedValue: 23510102016
          z:
            _serializedValue: 2949435136
      - bodyPart: 6
        mappedPosition:
          x:
            _serializedValue: 6604911104
          y:
            _serializedValue: 23281840128
          z:
            _serializedValue: 579799552
      - bodyPart: 7
        mappedPosition:
          x:
            _serializedValue: -3326539520
          y:
            _serializedValue: 25613271040
          z:
            _serializedValue: 41808896
      - bodyPart: 8
        mappedPosition:
          x:
            _serializedValue: 4979128832
          y:
            _serializedValue: 26102337536
          z:
            _serializedValue: -332212224
      - bodyPart: 9
        mappedPosition:
          x:
            _serializedValue: -383928992
          y:
            _serializedValue: 26689689600
          z:
            _serializedValue: -1228021248
      - bodyPart: 10
        mappedPosition:
          x:
            _serializedValue: 1222307584
          y:
            _serializedValue: 15407882240
          z:
            _serializedValue: 908418432
      - bodyPart: 11
        mappedPosition:
          x:
            _serializedValue: -1208164608
          y:
            _serializedValue: 16335098880
          z:
            _serializedValue: 1297170688
      - bodyPart: 12
        mappedPosition:
          x:
            _serializedValue: 958629184
          y:
            _serializedValue: 9584132096
          z:
            _serializedValue: -1250842112
      - bodyPart: 13
        mappedPosition:
          x:
            _serializedValue: -1570220288
          y:
            _serializedValue: 18405310464
          z:
            _serializedValue: -4553605120
      - bodyPart: 14
        mappedPosition:
          x:
            _serializedValue: -730598528
          y:
            _serializedValue: 4849099264
          z:
            _serializedValue: 1779247872
      - bodyPart: 15
        mappedPosition:
          x:
            _serializedValue: -2903349248
          y:
            _serializedValue: 13600063488
          z:
            _serializedValue: -1457143040
      - bodyPart: 0
        mappedPosition:
          x:
            _serializedValue: 92744144
          y:
            _serializedValue: 16053452800
          z:
            _serializedValue: 1204427264
      deltaDisplacement:
        x:
          _serializedValue: 0
        y:
          _serializedValue: 0
        z:
          _serializedValue: 0
    - frame: 14
      hitBoxMaps:
      - bodyPart: 1
        mappedPosition:
          x:
            _serializedValue: 619982208
          y:
            _serializedValue: 26050834432
          z:
            _serializedValue: 2676779008
      - bodyPart: 2
        mappedPosition:
          x:
            _serializedValue: 658093504
          y:
            _serializedValue: 22221070336
          z:
            _serializedValue: 2218481408
      - bodyPart: 3
        mappedPosition:
          x:
            _serializedValue: 668677440
          y:
            _serializedValue: 17551855616
          z:
            _serializedValue: 1258055680
      - bodyPart: 4
        mappedPosition:
          x:
            _serializedValue: 3255289344
          y:
            _serializedValue: 23611295744
          z:
            _serializedValue: 2557816576
      - bodyPart: 5
        mappedPosition:
          x:
            _serializedValue: -1892607232
          y:
            _serializedValue: 23505068032
          z:
            _serializedValue: 3017604096
      - bodyPart: 6
        mappedPosition:
          x:
            _serializedValue: 6648138752
          y:
            _serializedValue: 23352285184
          z:
            _serializedValue: 718297088
      - bodyPart: 7
        mappedPosition:
          x:
            _serializedValue: -3221055488
          y:
            _serializedValue: 25832015872
          z:
            _serializedValue: 227796480
      - bodyPart: 8
        mappedPosition:
          x:
            _serializedValue: 5033338880
          y:
            _serializedValue: 26197096448
          z:
            _serializedValue: -135866368
      - bodyPart: 9
        mappedPosition:
          x:
            _serializedValue: -247685264
          y:
            _serializedValue: 26909501440
          z:
            _serializedValue: -967277568
      - bodyPart: 10
        mappedPosition:
          x:
            _serializedValue: 1214338176
          y:
            _serializedValue: 15427095552
          z:
            _serializedValue: 906803456
      - bodyPart: 11
        mappedPosition:
          x:
            _serializedValue: -1210133504
          y:
            _serializedValue: 16367055872
          z:
            _serializedValue: 1302353536
      - bodyPart: 12
        mappedPosition:
          x:
            _serializedValue: 919864192
          y:
            _serializedValue: 9683192832
          z:
            _serializedValue: -1453047168
      - bodyPart: 13
        mappedPosition:
          x:
            _serializedValue: -1538140928
          y:
            _serializedValue: 18402224128
          z:
            _serializedValue: -4562706432
      - bodyPart: 14
        mappedPosition:
          x:
            _serializedValue: -629854080
          y:
            _serializedValue: 5114290176
          z:
            _serializedValue: 1890450560
      - bodyPart: 15
        mappedPosition:
          x:
            _serializedValue: -2924940288
          y:
            _serializedValue: 13601550336
          z:
            _serializedValue: -1482767616
      - bodyPart: 0
        mappedPosition:
          x:
            _serializedValue: 89081496
          y:
            _serializedValue: 16079433728
          z:
            _serializedValue: 1204375424
      deltaDisplacement:
        x:
          _serializedValue: 0
        y:
          _serializedValue: 0
        z:
          _serializedValue: 0
    - frame: 15
      hitBoxMaps:
      - bodyPart: 1
        mappedPosition:
          x:
            _serializedValue: 511363232
          y:
            _serializedValue: 26074134528
          z:
            _serializedValue: 2658327296
      - bodyPart: 2
        mappedPosition:
          x:
            _serializedValue: 571962240
          y:
            _serializedValue: 22243155968
          z:
            _serializedValue: 2212808704
      - bodyPart: 3
        mappedPosition:
          x:
            _serializedValue: 610242304
          y:
            _serializedValue: 17570910208
          z:
            _serializedValue: 1267941248
      - bodyPart: 4
        mappedPosition:
          x:
            _serializedValue: 3160834816
          y:
            _serializedValue: 23649527808
          z:
            _serializedValue: 2549212160
      - bodyPart: 5
        mappedPosition:
          x:
            _serializedValue: -1986671360
          y:
            _serializedValue: 23515000832
          z:
            _serializedValue: 3005982976
      - bodyPart: 6
        mappedPosition:
          x:
            _serializedValue: 6525059072
          y:
            _serializedValue: 23410462720
          z:
            _serializedValue: 655223808
      - bodyPart: 7
        mappedPosition:
          x:
            _serializedValue: -3248684032
          y:
            _serializedValue: 25951905792
          z:
            _serializedValue: 279941888
      - bodyPart: 8
        mappedPosition:
          x:
            _serializedValue: 4894102528
          y:
            _serializedValue: 26242156544
          z:
            _serializedValue: -211738624
      - bodyPart: 9
        mappedPosition:
          x:
            _serializedValue: -280041536
          y:
            _serializedValue: 27087912960
          z:
            _serializedValue: -871911744
      - bodyPart: 10
        mappedPosition:
          x:
            _serializedValue: 1212623488
          y:
            _serializedValue: 15462346752
          z:
            _serializedValue: 911828736
      - bodyPart: 11
        mappedPosition:
          x:
            _serializedValue: -1237521536
          y:
            _serializedValue: 16337800192
          z:
            _serializedValue: 1297084544
      - bodyPart: 12
        mappedPosition:
          x:
            _serializedValue: 959091264
          y:
            _serializedValue: 10005438464
          z:
            _serializedValue: -2055650048
      - bodyPart: 13
        mappedPosition:
          x:
            _serializedValue: -1801790336
          y:
            _serializedValue: 18245332992
          z:
            _serializedValue: -4592856064
      - bodyPart: 14
        mappedPosition:
          x:
            _serializedValue: -106214400
          y:
            _serializedValue: 5860330496
          z:
            _serializedValue: 1961645440
      - bodyPart: 15
        mappedPosition:
          x:
            _serializedValue: -3034831872
          y:
            _serializedValue: 13457819648
          z:
            _serializedValue: -1428200704
      - bodyPart: 0
        mappedPosition:
          x:
            _serializedValue: 69227672
          y:
            _serializedValue: 16084225024
          z:
            _serializedValue: 1205432192
      deltaDisplacement:
        x:
          _serializedValue: 0
        y:
          _serializedValue: 0
        z:
          _serializedValue: 0
    - frame: 16
      hitBoxMaps:
      - bodyPart: 1
        mappedPosition:
          x:
            _serializedValue: 397305952
          y:
            _serializedValue: 26088951808
          z:
            _serializedValue: 2639937792
      - bodyPart: 2
        mappedPosition:
          x:
            _serializedValue: 480333472
          y:
            _serializedValue: 22256922624
          z:
            _serializedValue: 2207243776
      - bodyPart: 3
        mappedPosition:
          x:
            _serializedValue: 546231296
          y:
            _serializedValue: 17581852672
          z:
            _serializedValue: 1277998208
      - bodyPart: 4
        mappedPosition:
          x:
            _serializedValue: 3060812032
          y:
            _serializedValue: 23679342592
          z:
            _serializedValue: 2540630528
      - bodyPart: 5
        mappedPosition:
          x:
            _serializedValue: -2086133632
          y:
            _serializedValue: 23516594176
          z:
            _serializedValue: 2994511872
      - bodyPart: 6
        mappedPosition:
          x:
            _serializedValue: 6395356672
          y:
            _serializedValue: 23459844096
          z:
            _serializedValue: 592562176
      - bodyPart: 7
        mappedPosition:
          x:
            _serializedValue: -3281480704
          y:
            _serializedValue: 26058913792
          z:
            _serializedValue: 335515648
      - bodyPart: 8
        mappedPosition:
          x:
            _serializedValue: 4747654656
          y:
            _serializedValue: 26277832704
          z:
            _serializedValue: -287297536
      - bodyPart: 9
        mappedPosition:
          x:
            _serializedValue: -317827264
          y:
            _serializedValue: 27252504576
          z:
            _serializedValue: -770013824
      - bodyPart: 10
        mappedPosition:
          x:
            _serializedValue: 1204882176
          y:
            _serializedValue: 15490973696
          z:
            _serializedValue: 917271296
      - bodyPart: 11
        mappedPosition:
          x:
            _serializedValue: -1269155328
          y:
            _serializedValue: 16301302784
          z:
            _serializedValue: 1292151040
      - bodyPart: 12
        mappedPosition:
          x:
            _serializedValue: 904717440
          y:
            _serializedValue: 10308831232
          z:
            _serializedValue: -2503729152
      - bodyPart: 13
        mappedPosition:
          x:
            _serializedValue: -2053501440
          y:
            _serializedValue: 18086039552
          z:
            _serializedValue: -4611061760
      - bodyPart: 14
        mappedPosition:
          x:
            _serializedValue: 402253312
          y:
            _serializedValue: 6616664576
          z:
            _serializedValue: 2031785728
      - bodyPart: 15
        mappedPosition:
          x:
            _serializedValue: -3141371392
          y:
            _serializedValue: 13312318464
          z:
            _serializedValue: -1373190400
      - bodyPart: 0
        mappedPosition:
          x:
            _serializedValue: 44194964
          y:
            _serializedValue: 16081944576
          z:
            _serializedValue: 1206837376
      deltaDisplacement:
        x:
          _serializedValue: 0
        y:
          _serializedValue: 0
        z:
          _serializedValue: 0
    - frame: 17
      hitBoxMaps:
      - bodyPart: 1
        mappedPosition:
          x:
            _serializedValue: 207226272
          y:
            _serializedValue: 26146166784
          z:
            _serializedValue: 2456998656
      - bodyPart: 2
        mappedPosition:
          x:
            _serializedValue: 313697088
          y:
            _serializedValue: 22305716224
          z:
            _serializedValue: 2113282304
      - bodyPart: 3
        mappedPosition:
          x:
            _serializedValue: 411919872
          y:
            _serializedValue: 17610973184
          z:
            _serializedValue: 1292383616
      - bodyPart: 4
        mappedPosition:
          x:
            _serializedValue: 2883729152
          y:
            _serializedValue: 23749025792
          z:
            _serializedValue: 2437466624
      - bodyPart: 5
        mappedPosition:
          x:
            _serializedValue: -2266308096
          y:
            _serializedValue: 23569537024
          z:
            _serializedValue: 2847884288
      - bodyPart: 6
        mappedPosition:
          x:
            _serializedValue: 6159782912
          y:
            _serializedValue: 23594362880
          z:
            _serializedValue: 386639872
      - bodyPart: 7
        mappedPosition:
          x:
            _serializedValue: -3469602048
          y:
            _serializedValue: 26109251584
          z:
            _serializedValue: 189986560
      - bodyPart: 8
        mappedPosition:
          x:
            _serializedValue: 4482777600
          y:
            _serializedValue: 26390495232
          z:
            _serializedValue: -507464448
      - bodyPart: 9
        mappedPosition:
          x:
            _serializedValue: -558237056
          y:
            _serializedValue: 27430426624
          z:
            _serializedValue: -909367680
      - bodyPart: 10
        mappedPosition:
          x:
            _serializedValue: 1201966336
          y:
            _serializedValue: 15570478080
          z:
            _serializedValue: 907749120
      - bodyPart: 11
        mappedPosition:
          x:
            _serializedValue: -1322886784
          y:
            _serializedValue: 16223819776
          z:
            _serializedValue: 1248811648
      - bodyPart: 12
        mappedPosition:
          x:
            _serializedValue: 985589696
          y:
            _serializedValue: 10927970304
          z:
            _serializedValue: -3221211392
      - bodyPart: 13
        mappedPosition:
          x:
            _serializedValue: -2645599744
          y:
            _serializedValue: 17706661888
          z:
            _serializedValue: -4641862656
      - bodyPart: 14
        mappedPosition:
          x:
            _serializedValue: 1159959168
          y:
            _serializedValue: 7826214912
          z:
            _serializedValue: 1759166592
      - bodyPart: 15
        mappedPosition:
          x:
            _serializedValue: -3364014080
          y:
            _serializedValue: 12999683072
          z:
            _serializedValue: -1209089792
      - bodyPart: 0
        mappedPosition:
          x:
            _serializedValue: 2643805
          y:
            _serializedValue: 16085252096
          z:
            _serializedValue: 1185121408
      deltaDisplacement:
        x:
          _serializedValue: 0
        y:
          _serializedValue: 0
        z:
          _serializedValue: 0
    clip: {fileID: 7400000, guid: a80c982b3db1145e7a355a5db6a756d2, type: 2}
    customHitBoxDefinition: {fileID: 0}
    length:
      _serializedValue: 1288490368
    bakeSpeed: 1
    hitBoxDefinitionType: 0
  _animationSpeed:
    _serializedValue: 4294967296
  wrapMode: 0
  characterPrefab: {fileID: 1272366937168992, guid: 01b0a963f13679544a22d6e63d5256c6,
    type: 3}
  moveName: All woman Super Jump
  description: Man Super Jump
  fps: 60
  ignoreGravity: 0
  ignoreFriction: 0
  cancelMoveWhenLanding: 0
  landingMoveLink: {fileID: 0}
  forceMirrorLeft: 0
  forceMirrorRight: 0
  invertRotationLeft: 0
  invertRotationRight: 0
  autoCorrectRotation: 0
  allowSideSwitch: 0
  frameWindowRotation: 0
  cooldown: 0
  cooldownFrames: 0
  disableHeadLook: 1
  speedKeyFrameToggle: 0
  fixedSpeed: 1
  animSpeedKeyFrame: []
  totalFrames: 18
  startUpFrames: 19
  activeFrames: -18
  recoveryFrames: 23
  applyRootMotion: 0
  lockXMotion: 0
  lockYMotion: 0
  lockZMotion: 0
  forceGrounded: 0
  rootMotionNode: 0
  overrideBlendingIn: 0
  overrideBlendingOut: 1
  _blendingIn:
    _serializedValue: 0
  _blendingOut:
    _serializedValue: 2147483648
  defaultInputs:
    chargeMove: 0
    _chargeTiming:
      _serializedValue: 3006477056
    allowInputLeniency: 0
    allowNegativeEdge: 1
    forceAxisPrecision: 0
    leniencyBuffer: 3
    onReleaseExecution: 0
    requireButtonPress: 1
    onPressExecution: 1
    buttonSequence: 03000000
    buttonExecution: 02000000
    editorToggle: 0
    buttonSequenceToggle: 0
    buttonExecutionToggle: 0
  altInputs:
    chargeMove: 0
    _chargeTiming:
      _serializedValue: 3006477107
    allowInputLeniency: 0
    allowNegativeEdge: 1
    forceAxisPrecision: 0
    leniencyBuffer: 3
    onReleaseExecution: 0
    requireButtonPress: 1
    onPressExecution: 1
    buttonSequence: 
    buttonExecution: 
    editorToggle: 0
    buttonSequenceToggle: 0
    buttonExecutionToggle: 0
  previousMoves: []
  opponentConditions:
    basicMoveLimitation: 
    possibleMoveStates: []
    basicMovesToggle: 0
    statesToggle: 0
  selfConditions:
    basicMoveLimitation: 
    possibleMoveStates:
    - possibleState: 0
      jumpArc: 0
      jumpArcBegins: 0
      jumpArcEnds: 100
      opponentDistance: 0
      proximityRangeBegins: 0
      proximityRangeEnds: 100
      movingForward: 1
      movingBack: 1
      standBy: 1
      blocking: 0
      blockStunned: 0
      stunned: 0
      resetStunValue: 0
    - possibleState: 1
      jumpArc: 0
      jumpArcBegins: 0
      jumpArcEnds: 100
      opponentDistance: 0
      proximityRangeBegins: 0
      proximityRangeEnds: 100
      movingForward: 1
      movingBack: 1
      standBy: 1
      blocking: 0
      blockStunned: 0
      stunned: 0
      resetStunValue: 0
    basicMovesToggle: 0
    statesToggle: 1
  moveClassification:
    attackType: 0
    hitType: 0
    startupSpeed: 0
    recoverySpeed: 0
    hitConfirmType: 0
    preferableDistance: 0
    gaugeUsage: 0
    anyAttackType: 1
    anyHitType: 1
    anyHitConfirmType: 1
  frameLinks:
  - linkType: 2
    allowBuffer: 1
    onStrike: 1
    onBlock: 1
    onParry: 1
    activeFramesBegins: 1
    activeFramesEnds: 17
    counterMoveType: 0
    counterMoveFilter: {fileID: 0}
    disableHitImpact: 1
    anyHitStrength: 1
    hitStrength: 0
    anyStrokeHitBox: 1
    hitBoxType: 0
    anyHitType: 1
    hitType: 0
    ignoreInputs: 0
    ignorePlayerConditions: 0
    ignoreGauge: 0
    nextMoveStartupFrame: 1
    linkableMoves:
    - {fileID: 11400000, guid: 20e8ec3c15e3744dca4a68c1cfa77c53, type: 2}
    - {fileID: 11400000, guid: f74526133dc874f4b967792c7eb1e1b2, type: 2}
    - {fileID: 11400000, guid: 9a969e2e5487f48ea9883dca77eae76f, type: 2}
    linkableMovesToggle: 1
    hitConfirmToggle: 0
    counterMoveToggle: 0
  gauges:
  - castingFrame: 0
    targetGauge: 0
    startDrainingGauge: 0
    inhibitGainWhileDraining: 0
    stopDrainingGauge: 0
    _gaugeDPS:
      _serializedValue: 0
    _totalDrain:
      _serializedValue: 0
    _gaugeRequired:
      _serializedValue: 0
    _gaugeUsage:
      _serializedValue: 0
    _gaugeGainOnMiss:
      _serializedValue: 0
    _gaugeGainOnHit:
      _serializedValue: 0
    _gaugeGainOnBlock:
      _serializedValue: 0
    _opGaugeGainOnBlock:
      _serializedValue: 0
    _opGaugeGainOnParry:
      _serializedValue: 0
    _opGaugeGainOnHit:
      _serializedValue: 0
    DCMove: {fileID: 0}
    DCStance: 0
    editorToggle: 0
  sortOrder: []
  particleEffects: []
  appliedForces:
  - castingFrame: 4
    resetPreviousVertical: 1
    resetPreviousHorizontal: 1
    affectAssists: 0
    affectCharacter: 1
    _force:
      x:
        _serializedValue: 30064771072
      y:
        _serializedValue: 257698037760
      z:
        _serializedValue: 0
  opAppliedForces: []
  slowMoEffects: []
  bodyPartVisibilityChanges: []
  opponentOverride: []
  characterAssist: []
  soundEffects:
  - castingFrame: 0
    sounds:
    - {fileID: 8300000, guid: e43de3f8a568b4d569690f6796ecf58d, type: 3}
    soundEffectsToggle: 1
  inGameAlert: []
  stanceChanges: []
  cameraMovements: []
  hits: []
  blockableArea:
    enabled: 1
    activeFramesBegin: 14
    activeFramesEnds: 52
    bodyPart: 2
    hitBoxDefinitionIndex: 0
    shape: 0
    rect:
      serializedVersion: 2
      x: 0
      y: 0
      width: 4
      height: 4
    _rect:
      _x:
        _serializedValue: 0
      _y:
        _serializedValue: 0
      topRight:
        x:
          _serializedValue: 0
        y:
          _serializedValue: 0
        z:
          _serializedValue: 0
      topLeft:
        x:
          _serializedValue: 0
        y:
          _serializedValue: 0
        z:
          _serializedValue: 0
      bottomRight:
        x:
          _serializedValue: 0
        y:
          _serializedValue: 0
        z:
          _serializedValue: 0
      bottomLeft:
        x:
          _serializedValue: 0
        y:
          _serializedValue: 0
        z:
          _serializedValue: 0
      width:
        _serializedValue: 0
      height:
        _serializedValue: 0
      xMax:
        _serializedValue: 0
      yMax:
        _serializedValue: 0
    followXBounds: 0
    followYBounds: 0
    _radius:
      _serializedValue: 25769803776
    _offSet:
      x:
        _serializedValue: 0
      y:
        _serializedValue: 0
      z:
        _serializedValue: 0
    cuboidMin:
      x:
        _serializedValue: 0
      y:
        _serializedValue: 0
      z:
        _serializedValue: 0
    cuboidMax:
      x:
        _serializedValue: 0
      y:
        _serializedValue: 0
      z:
        _serializedValue: 0
    position:
      x:
        _serializedValue: 0
      y:
        _serializedValue: 0
      z:
        _serializedValue: 0
  lockOnTargets: []
  switchCharacterOptions: []
  invincibleBodyParts: []
  stateOverride: []
  armorOptions:
    activeFramesBegin: 0
    activeFramesEnds: 0
    overrideHitEffects: 0
    blockHits: 0
    hitEffects:
      hitParticle: {fileID: 0}
      killTime: 0
      hitSound: {fileID: 0}
      spawnPoint: 1
      _freezingTime:
        _serializedValue: 0
      _animationSpeed:
        _serializedValue: 429496736
      autoHitStop: 1
      sticky: 0
      _hitStop:
        _serializedValue: 429496736
      mirrorOn2PSide: 0
      shakeCharacterOnHit: 1
      shakeCameraOnHit: 1
      _shakeDensity:
        _serializedValue: 3435973888
      _shakeCameraDensity:
        _serializedValue: 3435973836
      editorToggle: 0
    hitAbsorption: 0
    damageAbsorption: 0
    nonAffectedBodyParts: 
  projectiles: []
  rotationPreview: {x: 0, y: 90, z: 0}
