%YAML 1.1
%TAG !u! tag:unity3d.com,2011:
--- !u!114 &11400000
MonoBehaviour:
  m_ObjectHideFlags: 0
  m_CorrespondingSourceObject: {fileID: 0}
  m_PrefabInstance: {fileID: 0}
  m_PrefabAsset: {fileID: 0}
  m_GameObject: {fileID: 0}
  m_Enabled: 1
  m_EditorHideFlags: 0
  m_Script: {fileID: 11500000, guid: e2e5269517f28664db5ccd78cbd208b1, type: 3}
  m_Name: Rhino
  m_EditorClassIdentifier: 
  gameplayType: 0
  profilePictureSmall: {fileID: 2800000, guid: 135ac7db885bf4f92b011bb75bbfc8f2, type: 3}
  profilePictureBig: {fileID: 2800000, guid: 540d9dad907f54b089d25dfac25df541, type: 3}
  characterName: Rhino
  gender: 1
  characterDescription: 
  selectionAnimation: {fileID: 0}
  selectionSound: {fileID: 0}
  deathSound: {fileID: 0}
  height: 0
  age: 28
  bloodType: Unknown
  lifePoints: 1250
  maxGaugePoints: 850
  characterPrefabStorage: 0
  characterPrefab: {fileID: 7490039955005452929, guid: 75b0535e00d01483eb0f2fcaf0f87de6,
    type: 3}
  prefabResourcePath: 
  alternativeCostumes:
  - name: RhinoAlt
    characterPrefabStorage: 0
    prefab: {fileID: 7490039955005452929, guid: 75b0535e00d01483eb0f2fcaf0f87de6,
      type: 3}
    prefabResourcePath: 
    enableColorMask: 1
    colorMask: {r: 0.5176471, g: 0.68235296, b: 0.65882355, a: 0}
  initialPosition:
    x:
      _serializedValue: 0
    y:
      _serializedValue: 0
    z:
      _serializedValue: 0
  initialRotation:
    x:
      _serializedValue: 0
    y:
      _serializedValue: 3037000704
    z:
      _serializedValue: 0
    w:
      _serializedValue: 3037000704
  physics:
    _moveForwardSpeed:
      _serializedValue: 42949672960
    _moveBackSpeed:
      _serializedValue: 34359738368
    _moveSidewaysSpeed:
      _serializedValue: 17179869184
    highMovingFriction: 1
    _friction:
      _serializedValue: 429496729600
    canCrouch: 1
    crouchDelay: 2
    standingDelay: 2
    canJump: 1
    pressureSensitiveJump: 0
    _jumpForce:
      _serializedValue: 171798691840
    _minJumpForce:
      _serializedValue: 128849018880
    minJumpDelay: 4
    _jumpDistance:
      _serializedValue: 60129542144
    _jumpBackDistance:
      _serializedValue: 42949672960
    cumulativeForce: 1
    multiJumps: 1
    _weight:
      _serializedValue: 1546188226560
    jumpDelay: 5
    landingDelay: 7
    _groundCollisionMass:
      _serializedValue: 8589934592
  headLook:
    enabled: 0
    segments: []
    nonAffectedJoints: []
    target: 1
    effect: 1
    overrideAnimation: 1
    disableOnHit: 1
  customControls:
    overrideControlFreak: 0
    controlFreak2Prefab: {fileID: 0}
    zAxisMovement: 0
    disableJump: 0
    disableCrouch: 0
    jumpButton: 2
    crouchButton: 3
  hideGauges: 00000000000000000000
  _executionTiming:
    _serializedValue: 1288490240
  possibleAirMoves: 3
  _blendingTime:
    _serializedValue: 42949672
  animationType: 1
  avatar: {fileID: 9000000, guid: b2f2e775586974008973b2b381a081ac, type: 3}
  useScaleFlip: 0
  applyRootMotion: 0
  animationFlow: 0
  useAnimationMaps: 1
  normalizeAnimationFrames: 0
  stanceResourcePath:
  - _2DFighter/MoveSets/Rhino
  - _2DFighter/MoveSets/Berserk
  moves: []
  aiInstructionsSet:
  - aiInfo: {fileID: 11400000, guid: 17d8c9859bca4a548a7621c06d6cfebf, type: 2}
    behavior: 2
  - aiInfo: {fileID: 11400000, guid: 0cbb4bf9fc37e2540a4b1900a715cbb1, type: 2}
    behavior: 3
  - aiInfo: {fileID: 11400000, guid: 50d4630698994bd45b6f19bf649b3a90, type: 2}
    behavior: 5
