%YAML 1.1
%TAG !u! tag:unity3d.com,2011:
--- !u!114 &11400000
MonoBehaviour:
  m_ObjectHideFlags: 0
  m_CorrespondingSourceObject: {fileID: 0}
  m_PrefabInstance: {fileID: 0}
  m_PrefabAsset: {fileID: 0}
  m_GameObject: {fileID: 0}
  m_Enabled: 1
  m_EditorHideFlags: 0
  m_Script: {fileID: 11500000, guid: bbb281ee3bf0b054c82ac2347e9e782c, type: 3}
  m_Name: Default Local Group
  m_EditorClassIdentifier: 
  m_GroupName: Default Local Group
  m_Data:
    m_SerializedData: []
  m_GUID: c11891ef004dc3d40b39c47a6efa31c9
  m_SerializeEntries:
  - m_GUID: 252170b4a9ff64692823f575f0b526a5
    m_Address: Assets/Scenes/Lobby.unity
    m_ReadOnly: 0
    m_SerializedLabels: []
  - m_GUID: 408c7d101a0247a469cf611d68a84d03
    m_Address: Assets/Scenes/Login.unity
    m_ReadOnly: 0
    m_SerializedLabels: []
  m_ReadOnly: 0
  m_Settings: {fileID: 11400000, guid: 86a9d7dee93427743bccf4f188b16e8c, type: 2}
  m_SchemaSet:
    m_Schemas:
    - {fileID: 11400000, guid: 3cee6b7af72207748aed644970136a6e, type: 2}
    - {fileID: 11400000, guid: 0f28aa3d62d8d5d4896715bb9c5060af, type: 2}
