%YAML 1.1
%TAG !u! tag:unity3d.com,2011:
--- !u!1 &3637770381503473122
GameObject:
  m_ObjectHideFlags: 0
  m_CorrespondingSourceObject: {fileID: 0}
  m_PrefabInstance: {fileID: 0}
  m_PrefabAsset: {fileID: 0}
  serializedVersion: 6
  m_Component:
  - component: {fileID: 6803671111055737033}
  m_Layer: 0
  m_Name: FloatingPlatform00_5
  m_TagString: Untagged
  m_Icon: {fileID: 0}
  m_NavMeshLayer: 0
  m_StaticEditorFlags: 2147483647
  m_IsActive: 1
--- !u!4 &6803671111055737033
Transform:
  m_ObjectHideFlags: 0
  m_CorrespondingSourceObject: {fileID: 0}
  m_PrefabInstance: {fileID: 0}
  m_PrefabAsset: {fileID: 0}
  m_GameObject: {fileID: 3637770381503473122}
  m_LocalRotation: {x: 0, y: 0, z: 0, w: 1}
  m_LocalPosition: {x: 0, y: 0, z: 0}
  m_LocalScale: {x: 1, y: 1, z: 1}
  m_ConstrainProportionsScale: 0
  m_Children:
  - {fileID: 3277310333644876721}
  - {fileID: 3894405044102684711}
  m_Father: {fileID: 0}
  m_RootOrder: 0
  m_LocalEulerAnglesHint: {x: 0, y: 0, z: 0}
--- !u!1001 &2017146742500210512
PrefabInstance:
  m_ObjectHideFlags: 0
  serializedVersion: 2
  m_Modification:
    m_TransformParent: {fileID: 6803671111055737033}
    m_Modifications:
    - target: {fileID: 3928546404721564897, guid: 5d90e41f383a79f41be6b4e1e98eebff, type: 3}
      propertyPath: m_RootOrder
      value: 0
      objectReference: {fileID: 0}
    - target: {fileID: 3928546404721564897, guid: 5d90e41f383a79f41be6b4e1e98eebff, type: 3}
      propertyPath: m_LocalScale.y
      value: -1
      objectReference: {fileID: 0}
    - target: {fileID: 3928546404721564897, guid: 5d90e41f383a79f41be6b4e1e98eebff, type: 3}
      propertyPath: m_LocalPosition.x
      value: 0
      objectReference: {fileID: 0}
    - target: {fileID: 3928546404721564897, guid: 5d90e41f383a79f41be6b4e1e98eebff, type: 3}
      propertyPath: m_LocalPosition.y
      value: 0
      objectReference: {fileID: 0}
    - target: {fileID: 3928546404721564897, guid: 5d90e41f383a79f41be6b4e1e98eebff, type: 3}
      propertyPath: m_LocalPosition.z
      value: 0
      objectReference: {fileID: 0}
    - target: {fileID: 3928546404721564897, guid: 5d90e41f383a79f41be6b4e1e98eebff, type: 3}
      propertyPath: m_LocalRotation.w
      value: 1
      objectReference: {fileID: 0}
    - target: {fileID: 3928546404721564897, guid: 5d90e41f383a79f41be6b4e1e98eebff, type: 3}
      propertyPath: m_LocalRotation.x
      value: 0
      objectReference: {fileID: 0}
    - target: {fileID: 3928546404721564897, guid: 5d90e41f383a79f41be6b4e1e98eebff, type: 3}
      propertyPath: m_LocalRotation.y
      value: -0
      objectReference: {fileID: 0}
    - target: {fileID: 3928546404721564897, guid: 5d90e41f383a79f41be6b4e1e98eebff, type: 3}
      propertyPath: m_LocalRotation.z
      value: -0
      objectReference: {fileID: 0}
    - target: {fileID: 3928546404721564897, guid: 5d90e41f383a79f41be6b4e1e98eebff, type: 3}
      propertyPath: m_LocalEulerAnglesHint.x
      value: 0
      objectReference: {fileID: 0}
    - target: {fileID: 3928546404721564897, guid: 5d90e41f383a79f41be6b4e1e98eebff, type: 3}
      propertyPath: m_LocalEulerAnglesHint.y
      value: 0
      objectReference: {fileID: 0}
    - target: {fileID: 3928546404721564897, guid: 5d90e41f383a79f41be6b4e1e98eebff, type: 3}
      propertyPath: m_LocalEulerAnglesHint.z
      value: 0
      objectReference: {fileID: 0}
    - target: {fileID: 4453726366526948955, guid: 5d90e41f383a79f41be6b4e1e98eebff, type: 3}
      propertyPath: m_Name
      value: PlatformBorder00b_5 Variant
      objectReference: {fileID: 0}
    - target: {fileID: 4453726366526948955, guid: 5d90e41f383a79f41be6b4e1e98eebff, type: 3}
      propertyPath: m_StaticEditorFlags
      value: 2147483647
      objectReference: {fileID: 0}
    m_RemovedComponents: []
  m_SourcePrefab: {fileID: 100100000, guid: 5d90e41f383a79f41be6b4e1e98eebff, type: 3}
--- !u!4 &3277310333644876721 stripped
Transform:
  m_CorrespondingSourceObject: {fileID: 3928546404721564897, guid: 5d90e41f383a79f41be6b4e1e98eebff, type: 3}
  m_PrefabInstance: {fileID: 2017146742500210512}
  m_PrefabAsset: {fileID: 0}
--- !u!1001 &5973964394786197052
PrefabInstance:
  m_ObjectHideFlags: 0
  serializedVersion: 2
  m_Modification:
    m_TransformParent: {fileID: 6803671111055737033}
    m_Modifications:
    - target: {fileID: 7272324070290157083, guid: 67908d4b10b21434389682700ea631fa, type: 3}
      propertyPath: m_RootOrder
      value: 1
      objectReference: {fileID: 0}
    - target: {fileID: 7272324070290157083, guid: 67908d4b10b21434389682700ea631fa, type: 3}
      propertyPath: m_LocalPosition.x
      value: 0
      objectReference: {fileID: 0}
    - target: {fileID: 7272324070290157083, guid: 67908d4b10b21434389682700ea631fa, type: 3}
      propertyPath: m_LocalPosition.y
      value: 0
      objectReference: {fileID: 0}
    - target: {fileID: 7272324070290157083, guid: 67908d4b10b21434389682700ea631fa, type: 3}
      propertyPath: m_LocalPosition.z
      value: 0
      objectReference: {fileID: 0}
    - target: {fileID: 7272324070290157083, guid: 67908d4b10b21434389682700ea631fa, type: 3}
      propertyPath: m_LocalRotation.w
      value: 1
      objectReference: {fileID: 0}
    - target: {fileID: 7272324070290157083, guid: 67908d4b10b21434389682700ea631fa, type: 3}
      propertyPath: m_LocalRotation.x
      value: 0
      objectReference: {fileID: 0}
    - target: {fileID: 7272324070290157083, guid: 67908d4b10b21434389682700ea631fa, type: 3}
      propertyPath: m_LocalRotation.y
      value: -0
      objectReference: {fileID: 0}
    - target: {fileID: 7272324070290157083, guid: 67908d4b10b21434389682700ea631fa, type: 3}
      propertyPath: m_LocalRotation.z
      value: -0
      objectReference: {fileID: 0}
    - target: {fileID: 7272324070290157083, guid: 67908d4b10b21434389682700ea631fa, type: 3}
      propertyPath: m_LocalEulerAnglesHint.x
      value: 0
      objectReference: {fileID: 0}
    - target: {fileID: 7272324070290157083, guid: 67908d4b10b21434389682700ea631fa, type: 3}
      propertyPath: m_LocalEulerAnglesHint.y
      value: 0
      objectReference: {fileID: 0}
    - target: {fileID: 7272324070290157083, guid: 67908d4b10b21434389682700ea631fa, type: 3}
      propertyPath: m_LocalEulerAnglesHint.z
      value: 0
      objectReference: {fileID: 0}
    - target: {fileID: 8045589039960208545, guid: 67908d4b10b21434389682700ea631fa, type: 3}
      propertyPath: m_Name
      value: PlatformBorder00_5 Variant
      objectReference: {fileID: 0}
    - target: {fileID: 8045589039960208545, guid: 67908d4b10b21434389682700ea631fa, type: 3}
      propertyPath: m_StaticEditorFlags
      value: 2147483647
      objectReference: {fileID: 0}
    m_RemovedComponents: []
  m_SourcePrefab: {fileID: 100100000, guid: 67908d4b10b21434389682700ea631fa, type: 3}
--- !u!4 &3894405044102684711 stripped
Transform:
  m_CorrespondingSourceObject: {fileID: 7272324070290157083, guid: 67908d4b10b21434389682700ea631fa, type: 3}
  m_PrefabInstance: {fileID: 5973964394786197052}
  m_PrefabAsset: {fileID: 0}
