%YAML 1.1
%TAG !u! tag:unity3d.com,2011:
--- !u!1 &6265626166972055987
GameObject:
  m_ObjectHideFlags: 0
  m_CorrespondingSourceObject: {fileID: 0}
  m_PrefabInstance: {fileID: 0}
  m_PrefabAsset: {fileID: 0}
  serializedVersion: 6
  m_Component:
  - component: {fileID: 6184999515697399353}
  m_Layer: 0
  m_Name: FloatingPlatform00_2.5
  m_TagString: Untagged
  m_Icon: {fileID: 0}
  m_NavMeshLayer: 0
  m_StaticEditorFlags: 2147483647
  m_IsActive: 1
--- !u!4 &6184999515697399353
Transform:
  m_ObjectHideFlags: 0
  m_CorrespondingSourceObject: {fileID: 0}
  m_PrefabInstance: {fileID: 0}
  m_PrefabAsset: {fileID: 0}
  m_GameObject: {fileID: 6265626166972055987}
  m_LocalRotation: {x: 0, y: 0, z: 0, w: 1}
  m_LocalPosition: {x: 0, y: 0, z: 0}
  m_LocalScale: {x: 1, y: 1, z: 1}
  m_ConstrainProportionsScale: 0
  m_Children:
  - {fileID: 8645268203672276053}
  - {fileID: 4724074041427929848}
  m_Father: {fileID: 0}
  m_RootOrder: 0
  m_LocalEulerAnglesHint: {x: 0, y: 0, z: 0}
--- !u!1001 &2795772942246364144
PrefabInstance:
  m_ObjectHideFlags: 0
  serializedVersion: 2
  m_Modification:
    m_TransformParent: {fileID: 6184999515697399353}
    m_Modifications:
    - target: {fileID: 7441033873049970952, guid: 07fe56e93892cd84fa65305d3026b907, type: 3}
      propertyPath: m_RootOrder
      value: 1
      objectReference: {fileID: 0}
    - target: {fileID: 7441033873049970952, guid: 07fe56e93892cd84fa65305d3026b907, type: 3}
      propertyPath: m_LocalPosition.x
      value: 0
      objectReference: {fileID: 0}
    - target: {fileID: 7441033873049970952, guid: 07fe56e93892cd84fa65305d3026b907, type: 3}
      propertyPath: m_LocalPosition.y
      value: 0
      objectReference: {fileID: 0}
    - target: {fileID: 7441033873049970952, guid: 07fe56e93892cd84fa65305d3026b907, type: 3}
      propertyPath: m_LocalPosition.z
      value: 0
      objectReference: {fileID: 0}
    - target: {fileID: 7441033873049970952, guid: 07fe56e93892cd84fa65305d3026b907, type: 3}
      propertyPath: m_LocalRotation.w
      value: 1
      objectReference: {fileID: 0}
    - target: {fileID: 7441033873049970952, guid: 07fe56e93892cd84fa65305d3026b907, type: 3}
      propertyPath: m_LocalRotation.x
      value: 0
      objectReference: {fileID: 0}
    - target: {fileID: 7441033873049970952, guid: 07fe56e93892cd84fa65305d3026b907, type: 3}
      propertyPath: m_LocalRotation.y
      value: -0
      objectReference: {fileID: 0}
    - target: {fileID: 7441033873049970952, guid: 07fe56e93892cd84fa65305d3026b907, type: 3}
      propertyPath: m_LocalRotation.z
      value: -0
      objectReference: {fileID: 0}
    - target: {fileID: 7441033873049970952, guid: 07fe56e93892cd84fa65305d3026b907, type: 3}
      propertyPath: m_LocalEulerAnglesHint.x
      value: 0
      objectReference: {fileID: 0}
    - target: {fileID: 7441033873049970952, guid: 07fe56e93892cd84fa65305d3026b907, type: 3}
      propertyPath: m_LocalEulerAnglesHint.y
      value: 0
      objectReference: {fileID: 0}
    - target: {fileID: 7441033873049970952, guid: 07fe56e93892cd84fa65305d3026b907, type: 3}
      propertyPath: m_LocalEulerAnglesHint.z
      value: 0
      objectReference: {fileID: 0}
    - target: {fileID: 7784485487313073074, guid: 07fe56e93892cd84fa65305d3026b907, type: 3}
      propertyPath: m_Name
      value: PlatformBorder00_2.5 Variant
      objectReference: {fileID: 0}
    - target: {fileID: 7784485487313073074, guid: 07fe56e93892cd84fa65305d3026b907, type: 3}
      propertyPath: m_StaticEditorFlags
      value: 2147483647
      objectReference: {fileID: 0}
    m_RemovedComponents: []
  m_SourcePrefab: {fileID: 100100000, guid: 07fe56e93892cd84fa65305d3026b907, type: 3}
--- !u!4 &4724074041427929848 stripped
Transform:
  m_CorrespondingSourceObject: {fileID: 7441033873049970952, guid: 07fe56e93892cd84fa65305d3026b907, type: 3}
  m_PrefabInstance: {fileID: 2795772942246364144}
  m_PrefabAsset: {fileID: 0}
--- !u!1001 &3653188648990957697
PrefabInstance:
  m_ObjectHideFlags: 0
  serializedVersion: 2
  m_Modification:
    m_TransformParent: {fileID: 6184999515697399353}
    m_Modifications:
    - target: {fileID: 4992400822530075860, guid: f72e9bc37a71dd645a5fe09ed7a4535e, type: 3}
      propertyPath: m_RootOrder
      value: 0
      objectReference: {fileID: 0}
    - target: {fileID: 4992400822530075860, guid: f72e9bc37a71dd645a5fe09ed7a4535e, type: 3}
      propertyPath: m_LocalScale.y
      value: -1
      objectReference: {fileID: 0}
    - target: {fileID: 4992400822530075860, guid: f72e9bc37a71dd645a5fe09ed7a4535e, type: 3}
      propertyPath: m_LocalPosition.x
      value: 0
      objectReference: {fileID: 0}
    - target: {fileID: 4992400822530075860, guid: f72e9bc37a71dd645a5fe09ed7a4535e, type: 3}
      propertyPath: m_LocalPosition.y
      value: 0
      objectReference: {fileID: 0}
    - target: {fileID: 4992400822530075860, guid: f72e9bc37a71dd645a5fe09ed7a4535e, type: 3}
      propertyPath: m_LocalPosition.z
      value: 0
      objectReference: {fileID: 0}
    - target: {fileID: 4992400822530075860, guid: f72e9bc37a71dd645a5fe09ed7a4535e, type: 3}
      propertyPath: m_LocalRotation.w
      value: 1
      objectReference: {fileID: 0}
    - target: {fileID: 4992400822530075860, guid: f72e9bc37a71dd645a5fe09ed7a4535e, type: 3}
      propertyPath: m_LocalRotation.x
      value: -0
      objectReference: {fileID: 0}
    - target: {fileID: 4992400822530075860, guid: f72e9bc37a71dd645a5fe09ed7a4535e, type: 3}
      propertyPath: m_LocalRotation.y
      value: -0
      objectReference: {fileID: 0}
    - target: {fileID: 4992400822530075860, guid: f72e9bc37a71dd645a5fe09ed7a4535e, type: 3}
      propertyPath: m_LocalRotation.z
      value: -0
      objectReference: {fileID: 0}
    - target: {fileID: 4992400822530075860, guid: f72e9bc37a71dd645a5fe09ed7a4535e, type: 3}
      propertyPath: m_LocalEulerAnglesHint.x
      value: 0
      objectReference: {fileID: 0}
    - target: {fileID: 4992400822530075860, guid: f72e9bc37a71dd645a5fe09ed7a4535e, type: 3}
      propertyPath: m_LocalEulerAnglesHint.y
      value: 0
      objectReference: {fileID: 0}
    - target: {fileID: 4992400822530075860, guid: f72e9bc37a71dd645a5fe09ed7a4535e, type: 3}
      propertyPath: m_LocalEulerAnglesHint.z
      value: 0
      objectReference: {fileID: 0}
    - target: {fileID: 5621410102796203630, guid: f72e9bc37a71dd645a5fe09ed7a4535e, type: 3}
      propertyPath: m_Name
      value: PlatformBorder00b_2.5 Variant
      objectReference: {fileID: 0}
    - target: {fileID: 5621410102796203630, guid: f72e9bc37a71dd645a5fe09ed7a4535e, type: 3}
      propertyPath: m_StaticEditorFlags
      value: 2147483647
      objectReference: {fileID: 0}
    m_RemovedComponents: []
  m_SourcePrefab: {fileID: 100100000, guid: f72e9bc37a71dd645a5fe09ed7a4535e, type: 3}
--- !u!4 &8645268203672276053 stripped
Transform:
  m_CorrespondingSourceObject: {fileID: 4992400822530075860, guid: f72e9bc37a71dd645a5fe09ed7a4535e, type: 3}
  m_PrefabInstance: {fileID: 3653188648990957697}
  m_PrefabAsset: {fileID: 0}
