%YAML 1.1
%TAG !u! tag:unity3d.com,2011:
--- !u!1 &1378164454015539154
GameObject:
  m_ObjectHideFlags: 0
  m_CorrespondingSourceObject: {fileID: 0}
  m_PrefabInstance: {fileID: 0}
  m_PrefabAsset: {fileID: 0}
  serializedVersion: 6
  m_Component:
  - component: {fileID: 1403920618368680468}
  m_Layer: 0
  m_Name: FloatingPlatform00_5Corner_Fenced
  m_TagString: Untagged
  m_Icon: {fileID: 0}
  m_NavMeshLayer: 0
  m_StaticEditorFlags: 0
  m_IsActive: 1
--- !u!4 &1403920618368680468
Transform:
  m_ObjectHideFlags: 0
  m_CorrespondingSourceObject: {fileID: 0}
  m_PrefabInstance: {fileID: 0}
  m_PrefabAsset: {fileID: 0}
  m_GameObject: {fileID: 1378164454015539154}
  m_LocalRotation: {x: 0, y: 0, z: 0, w: 1}
  m_LocalPosition: {x: 0, y: 0, z: 0}
  m_LocalScale: {x: 1, y: 1, z: 1}
  m_ConstrainProportionsScale: 0
  m_Children:
  - {fileID: 8875215334986663620}
  - {fileID: 6147072218516162328}
  m_Father: {fileID: 0}
  m_RootOrder: 0
  m_LocalEulerAnglesHint: {x: 0, y: 0, z: 0}
--- !u!1001 &7395685100811035300
PrefabInstance:
  m_ObjectHideFlags: 0
  serializedVersion: 2
  m_Modification:
    m_TransformParent: {fileID: 1403920618368680468}
    m_Modifications:
    - target: {fileID: 112475116000986775, guid: 21fdc8f23e2a6a54594b1500187e42ac, type: 3}
      propertyPath: m_StaticEditorFlags
      value: 0
      objectReference: {fileID: 0}
    - target: {fileID: 560326505390527450, guid: 21fdc8f23e2a6a54594b1500187e42ac, type: 3}
      propertyPath: m_StaticEditorFlags
      value: 0
      objectReference: {fileID: 0}
    - target: {fileID: 2248552566372950379, guid: 21fdc8f23e2a6a54594b1500187e42ac, type: 3}
      propertyPath: m_StaticEditorFlags
      value: 0
      objectReference: {fileID: 0}
    - target: {fileID: 3741376348798166435, guid: 21fdc8f23e2a6a54594b1500187e42ac, type: 3}
      propertyPath: m_Name
      value: FenceCrystal_Border00_5Corner
      objectReference: {fileID: 0}
    - target: {fileID: 3741376348798166435, guid: 21fdc8f23e2a6a54594b1500187e42ac, type: 3}
      propertyPath: m_StaticEditorFlags
      value: 0
      objectReference: {fileID: 0}
    - target: {fileID: 3741376348798166460, guid: 21fdc8f23e2a6a54594b1500187e42ac, type: 3}
      propertyPath: m_RootOrder
      value: 1
      objectReference: {fileID: 0}
    - target: {fileID: 3741376348798166460, guid: 21fdc8f23e2a6a54594b1500187e42ac, type: 3}
      propertyPath: m_LocalPosition.x
      value: 0
      objectReference: {fileID: 0}
    - target: {fileID: 3741376348798166460, guid: 21fdc8f23e2a6a54594b1500187e42ac, type: 3}
      propertyPath: m_LocalPosition.y
      value: 1
      objectReference: {fileID: 0}
    - target: {fileID: 3741376348798166460, guid: 21fdc8f23e2a6a54594b1500187e42ac, type: 3}
      propertyPath: m_LocalPosition.z
      value: -4.5
      objectReference: {fileID: 0}
    - target: {fileID: 3741376348798166460, guid: 21fdc8f23e2a6a54594b1500187e42ac, type: 3}
      propertyPath: m_LocalRotation.w
      value: 1
      objectReference: {fileID: 0}
    - target: {fileID: 3741376348798166460, guid: 21fdc8f23e2a6a54594b1500187e42ac, type: 3}
      propertyPath: m_LocalRotation.x
      value: 0
      objectReference: {fileID: 0}
    - target: {fileID: 3741376348798166460, guid: 21fdc8f23e2a6a54594b1500187e42ac, type: 3}
      propertyPath: m_LocalRotation.y
      value: 0
      objectReference: {fileID: 0}
    - target: {fileID: 3741376348798166460, guid: 21fdc8f23e2a6a54594b1500187e42ac, type: 3}
      propertyPath: m_LocalRotation.z
      value: 0
      objectReference: {fileID: 0}
    - target: {fileID: 3741376348798166460, guid: 21fdc8f23e2a6a54594b1500187e42ac, type: 3}
      propertyPath: m_LocalEulerAnglesHint.x
      value: 0
      objectReference: {fileID: 0}
    - target: {fileID: 3741376348798166460, guid: 21fdc8f23e2a6a54594b1500187e42ac, type: 3}
      propertyPath: m_LocalEulerAnglesHint.y
      value: 0
      objectReference: {fileID: 0}
    - target: {fileID: 3741376348798166460, guid: 21fdc8f23e2a6a54594b1500187e42ac, type: 3}
      propertyPath: m_LocalEulerAnglesHint.z
      value: 0
      objectReference: {fileID: 0}
    - target: {fileID: 4414655638123360143, guid: 21fdc8f23e2a6a54594b1500187e42ac, type: 3}
      propertyPath: m_StaticEditorFlags
      value: 0
      objectReference: {fileID: 0}
    - target: {fileID: 4552400517597860311, guid: 21fdc8f23e2a6a54594b1500187e42ac, type: 3}
      propertyPath: m_StaticEditorFlags
      value: 0
      objectReference: {fileID: 0}
    - target: {fileID: 6741541190796670950, guid: 21fdc8f23e2a6a54594b1500187e42ac, type: 3}
      propertyPath: m_StaticEditorFlags
      value: 0
      objectReference: {fileID: 0}
    m_RemovedComponents: []
  m_SourcePrefab: {fileID: 100100000, guid: 21fdc8f23e2a6a54594b1500187e42ac, type: 3}
--- !u!4 &6147072218516162328 stripped
Transform:
  m_CorrespondingSourceObject: {fileID: 3741376348798166460, guid: 21fdc8f23e2a6a54594b1500187e42ac, type: 3}
  m_PrefabInstance: {fileID: 7395685100811035300}
  m_PrefabAsset: {fileID: 0}
--- !u!1001 &8171021193047701028
PrefabInstance:
  m_ObjectHideFlags: 0
  serializedVersion: 2
  m_Modification:
    m_TransformParent: {fileID: 1403920618368680468}
    m_Modifications:
    - target: {fileID: 742624621755445472, guid: 1de1542ed57385e4190e11d26cf7c7af, type: 3}
      propertyPath: m_RootOrder
      value: 0
      objectReference: {fileID: 0}
    - target: {fileID: 742624621755445472, guid: 1de1542ed57385e4190e11d26cf7c7af, type: 3}
      propertyPath: m_LocalScale.y
      value: -1
      objectReference: {fileID: 0}
    - target: {fileID: 742624621755445472, guid: 1de1542ed57385e4190e11d26cf7c7af, type: 3}
      propertyPath: m_LocalPosition.x
      value: 0
      objectReference: {fileID: 0}
    - target: {fileID: 742624621755445472, guid: 1de1542ed57385e4190e11d26cf7c7af, type: 3}
      propertyPath: m_LocalPosition.y
      value: 0
      objectReference: {fileID: 0}
    - target: {fileID: 742624621755445472, guid: 1de1542ed57385e4190e11d26cf7c7af, type: 3}
      propertyPath: m_LocalPosition.z
      value: 0
      objectReference: {fileID: 0}
    - target: {fileID: 742624621755445472, guid: 1de1542ed57385e4190e11d26cf7c7af, type: 3}
      propertyPath: m_LocalRotation.w
      value: 1
      objectReference: {fileID: 0}
    - target: {fileID: 742624621755445472, guid: 1de1542ed57385e4190e11d26cf7c7af, type: 3}
      propertyPath: m_LocalRotation.x
      value: -0
      objectReference: {fileID: 0}
    - target: {fileID: 742624621755445472, guid: 1de1542ed57385e4190e11d26cf7c7af, type: 3}
      propertyPath: m_LocalRotation.y
      value: -0
      objectReference: {fileID: 0}
    - target: {fileID: 742624621755445472, guid: 1de1542ed57385e4190e11d26cf7c7af, type: 3}
      propertyPath: m_LocalRotation.z
      value: -0
      objectReference: {fileID: 0}
    - target: {fileID: 742624621755445472, guid: 1de1542ed57385e4190e11d26cf7c7af, type: 3}
      propertyPath: m_LocalEulerAnglesHint.x
      value: 0
      objectReference: {fileID: 0}
    - target: {fileID: 742624621755445472, guid: 1de1542ed57385e4190e11d26cf7c7af, type: 3}
      propertyPath: m_LocalEulerAnglesHint.y
      value: 0
      objectReference: {fileID: 0}
    - target: {fileID: 742624621755445472, guid: 1de1542ed57385e4190e11d26cf7c7af, type: 3}
      propertyPath: m_LocalEulerAnglesHint.z
      value: 0
      objectReference: {fileID: 0}
    - target: {fileID: 5261335555470814643, guid: 1de1542ed57385e4190e11d26cf7c7af, type: 3}
      propertyPath: m_Name
      value: FloatingPlatform00_5Corner
      objectReference: {fileID: 0}
    m_RemovedComponents: []
  m_SourcePrefab: {fileID: 100100000, guid: 1de1542ed57385e4190e11d26cf7c7af, type: 3}
--- !u!4 &8875215334986663620 stripped
Transform:
  m_CorrespondingSourceObject: {fileID: 742624621755445472, guid: 1de1542ed57385e4190e11d26cf7c7af, type: 3}
  m_PrefabInstance: {fileID: 8171021193047701028}
  m_PrefabAsset: {fileID: 0}
