%YAML 1.1
%TAG !u! tag:unity3d.com,2011:
--- !u!1 &5261335555470814643
GameObject:
  m_ObjectHideFlags: 0
  m_CorrespondingSourceObject: {fileID: 0}
  m_PrefabInstance: {fileID: 0}
  m_PrefabAsset: {fileID: 0}
  serializedVersion: 6
  m_Component:
  - component: {fileID: 742624621755445472}
  m_Layer: 0
  m_Name: FloatingPlatform00_5Corner
  m_TagString: Untagged
  m_Icon: {fileID: 0}
  m_NavMeshLayer: 0
  m_StaticEditorFlags: 2147483647
  m_IsActive: 1
--- !u!4 &742624621755445472
Transform:
  m_ObjectHideFlags: 0
  m_CorrespondingSourceObject: {fileID: 0}
  m_PrefabInstance: {fileID: 0}
  m_PrefabAsset: {fileID: 0}
  m_GameObject: {fileID: 5261335555470814643}
  m_LocalRotation: {x: 0, y: 0, z: 0, w: 1}
  m_LocalPosition: {x: 0, y: 0, z: 0}
  m_LocalScale: {x: 1, y: 1, z: 1}
  m_ConstrainProportionsScale: 0
  m_Children:
  - {fileID: 2690954593311807561}
  - {fileID: 1965260627683649956}
  m_Father: {fileID: 0}
  m_RootOrder: 0
  m_LocalEulerAnglesHint: {x: 0, y: 0, z: 0}
--- !u!1001 &1235036480236362245
PrefabInstance:
  m_ObjectHideFlags: 0
  serializedVersion: 2
  m_Modification:
    m_TransformParent: {fileID: 742624621755445472}
    m_Modifications:
    - target: {fileID: 85121642765117723, guid: 746dab75c6165ae48b03b3f72be49f11, type: 3}
      propertyPath: m_Name
      value: PlatformBorder00_5Corner Variant
      objectReference: {fileID: 0}
    - target: {fileID: 85121642765117723, guid: 746dab75c6165ae48b03b3f72be49f11, type: 3}
      propertyPath: m_StaticEditorFlags
      value: 2147483647
      objectReference: {fileID: 0}
    - target: {fileID: 749208332426163105, guid: 746dab75c6165ae48b03b3f72be49f11, type: 3}
      propertyPath: m_RootOrder
      value: 1
      objectReference: {fileID: 0}
    - target: {fileID: 749208332426163105, guid: 746dab75c6165ae48b03b3f72be49f11, type: 3}
      propertyPath: m_LocalPosition.x
      value: 0
      objectReference: {fileID: 0}
    - target: {fileID: 749208332426163105, guid: 746dab75c6165ae48b03b3f72be49f11, type: 3}
      propertyPath: m_LocalPosition.y
      value: 0
      objectReference: {fileID: 0}
    - target: {fileID: 749208332426163105, guid: 746dab75c6165ae48b03b3f72be49f11, type: 3}
      propertyPath: m_LocalPosition.z
      value: 0
      objectReference: {fileID: 0}
    - target: {fileID: 749208332426163105, guid: 746dab75c6165ae48b03b3f72be49f11, type: 3}
      propertyPath: m_LocalRotation.w
      value: 1
      objectReference: {fileID: 0}
    - target: {fileID: 749208332426163105, guid: 746dab75c6165ae48b03b3f72be49f11, type: 3}
      propertyPath: m_LocalRotation.x
      value: 0
      objectReference: {fileID: 0}
    - target: {fileID: 749208332426163105, guid: 746dab75c6165ae48b03b3f72be49f11, type: 3}
      propertyPath: m_LocalRotation.y
      value: -0
      objectReference: {fileID: 0}
    - target: {fileID: 749208332426163105, guid: 746dab75c6165ae48b03b3f72be49f11, type: 3}
      propertyPath: m_LocalRotation.z
      value: -0
      objectReference: {fileID: 0}
    - target: {fileID: 749208332426163105, guid: 746dab75c6165ae48b03b3f72be49f11, type: 3}
      propertyPath: m_LocalEulerAnglesHint.x
      value: 0
      objectReference: {fileID: 0}
    - target: {fileID: 749208332426163105, guid: 746dab75c6165ae48b03b3f72be49f11, type: 3}
      propertyPath: m_LocalEulerAnglesHint.y
      value: 0
      objectReference: {fileID: 0}
    - target: {fileID: 749208332426163105, guid: 746dab75c6165ae48b03b3f72be49f11, type: 3}
      propertyPath: m_LocalEulerAnglesHint.z
      value: 0
      objectReference: {fileID: 0}
    m_RemovedComponents: []
  m_SourcePrefab: {fileID: 100100000, guid: 746dab75c6165ae48b03b3f72be49f11, type: 3}
--- !u!4 &1965260627683649956 stripped
Transform:
  m_CorrespondingSourceObject: {fileID: 749208332426163105, guid: 746dab75c6165ae48b03b3f72be49f11, type: 3}
  m_PrefabInstance: {fileID: 1235036480236362245}
  m_PrefabAsset: {fileID: 0}
--- !u!1001 &5488404872302251479
PrefabInstance:
  m_ObjectHideFlags: 0
  serializedVersion: 2
  m_Modification:
    m_TransformParent: {fileID: 742624621755445472}
    m_Modifications:
    - target: {fileID: 7077788867166162724, guid: 900b711fc5c845741bf45088dc740620, type: 3}
      propertyPath: m_Name
      value: PlatformBorder00b_5Corner Variant
      objectReference: {fileID: 0}
    - target: {fileID: 7077788867166162724, guid: 900b711fc5c845741bf45088dc740620, type: 3}
      propertyPath: m_StaticEditorFlags
      value: 2147483647
      objectReference: {fileID: 0}
    - target: {fileID: 7598289268474582430, guid: 900b711fc5c845741bf45088dc740620, type: 3}
      propertyPath: m_RootOrder
      value: 0
      objectReference: {fileID: 0}
    - target: {fileID: 7598289268474582430, guid: 900b711fc5c845741bf45088dc740620, type: 3}
      propertyPath: m_LocalScale.y
      value: -1
      objectReference: {fileID: 0}
    - target: {fileID: 7598289268474582430, guid: 900b711fc5c845741bf45088dc740620, type: 3}
      propertyPath: m_LocalPosition.x
      value: 0
      objectReference: {fileID: 0}
    - target: {fileID: 7598289268474582430, guid: 900b711fc5c845741bf45088dc740620, type: 3}
      propertyPath: m_LocalPosition.y
      value: 0
      objectReference: {fileID: 0}
    - target: {fileID: 7598289268474582430, guid: 900b711fc5c845741bf45088dc740620, type: 3}
      propertyPath: m_LocalPosition.z
      value: 0
      objectReference: {fileID: 0}
    - target: {fileID: 7598289268474582430, guid: 900b711fc5c845741bf45088dc740620, type: 3}
      propertyPath: m_LocalRotation.w
      value: 1
      objectReference: {fileID: 0}
    - target: {fileID: 7598289268474582430, guid: 900b711fc5c845741bf45088dc740620, type: 3}
      propertyPath: m_LocalRotation.x
      value: 0
      objectReference: {fileID: 0}
    - target: {fileID: 7598289268474582430, guid: 900b711fc5c845741bf45088dc740620, type: 3}
      propertyPath: m_LocalRotation.y
      value: -0
      objectReference: {fileID: 0}
    - target: {fileID: 7598289268474582430, guid: 900b711fc5c845741bf45088dc740620, type: 3}
      propertyPath: m_LocalRotation.z
      value: -0
      objectReference: {fileID: 0}
    - target: {fileID: 7598289268474582430, guid: 900b711fc5c845741bf45088dc740620, type: 3}
      propertyPath: m_LocalEulerAnglesHint.x
      value: 0
      objectReference: {fileID: 0}
    - target: {fileID: 7598289268474582430, guid: 900b711fc5c845741bf45088dc740620, type: 3}
      propertyPath: m_LocalEulerAnglesHint.y
      value: 0
      objectReference: {fileID: 0}
    - target: {fileID: 7598289268474582430, guid: 900b711fc5c845741bf45088dc740620, type: 3}
      propertyPath: m_LocalEulerAnglesHint.z
      value: 0
      objectReference: {fileID: 0}
    m_RemovedComponents: []
  m_SourcePrefab: {fileID: 100100000, guid: 900b711fc5c845741bf45088dc740620, type: 3}
--- !u!4 &2690954593311807561 stripped
Transform:
  m_CorrespondingSourceObject: {fileID: 7598289268474582430, guid: 900b711fc5c845741bf45088dc740620, type: 3}
  m_PrefabInstance: {fileID: 5488404872302251479}
  m_PrefabAsset: {fileID: 0}
