%YAML 1.1
%TAG !u! tag:unity3d.com,2011:
--- !u!114 &11400000
MonoBehaviour:
  m_ObjectHideFlags: 0
  m_CorrespondingSourceObject: {fileID: 0}
  m_PrefabInstance: {fileID: 0}
  m_PrefabAsset: {fileID: 0}
  m_GameObject: {fileID: 0}
  m_Enabled: 1
  m_EditorHideFlags: 0
  m_Script: {fileID: 11500000, guid: 03f9522b1b0f53b4c87d047ac5c3794f, type: 3}
  m_Name: All_woman_DashForward
  m_EditorClassIdentifier: 
  gameplayType: 0
  animMap:
    animationMaps:
    - frame: 0
      hitBoxMaps:
      - bodyPart: 1
        mappedPosition:
          x:
            _serializedValue: 4969609216
          y:
            _serializedValue: 17978433536
          z:
            _serializedValue: -1636105216
      - bodyPart: 2
        mappedPosition:
          x:
            _serializedValue: 1468828928
          y:
            _serializedValue: 16900692992
          z:
            _serializedValue: -427145536
      - bodyPart: 3
        mappedPosition:
          x:
            _serializedValue: -2120471040
          y:
            _serializedValue: 14087645184
          z:
            _serializedValue: 624525184
      - bodyPart: 4
        mappedPosition:
          x:
            _serializedValue: 3702667776
          y:
            _serializedValue: 17195913216
          z:
            _serializedValue: 1593019392
      - bodyPart: 5
        mappedPosition:
          x:
            _serializedValue: 1895051648
          y:
            _serializedValue: 19033837568
          z:
            _serializedValue: -2366079488
      - bodyPart: 6
        mappedPosition:
          x:
            _serializedValue: 279744512
          y:
            _serializedValue: 16023528448
          z:
            _serializedValue: 2961025536
      - bodyPart: 7
        mappedPosition:
          x:
            _serializedValue: -1845693056
          y:
            _serializedValue: 19015858176
          z:
            _serializedValue: -1381693440
      - bodyPart: 8
        mappedPosition:
          x:
            _serializedValue: -2560759040
          y:
            _serializedValue: 14624047104
          z:
            _serializedValue: 4145563648
      - bodyPart: 9
        mappedPosition:
          x:
            _serializedValue: -5058682368
          y:
            _serializedValue: 18132727808
          z:
            _serializedValue: -809963008
      - bodyPart: 10
        mappedPosition:
          x:
            _serializedValue: -1798085248
          y:
            _serializedValue: 12211687424
          z:
            _serializedValue: 1770200320
      - bodyPart: 11
        mappedPosition:
          x:
            _serializedValue: -2543845120
          y:
            _serializedValue: 12390923264
          z:
            _serializedValue: -745701376
      - bodyPart: 12
        mappedPosition:
          x:
            _serializedValue: -4046406912
          y:
            _serializedValue: 6449837568
          z:
            _serializedValue: 2397991424
      - bodyPart: 13
        mappedPosition:
          x:
            _serializedValue: 2981019392
          y:
            _serializedValue: 9981796352
          z:
            _serializedValue: -2268976640
      - bodyPart: 14
        mappedPosition:
          x:
            _serializedValue: -7708269568
          y:
            _serializedValue: 11025363968
          z:
            _serializedValue: 2730838528
      - bodyPart: 15
        mappedPosition:
          x:
            _serializedValue: 3629370880
          y:
            _serializedValue: 4225855232
          z:
            _serializedValue: -1317937664
      - bodyPart: 0
        mappedPosition:
          x:
            _serializedValue: -2244712192
          y:
            _serializedValue: 12511033344
          z:
            _serializedValue: 549048064
      deltaDisplacement:
        x:
          _serializedValue: 0
        y:
          _serializedValue: 0
        z:
          _serializedValue: 0
    - frame: 1
      hitBoxMaps:
      - bodyPart: 1
        mappedPosition:
          x:
            _serializedValue: 4905781248
          y:
            _serializedValue: 17882855424
          z:
            _serializedValue: -1777548288
      - bodyPart: 2
        mappedPosition:
          x:
            _serializedValue: 1406396928
          y:
            _serializedValue: 16799706112
          z:
            _serializedValue: -569386496
      - bodyPart: 3
        mappedPosition:
          x:
            _serializedValue: -2194657024
          y:
            _serializedValue: 13996698624
          z:
            _serializedValue: 484726272
      - bodyPart: 4
        mappedPosition:
          x:
            _serializedValue: 3701792256
          y:
            _serializedValue: 17133899776
          z:
            _serializedValue: 1437974016
      - bodyPart: 5
        mappedPosition:
          x:
            _serializedValue: 1877232896
          y:
            _serializedValue: 18924529664
          z:
            _serializedValue: -2579609344
      - bodyPart: 6
        mappedPosition:
          x:
            _serializedValue: 248605088
          y:
            _serializedValue: 16090616832
          z:
            _serializedValue: 2834183936
      - bodyPart: 7
        mappedPosition:
          x:
            _serializedValue: -1850690816
          y:
            _serializedValue: 18992367616
          z:
            _serializedValue: -1549814656
      - bodyPart: 8
        mappedPosition:
          x:
            _serializedValue: -2637119232
          y:
            _serializedValue: 14819385344
          z:
            _serializedValue: 4053480704
      - bodyPart: 9
        mappedPosition:
          x:
            _serializedValue: -5077035520
          y:
            _serializedValue: 18201350144
          z:
            _serializedValue: -921241088
      - bodyPart: 10
        mappedPosition:
          x:
            _serializedValue: -1879299584
          y:
            _serializedValue: 12125322240
          z:
            _serializedValue: 1639816576
      - bodyPart: 11
        mappedPosition:
          x:
            _serializedValue: -2628385280
          y:
            _serializedValue: 12294772736
          z:
            _serializedValue: -875777536
      - bodyPart: 12
        mappedPosition:
          x:
            _serializedValue: -3578931200
          y:
            _serializedValue: 6173495296
          z:
            _serializedValue: 2218606592
      - bodyPart: 13
        mappedPosition:
          x:
            _serializedValue: 2599121664
          y:
            _serializedValue: 9216534528
          z:
            _serializedValue: -2234490112
      - bodyPart: 14
        mappedPosition:
          x:
            _serializedValue: -6976915456
          y:
            _serializedValue: 10946487296
          z:
            _serializedValue: 2575996928
      - bodyPart: 15
        mappedPosition:
          x:
            _serializedValue: 2120779776
          y:
            _serializedValue: 3555591168
          z:
            _serializedValue: -757799552
      - bodyPart: 0
        mappedPosition:
          x:
            _serializedValue: -2326528000
          y:
            _serializedValue: 12420319232
          z:
            _serializedValue: 417824256
      deltaDisplacement:
        x:
          _serializedValue: 0
        y:
          _serializedValue: 0
        z:
          _serializedValue: 0
    - frame: 2
      hitBoxMaps:
      - bodyPart: 1
        mappedPosition:
          x:
            _serializedValue: 4769945600
          y:
            _serializedValue: 17700429824
          z:
            _serializedValue: -1901231616
      - bodyPart: 2
        mappedPosition:
          x:
            _serializedValue: 1283402496
          y:
            _serializedValue: 16565541888
          z:
            _serializedValue: -703480768
      - bodyPart: 3
        mappedPosition:
          x:
            _serializedValue: -2312585984
          y:
            _serializedValue: 13743123456
          z:
            _serializedValue: 349442560
      - bodyPart: 4
        mappedPosition:
          x:
            _serializedValue: 3604617216
          y:
            _serializedValue: 17002404864
          z:
            _serializedValue: 1299454720
      - bodyPart: 5
        mappedPosition:
          x:
            _serializedValue: 1756846080
          y:
            _serializedValue: 18665648128
          z:
            _serializedValue: -2794731776
      - bodyPart: 6
        mappedPosition:
          x:
            _serializedValue: 123558176
          y:
            _serializedValue: 16097460224
          z:
            _serializedValue: 2722699776
      - bodyPart: 7
        mappedPosition:
          x:
            _serializedValue: -1956119040
          y:
            _serializedValue: 18816751616
          z:
            _serializedValue: -1720704000
      - bodyPart: 8
        mappedPosition:
          x:
            _serializedValue: -2810760448
          y:
            _serializedValue: 14993370112
          z:
            _serializedValue: 3987958784
      - bodyPart: 9
        mappedPosition:
          x:
            _serializedValue: -5193806848
          y:
            _serializedValue: 18144788480
          z:
            _serializedValue: -1016461824
      - bodyPart: 10
        mappedPosition:
          x:
            _serializedValue: -1997724672
          y:
            _serializedValue: 11879353344
          z:
            _serializedValue: 1516899840
      - bodyPart: 11
        mappedPosition:
          x:
            _serializedValue: -2748547584
          y:
            _serializedValue: 12032375808
          z:
            _serializedValue: -999231488
      - bodyPart: 12
        mappedPosition:
          x:
            _serializedValue: -3039292160
          y:
            _serializedValue: 5777578496
          z:
            _serializedValue: 2092642176
      - bodyPart: 13
        mappedPosition:
          x:
            _serializedValue: 1987417728
          y:
            _serializedValue: 8168544256
          z:
            _serializedValue: -2134960384
      - bodyPart: 14
        mappedPosition:
          x:
            _serializedValue: -6186398720
          y:
            _serializedValue: 10722885632
          z:
            _serializedValue: 2401039616
      - bodyPart: 15
        mappedPosition:
          x:
            _serializedValue: 612339840
          y:
            _serializedValue: 2802766080
          z:
            _serializedValue: -192464448
      - bodyPart: 0
        mappedPosition:
          x:
            _serializedValue: -2445644032
          y:
            _serializedValue: 12166426624
          z:
            _serializedValue: 293273856
      deltaDisplacement:
        x:
          _serializedValue: 0
        y:
          _serializedValue: 0
        z:
          _serializedValue: 0
    - frame: 3
      hitBoxMaps:
      - bodyPart: 1
        mappedPosition:
          x:
            _serializedValue: 4588816384
          y:
            _serializedValue: 17491236864
          z:
            _serializedValue: -1998340096
      - bodyPart: 2
        mappedPosition:
          x:
            _serializedValue: 1123473408
          y:
            _serializedValue: 16273672192
          z:
            _serializedValue: -820421056
      - bodyPart: 3
        mappedPosition:
          x:
            _serializedValue: -2453389568
          y:
            _serializedValue: 13408805888
          z:
            _serializedValue: 222850816
      - bodyPart: 4
        mappedPosition:
          x:
            _serializedValue: 3422125568
          y:
            _serializedValue: 16843995136
          z:
            _serializedValue: 1188210688
      - bodyPart: 5
        mappedPosition:
          x:
            _serializedValue: 1555458048
          y:
            _serializedValue: 18338897920
          z:
            _serializedValue: -2978095616
      - bodyPart: 6
        mappedPosition:
          x:
            _serializedValue: -72795384
          y:
            _serializedValue: 16023646208
          z:
            _serializedValue: 2628655872
      - bodyPart: 7
        mappedPosition:
          x:
            _serializedValue: -2157447680
          y:
            _serializedValue: 18508777472
          z:
            _serializedValue: -1906663168
      - bodyPart: 8
        mappedPosition:
          x:
            _serializedValue: -3036223744
          y:
            _serializedValue: 15053932544
          z:
            _serializedValue: 3935511808
      - bodyPart: 9
        mappedPosition:
          x:
            _serializedValue: -5402569728
          y:
            _serializedValue: 17914554368
          z:
            _serializedValue: -1167609856
      - bodyPart: 10
        mappedPosition:
          x:
            _serializedValue: -2132588800
          y:
            _serializedValue: 11553890304
          z:
            _serializedValue: 1402727296
      - bodyPart: 11
        mappedPosition:
          x:
            _serializedValue: -2882444800
          y:
            _serializedValue: 11687676928
          z:
            _serializedValue: -1114786304
      - bodyPart: 12
        mappedPosition:
          x:
            _serializedValue: -2298296832
          y:
            _serializedValue: 5370850304
          z:
            _serializedValue: 2027668992
      - bodyPart: 13
        mappedPosition:
          x:
            _serializedValue: 1521498112
          y:
            _serializedValue: 7403539968
          z:
            _serializedValue: -2063446016
      - bodyPart: 14
        mappedPosition:
          x:
            _serializedValue: -5370478592
          y:
            _serializedValue: 10369053696
          z:
            _serializedValue: 2215123456
      - bodyPart: 15
        mappedPosition:
          x:
            _serializedValue: -1159171200
          y:
            _serializedValue: 2756813056
          z:
            _serializedValue: 319332736
      - bodyPart: 0
        mappedPosition:
          x:
            _serializedValue: -2580794368
          y:
            _serializedValue: 11831307264
          z:
            _serializedValue: 176982016
      deltaDisplacement:
        x:
          _serializedValue: 0
        y:
          _serializedValue: 0
        z:
          _serializedValue: 0
    - frame: 4
      hitBoxMaps:
      - bodyPart: 1
        mappedPosition:
          x:
            _serializedValue: 4397379584
          y:
            _serializedValue: 17311322112
          z:
            _serializedValue: -2063540224
      - bodyPart: 2
        mappedPosition:
          x:
            _serializedValue: 957641280
          y:
            _serializedValue: 16000547840
          z:
            _serializedValue: -910868224
      - bodyPart: 3
        mappedPosition:
          x:
            _serializedValue: -2591311360
          y:
            _serializedValue: 13081744384
          z:
            _serializedValue: 115435520
      - bodyPart: 4
        mappedPosition:
          x:
            _serializedValue: 3189472768
          y:
            _serializedValue: 16708709376
          z:
            _serializedValue: 1110168832
      - bodyPart: 5
        mappedPosition:
          x:
            _serializedValue: 1314903808
          y:
            _serializedValue: 18020155392
          z:
            _serializedValue: -3115081216
      - bodyPart: 6
        mappedPosition:
          x:
            _serializedValue: -308839200
          y:
            _serializedValue: 15914451968
          z:
            _serializedValue: 2556995584
      - bodyPart: 7
        mappedPosition:
          x:
            _serializedValue: -2409052672
          y:
            _serializedValue: 18141122560
          z:
            _serializedValue: -2075848448
      - bodyPart: 8
        mappedPosition:
          x:
            _serializedValue: -3283523840
          y:
            _serializedValue: 15024958464
          z:
            _serializedValue: 3894966272
      - bodyPart: 9
        mappedPosition:
          x:
            _serializedValue: -5657576960
          y:
            _serializedValue: 17564440576
          z:
            _serializedValue: -1337854976
      - bodyPart: 10
        mappedPosition:
          x:
            _serializedValue: -2259723776
          y:
            _serializedValue: 11235936256
          z:
            _serializedValue: 1306560256
      - bodyPart: 11
        mappedPosition:
          x:
            _serializedValue: -3006291968
          y:
            _serializedValue: 11349997568
          z:
            _serializedValue: -1212903936
      - bodyPart: 12
        mappedPosition:
          x:
            _serializedValue: -1131557120
          y:
            _serializedValue: 5143343104
          z:
            _serializedValue: 1812061568
      - bodyPart: 13
        mappedPosition:
          x:
            _serializedValue: 702636608
          y:
            _serializedValue: 6397830656
          z:
            _serializedValue: -1819877888
      - bodyPart: 14
        mappedPosition:
          x:
            _serializedValue: -4541870080
          y:
            _serializedValue: 9916316672
          z:
            _serializedValue: 2021758464
      - bodyPart: 15
        mappedPosition:
          x:
            _serializedValue: -3003344896
          y:
            _serializedValue: 2694593792
          z:
            _serializedValue: 827280896
      - bodyPart: 0
        mappedPosition:
          x:
            _serializedValue: -2707786752
          y:
            _serializedValue: 11503168512
          z:
            _serializedValue: 78500608
      deltaDisplacement:
        x:
          _serializedValue: 0
        y:
          _serializedValue: 0
        z:
          _serializedValue: 0
    - frame: 5
      hitBoxMaps:
      - bodyPart: 1
        mappedPosition:
          x:
            _serializedValue: 4236551936
          y:
            _serializedValue: 17212401664
          z:
            _serializedValue: -2104879744
      - bodyPart: 2
        mappedPosition:
          x:
            _serializedValue: 820690880
          y:
            _serializedValue: 15821754368
          z:
            _serializedValue: -975029568
      - bodyPart: 3
        mappedPosition:
          x:
            _serializedValue: -2699638784
          y:
            _serializedValue: 12852812800
          z:
            _serializedValue: 33348608
      - bodyPart: 4
        mappedPosition:
          x:
            _serializedValue: 2962094592
          y:
            _serializedValue: 16658487296
          z:
            _serializedValue: 1056065536
      - bodyPart: 5
        mappedPosition:
          x:
            _serializedValue: 1094562048
          y:
            _serializedValue: 17780666368
          z:
            _serializedValue: -3216058368
      - bodyPart: 6
        mappedPosition:
          x:
            _serializedValue: -537794496
          y:
            _serializedValue: 15871178752
          z:
            _serializedValue: 2502871808
      - bodyPart: 7
        mappedPosition:
          x:
            _serializedValue: -2639472640
          y:
            _serializedValue: 17832810496
          z:
            _serializedValue: -2207712512
      - bodyPart: 8
        mappedPosition:
          x:
            _serializedValue: -3517257472
          y:
            _serializedValue: 15029621760
          z:
            _serializedValue: 3861073664
      - bodyPart: 9
        mappedPosition:
          x:
            _serializedValue: -5887585280
          y:
            _serializedValue: 17240719360
          z:
            _serializedValue: -1480175616
      - bodyPart: 10
        mappedPosition:
          x:
            _serializedValue: -2355311104
          y:
            _serializedValue: 11016101888
          z:
            _serializedValue: 1234872832
      - bodyPart: 11
        mappedPosition:
          x:
            _serializedValue: -3097528320
          y:
            _serializedValue: 11110729728
          z:
            _serializedValue: -1286677504
      - bodyPart: 12
        mappedPosition:
          x:
            _serializedValue: 731690048
          y:
            _serializedValue: 5620042752
          z:
            _serializedValue: 1204383232
      - bodyPart: 13
        mappedPosition:
          x:
            _serializedValue: -552119040
          y:
            _serializedValue: 5441256448
          z:
            _serializedValue: -1449199744
      - bodyPart: 14
        mappedPosition:
          x:
            _serializedValue: -3700756992
          y:
            _serializedValue: 9418793984
          z:
            _serializedValue: 1819495680
      - bodyPart: 15
        mappedPosition:
          x:
            _serializedValue: -4862222848
          y:
            _serializedValue: 2584104960
          z:
            _serializedValue: 1328459264
      - bodyPart: 0
        mappedPosition:
          x:
            _serializedValue: -2802998016
          y:
            _serializedValue: 11273153536
          z:
            _serializedValue: 4506880
      deltaDisplacement:
        x:
          _serializedValue: 0
        y:
          _serializedValue: 0
        z:
          _serializedValue: 0
    - frame: 6
      hitBoxMaps:
      - bodyPart: 1
        mappedPosition:
          x:
            _serializedValue: 4148183552
          y:
            _serializedValue: 17250594816
          z:
            _serializedValue: -2130735872
      - bodyPart: 2
        mappedPosition:
          x:
            _serializedValue: 746840832
          y:
            _serializedValue: 15813723136
          z:
            _serializedValue: -1015019584
      - bodyPart: 3
        mappedPosition:
          x:
            _serializedValue: -2751485184
          y:
            _serializedValue: 12810251264
          z:
            _serializedValue: -21603328
      - bodyPart: 4
        mappedPosition:
          x:
            _serializedValue: 2790670848
          y:
            _serializedValue: 16755299328
          z:
            _serializedValue: 1018091264
      - bodyPart: 5
        mappedPosition:
          x:
            _serializedValue: 943359424
          y:
            _serializedValue: 17698072576
          z:
            _serializedValue: -3283929856
      - bodyPart: 6
        mappedPosition:
          x:
            _serializedValue: -708969088
          y:
            _serializedValue: 15958004736
          z:
            _serializedValue: 2460021760
      - bodyPart: 7
        mappedPosition:
          x:
            _serializedValue: -2797875968
          y:
            _serializedValue: 17668546560
          z:
            _serializedValue: -2301701632
      - bodyPart: 8
        mappedPosition:
          x:
            _serializedValue: -3688632064
          y:
            _serializedValue: 15125939200
          z:
            _serializedValue: 3823619584
      - bodyPart: 9
        mappedPosition:
          x:
            _serializedValue: -6039991296
          y:
            _serializedValue: 17023419392
          z:
            _serializedValue: -1592745984
      - bodyPart: 10
        mappedPosition:
          x:
            _serializedValue: -2394120704
          y:
            _serializedValue: 10982038528
          z:
            _serializedValue: 1189041024
      - bodyPart: 11
        mappedPosition:
          x:
            _serializedValue: -3131910144
          y:
            _serializedValue: 11058837504
          z:
            _serializedValue: -1334410496
      - bodyPart: 12
        mappedPosition:
          x:
            _serializedValue: 2668916736
          y:
            _serializedValue: 7507415040
          z:
            _serializedValue: 219195392
      - bodyPart: 13
        mappedPosition:
          x:
            _serializedValue: -2250813440
          y:
            _serializedValue: 4915471872
          z:
            _serializedValue: -972254208
      - bodyPart: 14
        mappedPosition:
          x:
            _serializedValue: -2856401408
          y:
            _serializedValue: 8918988800
          z:
            _serializedValue: 1609797632
      - bodyPart: 15
        mappedPosition:
          x:
            _serializedValue: -6750855168
          y:
            _serializedValue: 2417982208
          z:
            _serializedValue: 1850488320
      - bodyPart: 0
        mappedPosition:
          x:
            _serializedValue: -2841426944
          y:
            _serializedValue: 11229658112
          z:
            _serializedValue: -43394304
      deltaDisplacement:
        x:
          _serializedValue: 0
        y:
          _serializedValue: 0
        z:
          _serializedValue: 0
    - frame: 7
      hitBoxMaps:
      - bodyPart: 1
        mappedPosition:
          x:
            _serializedValue: 4115017984
          y:
            _serializedValue: 17501349888
          z:
            _serializedValue: -2144956672
      - bodyPart: 2
        mappedPosition:
          x:
            _serializedValue: 719917632
          y:
            _serializedValue: 16048514048
          z:
            _serializedValue: -1030895680
      - bodyPart: 3
        mappedPosition:
          x:
            _serializedValue: -2737393408
          y:
            _serializedValue: 12999952384
          z:
            _serializedValue: -57831936
      - bodyPart: 4
        mappedPosition:
          x:
            _serializedValue: 2545174528
          y:
            _serializedValue: 17049651200
          z:
            _serializedValue: 1004012544
      - bodyPart: 5
        mappedPosition:
          x:
            _serializedValue: 734040384
          y:
            _serializedValue: 17818712064
          z:
            _serializedValue: -3224762880
      - bodyPart: 6
        mappedPosition:
          x:
            _serializedValue: -918988032
          y:
            _serializedValue: 16067468288
          z:
            _serializedValue: 2417242112
      - bodyPart: 7
        mappedPosition:
          x:
            _serializedValue: -3011479040
          y:
            _serializedValue: 17549504512
          z:
            _serializedValue: -2296802048
      - bodyPart: 8
        mappedPosition:
          x:
            _serializedValue: -3861564928
          y:
            _serializedValue: 15082213376
          z:
            _serializedValue: 3759121152
      - bodyPart: 9
        mappedPosition:
          x:
            _serializedValue: -6219573248
          y:
            _serializedValue: 16700224512
          z:
            _serializedValue: -1651077120
      - bodyPart: 10
        mappedPosition:
          x:
            _serializedValue: -2345635840
          y:
            _serializedValue: 11177101312
          z:
            _serializedValue: 1150252544
      - bodyPart: 11
        mappedPosition:
          x:
            _serializedValue: -3079164928
          y:
            _serializedValue: 11243652096
          z:
            _serializedValue: -1374735616
      - bodyPart: 12
        mappedPosition:
          x:
            _serializedValue: 3416261632
          y:
            _serializedValue: 9531705344
          z:
            _serializedValue: -505389824
      - bodyPart: 13
        mappedPosition:
          x:
            _serializedValue: -3218902016
          y:
            _serializedValue: 5058103808
          z:
            _serializedValue: -768189696
      - bodyPart: 14
        mappedPosition:
          x:
            _serializedValue: -2019965056
          y:
            _serializedValue: 8394804736
          z:
            _serializedValue: 1394706560
      - bodyPart: 15
        mappedPosition:
          x:
            _serializedValue: -7872487424
          y:
            _serializedValue: 3000833792
          z:
            _serializedValue: 2158842368
      - bodyPart: 0
        mappedPosition:
          x:
            _serializedValue: -2795117312
          y:
            _serializedValue: 11417903104
          z:
            _serializedValue: -82744576
      deltaDisplacement:
        x:
          _serializedValue: 0
        y:
          _serializedValue: 0
        z:
          _serializedValue: 0
    - frame: 8
      hitBoxMaps:
      - bodyPart: 1
        mappedPosition:
          x:
            _serializedValue: 4085177088
          y:
            _serializedValue: 17875406848
          z:
            _serializedValue: -2148186880
      - bodyPart: 2
        mappedPosition:
          x:
            _serializedValue: 700049920
          y:
            _serializedValue: 16403908608
          z:
            _serializedValue: -1028292544
      - bodyPart: 3
        mappedPosition:
          x:
            _serializedValue: -2683280640
          y:
            _serializedValue: 13282233344
          z:
            _serializedValue: -83349504
      - bodyPart: 4
        mappedPosition:
          x:
            _serializedValue: 2208187392
          y:
            _serializedValue: 17443727360
          z:
            _serializedValue: 974755840
      - bodyPart: 5
        mappedPosition:
          x:
            _serializedValue: 467585056
          y:
            _serializedValue: 18034767872
          z:
            _serializedValue: -3026645760
      - bodyPart: 6
        mappedPosition:
          x:
            _serializedValue: -1165279872
          y:
            _serializedValue: 16134572032
          z:
            _serializedValue: 2341560320
      - bodyPart: 7
        mappedPosition:
          x:
            _serializedValue: -3269711360
          y:
            _serializedValue: 17406369792
          z:
            _serializedValue: -2251902720
      - bodyPart: 8
        mappedPosition:
          x:
            _serializedValue: -4019257088
          y:
            _serializedValue: 14878964736
          z:
            _serializedValue: 3648614912
      - bodyPart: 9
        mappedPosition:
          x:
            _serializedValue: -6411405312
          y:
            _serializedValue: 16255045632
          z:
            _serializedValue: -1767836672
      - bodyPart: 10
        mappedPosition:
          x:
            _serializedValue: -2231913472
          y:
            _serializedValue: 11462167552
          z:
            _serializedValue: 1108018048
      - bodyPart: 11
        mappedPosition:
          x:
            _serializedValue: -2963797504
          y:
            _serializedValue: 11528070144
          z:
            _serializedValue: -1417462784
      - bodyPart: 12
        mappedPosition:
          x:
            _serializedValue: 3580962304
          y:
            _serializedValue: 10523222016
          z:
            _serializedValue: -886177280
      - bodyPart: 13
        mappedPosition:
          x:
            _serializedValue: -3394588160
          y:
            _serializedValue: 5352558592
          z:
            _serializedValue: -846619136
      - bodyPart: 14
        mappedPosition:
          x:
            _serializedValue: -1202047488
          y:
            _serializedValue: 7816887808
          z:
            _serializedValue: 1176350080
      - bodyPart: 15
        mappedPosition:
          x:
            _serializedValue: -7987187712
          y:
            _serializedValue: 3329390080
          z:
            _serializedValue: 2198133760
      - bodyPart: 0
        mappedPosition:
          x:
            _serializedValue: -2687567360
          y:
            _serializedValue: 11699446784
          z:
            _serializedValue: -123395328
      deltaDisplacement:
        x:
          _serializedValue: 0
        y:
          _serializedValue: 0
        z:
          _serializedValue: 0
    - frame: 9
      hitBoxMaps:
      - bodyPart: 1
        mappedPosition:
          x:
            _serializedValue: 4102062848
          y:
            _serializedValue: 18148614144
          z:
            _serializedValue: -2162319872
      - bodyPart: 2
        mappedPosition:
          x:
            _serializedValue: 722930944
          y:
            _serializedValue: 16669258752
          z:
            _serializedValue: -1034696256
      - bodyPart: 3
        mappedPosition:
          x:
            _serializedValue: -2613045248
          y:
            _serializedValue: 13505069056
          z:
            _serializedValue: -103557888
      - bodyPart: 4
        mappedPosition:
          x:
            _serializedValue: 2053407488
          y:
            _serializedValue: 17740269568
          z:
            _serializedValue: 923896704
      - bodyPart: 5
        mappedPosition:
          x:
            _serializedValue: 371247424
          y:
            _serializedValue: 18215067648
          z:
            _serializedValue: -2909223936
      - bodyPart: 6
        mappedPosition:
          x:
            _serializedValue: -1257827840
          y:
            _serializedValue: 16257116160
          z:
            _serializedValue: 2264897536
      - bodyPart: 7
        mappedPosition:
          x:
            _serializedValue: -3353554432
          y:
            _serializedValue: 17404329984
          z:
            _serializedValue: -2252676864
      - bodyPart: 8
        mappedPosition:
          x:
            _serializedValue: -4051637760
          y:
            _serializedValue: 14852639744
          z:
            _serializedValue: 3550284544
      - bodyPart: 9
        mappedPosition:
          x:
            _serializedValue: -6449897472
          y:
            _serializedValue: 16096295936
          z:
            _serializedValue: -1889616384
      - bodyPart: 10
        mappedPosition:
          x:
            _serializedValue: -2123616640
          y:
            _serializedValue: 11687633920
          z:
            _serializedValue: 1076746752
      - bodyPart: 11
        mappedPosition:
          x:
            _serializedValue: -2856694784
          y:
            _serializedValue: 11753582592
          z:
            _serializedValue: -1448387584
      - bodyPart: 12
        mappedPosition:
          x:
            _serializedValue: 3662840832
          y:
            _serializedValue: 10928113664
          z:
            _serializedValue: -1065211392
      - bodyPart: 13
        mappedPosition:
          x:
            _serializedValue: -4297692672
          y:
            _serializedValue: 5757203968
          z:
            _serializedValue: -663955968
      - bodyPart: 14
        mappedPosition:
          x:
            _serializedValue: -411406432
          y:
            _serializedValue: 7217440256
          z:
            _serializedValue: 956393344
      - bodyPart: 15
        mappedPosition:
          x:
            _serializedValue: -8857431040
          y:
            _serializedValue: 3777737728
          z:
            _serializedValue: 2457930752
      - bodyPart: 0
        mappedPosition:
          x:
            _serializedValue: -2584133376
          y:
            _serializedValue: 11922814976
          z:
            _serializedValue: -153259520
      deltaDisplacement:
        x:
          _serializedValue: 0
        y:
          _serializedValue: 0
        z:
          _serializedValue: 0
    - frame: 10
      hitBoxMaps:
      - bodyPart: 1
        mappedPosition:
          x:
            _serializedValue: 4188726784
          y:
            _serializedValue: 18253998080
          z:
            _serializedValue: -2207996160
      - bodyPart: 2
        mappedPosition:
          x:
            _serializedValue: 803723264
          y:
            _serializedValue: 16794956800
          z:
            _serializedValue: -1071559424
      - bodyPart: 3
        mappedPosition:
          x:
            _serializedValue: -2526077696
          y:
            _serializedValue: 13637286912
          z:
            _serializedValue: -109914624
      - bodyPart: 4
        mappedPosition:
          x:
            _serializedValue: 2106989312
          y:
            _serializedValue: 17924261888
          z:
            _serializedValue: 863725952
      - bodyPart: 5
        mappedPosition:
          x:
            _serializedValue: 461650688
          y:
            _serializedValue: 18294839296
          z:
            _serializedValue: -2985542912
      - bodyPart: 6
        mappedPosition:
          x:
            _serializedValue: -1211087360
          y:
            _serializedValue: 16455684096
          z:
            _serializedValue: 2203862016
      - bodyPart: 7
        mappedPosition:
          x:
            _serializedValue: -3263423488
          y:
            _serializedValue: 17486835712
          z:
            _serializedValue: -2327174912
      - bodyPart: 8
        mappedPosition:
          x:
            _serializedValue: -4004011264
          y:
            _serializedValue: 15039481856
          z:
            _serializedValue: 3478254592
      - bodyPart: 9
        mappedPosition:
          x:
            _serializedValue: -6351553536
          y:
            _serializedValue: 16157279232
          z:
            _serializedValue: -1972444672
      - bodyPart: 10
        mappedPosition:
          x:
            _serializedValue: -2033761792
          y:
            _serializedValue: 11824104448
          z:
            _serializedValue: 1075716224
      - bodyPart: 11
        mappedPosition:
          x:
            _serializedValue: -2767709696
          y:
            _serializedValue: 11881412608
          z:
            _serializedValue: -1449373952
      - bodyPart: 12
        mappedPosition:
          x:
            _serializedValue: 3757881344
          y:
            _serializedValue: 11203560448
          z:
            _serializedValue: -1096781568
      - bodyPart: 13
        mappedPosition:
          x:
            _serializedValue: -5613790208
          y:
            _serializedValue: 6481826816
          z:
            _serializedValue: -269270528
      - bodyPart: 14
        mappedPosition:
          x:
            _serializedValue: 374541344
          y:
            _serializedValue: 6762489856
          z:
            _serializedValue: 715776768
      - bodyPart: 15
        mappedPosition:
          x:
            _serializedValue: -10421062656
          y:
            _serializedValue: 4725983744
          z:
            _serializedValue: 2605244416
      - bodyPart: 0
        mappedPosition:
          x:
            _serializedValue: -2494983424
          y:
            _serializedValue: 12054932480
          z:
            _serializedValue: -154849024
      deltaDisplacement:
        x:
          _serializedValue: 0
        y:
          _serializedValue: 0
        z:
          _serializedValue: 0
    - frame: 11
      hitBoxMaps:
      - bodyPart: 1
        mappedPosition:
          x:
            _serializedValue: 4285835520
          y:
            _serializedValue: 18311241728
          z:
            _serializedValue: -2253135104
      - bodyPart: 2
        mappedPosition:
          x:
            _serializedValue: 889462912
          y:
            _serializedValue: 16886998016
          z:
            _serializedValue: -1106513920
      - bodyPart: 3
        mappedPosition:
          x:
            _serializedValue: -2439262976
          y:
            _serializedValue: 13749702656
          z:
            _serializedValue: -88014848
      - bodyPart: 4
        mappedPosition:
          x:
            _serializedValue: 2185229312
          y:
            _serializedValue: 18103402496
          z:
            _serializedValue: 800890880
      - bodyPart: 5
        mappedPosition:
          x:
            _serializedValue: 589820544
          y:
            _serializedValue: 18327947264
          z:
            _serializedValue: -3108202496
      - bodyPart: 6
        mappedPosition:
          x:
            _serializedValue: -1148956416
          y:
            _serializedValue: 16671680512
          z:
            _serializedValue: 2140939648
      - bodyPart: 7
        mappedPosition:
          x:
            _serializedValue: -3140158208
          y:
            _serializedValue: 17549455360
          z:
            _serializedValue: -2442100224
      - bodyPart: 8
        mappedPosition:
          x:
            _serializedValue: -3943343360
          y:
            _serializedValue: 15242292224
          z:
            _serializedValue: 3397275648
      - bodyPart: 9
        mappedPosition:
          x:
            _serializedValue: -6221505536
          y:
            _serializedValue: 16202005504
          z:
            _serializedValue: -2095969792
      - bodyPart: 10
        mappedPosition:
          x:
            _serializedValue: -1951016320
          y:
            _serializedValue: 11942164480
          z:
            _serializedValue: 1107873664
      - bodyPart: 11
        mappedPosition:
          x:
            _serializedValue: -2685730816
          y:
            _serializedValue: 11986745344
          z:
            _serializedValue: -1417251584
      - bodyPart: 12
        mappedPosition:
          x:
            _serializedValue: 3849898496
          y:
            _serializedValue: 11344148480
          z:
            _serializedValue: -1046126336
      - bodyPart: 13
        mappedPosition:
          x:
            _serializedValue: -6613433344
          y:
            _serializedValue: 7423895040
          z:
            _serializedValue: 166239232
      - bodyPart: 14
        mappedPosition:
          x:
            _serializedValue: 991920448
          y:
            _serializedValue: 6456920064
          z:
            _serializedValue: 503852928
      - bodyPart: 15
        mappedPosition:
          x:
            _serializedValue: -11647267840
          y:
            _serializedValue: 5702868992
          z:
            _serializedValue: 2665901056
      - bodyPart: 0
        mappedPosition:
          x:
            _serializedValue: -2412108288
          y:
            _serializedValue: 12167042048
          z:
            _serializedValue: -123841792
      deltaDisplacement:
        x:
          _serializedValue: 0
        y:
          _serializedValue: 0
        z:
          _serializedValue: 0
    - frame: 12
      hitBoxMaps:
      - bodyPart: 1
        mappedPosition:
          x:
            _serializedValue: 4376814592
          y:
            _serializedValue: 18331938816
          z:
            _serializedValue: -2253316608
      - bodyPart: 2
        mappedPosition:
          x:
            _serializedValue: 964916096
          y:
            _serializedValue: 16951688192
          z:
            _serializedValue: -1099013632
      - bodyPart: 3
        mappedPosition:
          x:
            _serializedValue: -2378531840
          y:
            _serializedValue: 13846714368
          z:
            _serializedValue: -40665088
      - bodyPart: 4
        mappedPosition:
          x:
            _serializedValue: 2292744704
          y:
            _serializedValue: 18220240896
          z:
            _serializedValue: 793431552
      - bodyPart: 5
        mappedPosition:
          x:
            _serializedValue: 721012480
          y:
            _serializedValue: 18356291584
          z:
            _serializedValue: -3185377024
      - bodyPart: 6
        mappedPosition:
          x:
            _serializedValue: -1060370560
          y:
            _serializedValue: 16836815872
          z:
            _serializedValue: 2136969344
      - bodyPart: 7
        mappedPosition:
          x:
            _serializedValue: -3015308800
          y:
            _serializedValue: 17619623936
          z:
            _serializedValue: -2507344640
      - bodyPart: 8
        mappedPosition:
          x:
            _serializedValue: -3855167488
          y:
            _serializedValue: 15392500736
          z:
            _serializedValue: 3375181056
      - bodyPart: 9
        mappedPosition:
          x:
            _serializedValue: -6089868288
          y:
            _serializedValue: 16254462976
          z:
            _serializedValue: -2170406400
      - bodyPart: 10
        mappedPosition:
          x:
            _serializedValue: -1900792576
          y:
            _serializedValue: 12042822656
          z:
            _serializedValue: 1164934400
      - bodyPart: 11
        mappedPosition:
          x:
            _serializedValue: -2635218944
          y:
            _serializedValue: 12078102528
          z:
            _serializedValue: -1360423168
      - bodyPart: 12
        mappedPosition:
          x:
            _serializedValue: 3892387328
          y:
            _serializedValue: 11260739584
          z:
            _serializedValue: -950572032
      - bodyPart: 13
        mappedPosition:
          x:
            _serializedValue: -6962040320
          y:
            _serializedValue: 7912587264
          z:
            _serializedValue: 273769984
      - bodyPart: 14
        mappedPosition:
          x:
            _serializedValue: 1492962688
          y:
            _serializedValue: 6051946496
          z:
            _serializedValue: 301111168
      - bodyPart: 15
        mappedPosition:
          x:
            _serializedValue: -12198587392
          y:
            _serializedValue: 6735285760
          z:
            _serializedValue: 2668140544
      - bodyPart: 0
        mappedPosition:
          x:
            _serializedValue: -2360562432
          y:
            _serializedValue: 12263752704
          z:
            _serializedValue: -67989504
      deltaDisplacement:
        x:
          _serializedValue: 0
        y:
          _serializedValue: 0
        z:
          _serializedValue: 0
    - frame: 13
      hitBoxMaps:
      - bodyPart: 1
        mappedPosition:
          x:
            _serializedValue: 4466900992
          y:
            _serializedValue: 18319962112
          z:
            _serializedValue: -2211081984
      - bodyPart: 2
        mappedPosition:
          x:
            _serializedValue: 1036024320
          y:
            _serializedValue: 16992448512
          z:
            _serializedValue: -1051187392
      - bodyPart: 3
        mappedPosition:
          x:
            _serializedValue: -2338968576
          y:
            _serializedValue: 13930809344
          z:
            _serializedValue: 24485632
      - bodyPart: 4
        mappedPosition:
          x:
            _serializedValue: 2439261184
          y:
            _serializedValue: 18271006720
          z:
            _serializedValue: 842856192
      - bodyPart: 5
        mappedPosition:
          x:
            _serializedValue: 861233984
          y:
            _serializedValue: 18389913600
          z:
            _serializedValue: -3216866560
      - bodyPart: 6
        mappedPosition:
          x:
            _serializedValue: -934970304
          y:
            _serializedValue: 16948062208
          z:
            _serializedValue: 2194416384
      - bodyPart: 7
        mappedPosition:
          x:
            _serializedValue: -2882609408
          y:
            _serializedValue: 17707501568
          z:
            _serializedValue: -2523723776
      - bodyPart: 8
        mappedPosition:
          x:
            _serializedValue: -3732661248
          y:
            _serializedValue: 15498063872
          z:
            _serializedValue: 3419386880
      - bodyPart: 9
        mappedPosition:
          x:
            _serializedValue: -5954416640
          y:
            _serializedValue: 16334550016
          z:
            _serializedValue: -2193415168
      - bodyPart: 10
        mappedPosition:
          x:
            _serializedValue: -1878300544
          y:
            _serializedValue: 12128413696
          z:
            _serializedValue: 1238931968
      - bodyPart: 11
        mappedPosition:
          x:
            _serializedValue: -2611296768
          y:
            _serializedValue: 12158320640
          z:
            _serializedValue: -1286908416
      - bodyPart: 12
        mappedPosition:
          x:
            _serializedValue: 3897505280
          y:
            _serializedValue: 11132276736
          z:
            _serializedValue: -833685504
      - bodyPart: 13
        mappedPosition:
          x:
            _serializedValue: -6868314112
          y:
            _serializedValue: 7866898432
          z:
            _serializedValue: 165630464
      - bodyPart: 14
        mappedPosition:
          x:
            _serializedValue: 2036962432
          y:
            _serializedValue: 5637825536
          z:
            _serializedValue: 63451008
      - bodyPart: 15
        mappedPosition:
          x:
            _serializedValue: -12195965952
          y:
            _serializedValue: 7808779776
          z:
            _serializedValue: 2629053440
      - bodyPart: 0
        mappedPosition:
          x:
            _serializedValue: -2335500800
          y:
            _serializedValue: 12347636736
          z:
            _serializedValue: 4749824
      deltaDisplacement:
        x:
          _serializedValue: 0
        y:
          _serializedValue: 0
        z:
          _serializedValue: 0
    - frame: 14
      hitBoxMaps:
      - bodyPart: 1
        mappedPosition:
          x:
            _serializedValue: 4567578624
          y:
            _serializedValue: 18276112384
          z:
            _serializedValue: -2154521856
      - bodyPart: 2
        mappedPosition:
          x:
            _serializedValue: 1115328256
          y:
            _serializedValue: 17009589248
          z:
            _serializedValue: -989851584
      - bodyPart: 3
        mappedPosition:
          x:
            _serializedValue: -2299504640
          y:
            _serializedValue: 14000974848
          z:
            _serializedValue: 102428416
      - bodyPart: 4
        mappedPosition:
          x:
            _serializedValue: 2620796928
          y:
            _serializedValue: 18290251776
          z:
            _serializedValue: 908788992
      - bodyPart: 5
        mappedPosition:
          x:
            _serializedValue: 1033733056
          y:
            _serializedValue: 18404349952
          z:
            _serializedValue: -3250564864
      - bodyPart: 6
        mappedPosition:
          x:
            _serializedValue: -778460096
          y:
            _serializedValue: 17043572736
          z:
            _serializedValue: 2270104576
      - bodyPart: 7
        mappedPosition:
          x:
            _serializedValue: -2719341568
          y:
            _serializedValue: 17793906688
          z:
            _serializedValue: -2540433664
      - bodyPart: 8
        mappedPosition:
          x:
            _serializedValue: -3588520704
          y:
            _serializedValue: 15611789312
          z:
            _serializedValue: 3488171008
      - bodyPart: 9
        mappedPosition:
          x:
            _serializedValue: -5798458368
          y:
            _serializedValue: 16437836800
          z:
            _serializedValue: -2208429568
      - bodyPart: 10
        mappedPosition:
          x:
            _serializedValue: -1861324288
          y:
            _serializedValue: 12199888896
          z:
            _serializedValue: 1327101312
      - bodyPart: 11
        mappedPosition:
          x:
            _serializedValue: -2592260096
          y:
            _serializedValue: 12224688128
          z:
            _serializedValue: -1199395840
      - bodyPart: 12
        mappedPosition:
          x:
            _serializedValue: 3897856000
          y:
            _serializedValue: 11029947392
          z:
            _serializedValue: -700465408
      - bodyPart: 13
        mappedPosition:
          x:
            _serializedValue: -6783689728
          y:
            _serializedValue: 7818832384
          z:
            _serializedValue: 92420096
      - bodyPart: 14
        mappedPosition:
          x:
            _serializedValue: 2533519872
          y:
            _serializedValue: 5345080320
          z:
            _serializedValue: -174785792
      - bodyPart: 15
        mappedPosition:
          x:
            _serializedValue: -12019637248
          y:
            _serializedValue: 8834750464
          z:
            _serializedValue: 2543635456
      - bodyPart: 0
        mappedPosition:
          x:
            _serializedValue: -2315051776
          y:
            _serializedValue: 12417790976
          z:
            _serializedValue: 91401728
      deltaDisplacement:
        x:
          _serializedValue: 0
        y:
          _serializedValue: 0
        z:
          _serializedValue: 0
    - frame: 15
      hitBoxMaps:
      - bodyPart: 1
        mappedPosition:
          x:
            _serializedValue: 4670310400
          y:
            _serializedValue: 18209558528
          z:
            _serializedValue: -2084089344
      - bodyPart: 2
        mappedPosition:
          x:
            _serializedValue: 1197123200
          y:
            _serializedValue: 17005952000
          z:
            _serializedValue: -914958464
      - bodyPart: 3
        mappedPosition:
          x:
            _serializedValue: -2260184320
          y:
            _serializedValue: 14054108160
          z:
            _serializedValue: 192979968
      - bodyPart: 4
        mappedPosition:
          x:
            _serializedValue: 2820738048
          y:
            _serializedValue: 18282205184
          z:
            _serializedValue: 987071232
      - bodyPart: 5
        mappedPosition:
          x:
            _serializedValue: 1224171392
          y:
            _serializedValue: 18399186944
          z:
            _serializedValue: -3274413056
      - bodyPart: 6
        mappedPosition:
          x:
            _serializedValue: -604841408
          y:
            _serializedValue: 17121882112
          z:
            _serializedValue: 2358705408
      - bodyPart: 7
        mappedPosition:
          x:
            _serializedValue: -2537925632
          y:
            _serializedValue: 17872070656
          z:
            _serializedValue: -2545531136
      - bodyPart: 8
        mappedPosition:
          x:
            _serializedValue: -3439157504
          y:
            _serializedValue: 15739565056
          z:
            _serializedValue: 3577716992
      - bodyPart: 9
        mappedPosition:
          x:
            _serializedValue: -5635872768
          y:
            _serializedValue: 16563841024
          z:
            _serializedValue: -2197134336
      - bodyPart: 10
        mappedPosition:
          x:
            _serializedValue: -1846858240
          y:
            _serializedValue: 12254191616
          z:
            _serializedValue: 1427964928
      - bodyPart: 11
        mappedPosition:
          x:
            _serializedValue: -2575672320
          y:
            _serializedValue: 12274663424
          z:
            _serializedValue: -1099180288
      - bodyPart: 12
        mappedPosition:
          x:
            _serializedValue: 3907924736
          y:
            _serializedValue: 10994573312
          z:
            _serializedValue: -557933824
      - bodyPart: 13
        mappedPosition:
          x:
            _serializedValue: -6691113984
          y:
            _serializedValue: 7758501376
          z:
            _serializedValue: 47903744
      - bodyPart: 14
        mappedPosition:
          x:
            _serializedValue: 2954662656
          y:
            _serializedValue: 5204728832
          z:
            _serializedValue: -401550848
      - bodyPart: 15
        mappedPosition:
          x:
            _serializedValue: -11680092160
          y:
            _serializedValue: 9749025792
          z:
            _serializedValue: 2415095808
      - bodyPart: 0
        mappedPosition:
          x:
            _serializedValue: -2296799488
          y:
            _serializedValue: 12471235584
          z:
            _serializedValue: 190732544
      deltaDisplacement:
        x:
          _serializedValue: 0
        y:
          _serializedValue: 0
        z:
          _serializedValue: 0
    - frame: 16
      hitBoxMaps:
      - bodyPart: 1
        mappedPosition:
          x:
            _serializedValue: 4766430208
          y:
            _serializedValue: 18128623616
          z:
            _serializedValue: -2001217280
      - bodyPart: 2
        mappedPosition:
          x:
            _serializedValue: 1274985728
          y:
            _serializedValue: 16983860224
          z:
            _serializedValue: -827383360
      - bodyPart: 3
        mappedPosition:
          x:
            _serializedValue: -2222412544
          y:
            _serializedValue: 14086754304
          z:
            _serializedValue: 295344128
      - bodyPart: 4
        mappedPosition:
          x:
            _serializedValue: 3021360128
          y:
            _serializedValue: 18251237376
          z:
            _serializedValue: 1073992704
      - bodyPart: 5
        mappedPosition:
          x:
            _serializedValue: 1415443456
          y:
            _serializedValue: 18375041024
          z:
            _serializedValue: -3278901248
      - bodyPart: 6
        mappedPosition:
          x:
            _serializedValue: -429621152
          y:
            _serializedValue: 17181706240
          z:
            _serializedValue: 2455719168
      - bodyPart: 7
        mappedPosition:
          x:
            _serializedValue: -2354010112
          y:
            _serializedValue: 17936504832
          z:
            _serializedValue: -2529640192
      - bodyPart: 8
        mappedPosition:
          x:
            _serializedValue: -3294664960
          y:
            _serializedValue: 15869985792
          z:
            _serializedValue: 3680891392
      - bodyPart: 9
        mappedPosition:
          x:
            _serializedValue: -5476728832
          y:
            _serializedValue: 16696399872
          z:
            _serializedValue: -2154286080
      - bodyPart: 10
        mappedPosition:
          x:
            _serializedValue: -1833459328
          y:
            _serializedValue: 12287846400
          z:
            _serializedValue: 1539682560
      - bodyPart: 11
        mappedPosition:
          x:
            _serializedValue: -2560532480
          y:
            _serializedValue: 12305077248
          z:
            _serializedValue: -987987968
      - bodyPart: 12
        mappedPosition:
          x:
            _serializedValue: 3897036800
          y:
            _serializedValue: 10832186368
          z:
            _serializedValue: -381358848
      - bodyPart: 13
        mappedPosition:
          x:
            _serializedValue: -6567505408
          y:
            _serializedValue: 7660048384
          z:
            _serializedValue: 20096512
      - bodyPart: 14
        mappedPosition:
          x:
            _serializedValue: 3277368832
          y:
            _serializedValue: 4999434240
          z:
            _serializedValue: -606093312
      - bodyPart: 15
        mappedPosition:
          x:
            _serializedValue: -11204904960
          y:
            _serializedValue: 10482221056
          z:
            _serializedValue: 2252935168
      - bodyPart: 0
        mappedPosition:
          x:
            _serializedValue: -2279820544
          y:
            _serializedValue: 12504507392
          z:
            _serializedValue: 301087104
      deltaDisplacement:
        x:
          _serializedValue: 0
        y:
          _serializedValue: 0
        z:
          _serializedValue: 0
    - frame: 17
      hitBoxMaps:
      - bodyPart: 1
        mappedPosition:
          x:
            _serializedValue: 4850890752
          y:
            _serializedValue: 18040104960
          z:
            _serializedValue: -1906895872
      - bodyPart: 2
        mappedPosition:
          x:
            _serializedValue: 1345320960
          y:
            _serializedValue: 16944809984
          z:
            _serializedValue: -727977728
      - bodyPart: 3
        mappedPosition:
          x:
            _serializedValue: -2185775616
          y:
            _serializedValue: 14095186944
          z:
            _serializedValue: 408777344
      - bodyPart: 4
        mappedPosition:
          x:
            _serializedValue: 3207564800
          y:
            _serializedValue: 18201262080
          z:
            _serializedValue: 1168121344
      - bodyPart: 5
        mappedPosition:
          x:
            _serializedValue: 1591603712
          y:
            _serializedValue: 18333507584
          z:
            _serializedValue: -3256645120
      - bodyPart: 6
        mappedPosition:
          x:
            _serializedValue: -266222672
          y:
            _serializedValue: 17221552128
          z:
            _serializedValue: 2559272448
      - bodyPart: 7
        mappedPosition:
          x:
            _serializedValue: -2182640640
          y:
            _serializedValue: 17983123456
          z:
            _serializedValue: -2485404928
      - bodyPart: 8
        mappedPosition:
          x:
            _serializedValue: -3160631808
          y:
            _serializedValue: 15983716352
          z:
            _serializedValue: 3792271872
      - bodyPart: 9
        mappedPosition:
          x:
            _serializedValue: -5328839680
          y:
            _serializedValue: 16813324288
          z:
            _serializedValue: -2081519616
      - bodyPart: 10
        mappedPosition:
          x:
            _serializedValue: -1818282880
          y:
            _serializedValue: 12297038848
          z:
            _serializedValue: 1660712704
      - bodyPart: 11
        mappedPosition:
          x:
            _serializedValue: -2544284672
          y:
            _serializedValue: 12312269824
          z:
            _serializedValue: -867278336
      - bodyPart: 12
        mappedPosition:
          x:
            _serializedValue: 3802299904
          y:
            _serializedValue: 10370151424
          z:
            _serializedValue: -167982080
      - bodyPart: 13
        mappedPosition:
          x:
            _serializedValue: -6374102016
          y:
            _serializedValue: 7489008128
          z:
            _serializedValue: -20493312
      - bodyPart: 14
        mappedPosition:
          x:
            _serializedValue: 3486904576
          y:
            _serializedValue: 4540780032
          z:
            _serializedValue: -779880960
      - bodyPart: 15
        mappedPosition:
          x:
            _serializedValue: -10617946112
          y:
            _serializedValue: 10966542336
          z:
            _serializedValue: 2065714176
      - bodyPart: 0
        mappedPosition:
          x:
            _serializedValue: -2261678848
          y:
            _serializedValue: 12513756160
          z:
            _serializedValue: 421062656
      deltaDisplacement:
        x:
          _serializedValue: 0
        y:
          _serializedValue: 0
        z:
          _serializedValue: 0
    - frame: 18
      hitBoxMaps:
      - bodyPart: 1
        mappedPosition:
          x:
            _serializedValue: 4920990720
          y:
            _serializedValue: 17949796352
          z:
            _serializedValue: -1801147904
      - bodyPart: 2
        mappedPosition:
          x:
            _serializedValue: 1406341376
          y:
            _serializedValue: 16890159104
          z:
            _serializedValue: -616674496
      - bodyPart: 3
        mappedPosition:
          x:
            _serializedValue: -2148954112
          y:
            _serializedValue: 14076305408
          z:
            _serializedValue: 533670144
      - bodyPart: 4
        mappedPosition:
          x:
            _serializedValue: 3366442496
          y:
            _serializedValue: 18136295424
          z:
            _serializedValue: 1271088640
      - bodyPart: 5
        mappedPosition:
          x:
            _serializedValue: 1737302144
          y:
            _serializedValue: 18277322752
          z:
            _serializedValue: -3201592320
      - bodyPart: 6
        mappedPosition:
          x:
            _serializedValue: -126415520
          y:
            _serializedValue: 17240371200
          z:
            _serializedValue: 2670940416
      - bodyPart: 7
        mappedPosition:
          x:
            _serializedValue: -2038777472
          y:
            _serializedValue: 18009616384
          z:
            _serializedValue: -2406584320
      - bodyPart: 8
        mappedPosition:
          x:
            _serializedValue: -3046974976
          y:
            _serializedValue: 16075493376
          z:
            _serializedValue: 3913327104
      - bodyPart: 9
        mappedPosition:
          x:
            _serializedValue: -5205613568
          y:
            _serializedValue: 16907986944
          z:
            _serializedValue: -1973350912
      - bodyPart: 10
        mappedPosition:
          x:
            _serializedValue: -1797992960
          y:
            _serializedValue: 12278502400
          z:
            _serializedValue: 1790835712
      - bodyPart: 11
        mappedPosition:
          x:
            _serializedValue: -2523839744
          y:
            _serializedValue: 12293057536
          z:
            _serializedValue: -737205760
      - bodyPart: 12
        mappedPosition:
          x:
            _serializedValue: 3582687232
          y:
            _serializedValue: 9691549696
          z:
            _serializedValue: 57657344
      - bodyPart: 13
        mappedPosition:
          x:
            _serializedValue: -6048302592
          y:
            _serializedValue: 7209312256
          z:
            _serializedValue: -119081984
      - bodyPart: 14
        mappedPosition:
          x:
            _serializedValue: 3567009792
          y:
            _serializedValue: 3902702336
          z:
            _serializedValue: -914173696
      - bodyPart: 15
        mappedPosition:
          x:
            _serializedValue: -9930766336
          y:
            _serializedValue: 11143264256
          z:
            _serializedValue: 1857326080
      - bodyPart: 0
        mappedPosition:
          x:
            _serializedValue: -2239386112
          y:
            _serializedValue: 12495681536
          z:
            _serializedValue: 550550784
      deltaDisplacement:
        x:
          _serializedValue: 0
        y:
          _serializedValue: 0
        z:
          _serializedValue: 0
    - frame: 19
      hitBoxMaps:
      - bodyPart: 1
        mappedPosition:
          x:
            _serializedValue: 4930319360
          y:
            _serializedValue: 17812598784
          z:
            _serializedValue: -1676436992
      - bodyPart: 2
        mappedPosition:
          x:
            _serializedValue: 1419094272
          y:
            _serializedValue: 16749922304
          z:
            _serializedValue: -484554944
      - bodyPart: 3
        mappedPosition:
          x:
            _serializedValue: -2143171072
          y:
            _serializedValue: 13947309056
          z:
            _serializedValue: 685316096
      - bodyPart: 4
        mappedPosition:
          x:
            _serializedValue: 3457669120
          y:
            _serializedValue: 17985613824
          z:
            _serializedValue: 1399456768
      - bodyPart: 5
        mappedPosition:
          x:
            _serializedValue: 1805781760
          y:
            _serializedValue: 18157516800
          z:
            _serializedValue: -3100828416
      - bodyPart: 6
        mappedPosition:
          x:
            _serializedValue: -55972296
          y:
            _serializedValue: 17190264832
          z:
            _serializedValue: 2808029440
      - bodyPart: 7
        mappedPosition:
          x:
            _serializedValue: -1964382592
          y:
            _serializedValue: 17998325760
          z:
            _serializedValue: -2250529280
      - bodyPart: 8
        mappedPosition:
          x:
            _serializedValue: -3010985728
          y:
            _serializedValue: 16134643712
          z:
            _serializedValue: 4066477568
      - bodyPart: 9
        mappedPosition:
          x:
            _serializedValue: -5157879808
          y:
            _serializedValue: 17007453184
          z:
            _serializedValue: -1750673920
      - bodyPart: 10
        mappedPosition:
          x:
            _serializedValue: -1804176256
          y:
            _serializedValue: 12147736576
          z:
            _serializedValue: 1943229696
      - bodyPart: 11
        mappedPosition:
          x:
            _serializedValue: -2530648832
          y:
            _serializedValue: 12166076416
          z:
            _serializedValue: -584607232
      - bodyPart: 12
        mappedPosition:
          x:
            _serializedValue: 3226053888
          y:
            _serializedValue: 8933526528
          z:
            _serializedValue: 207259392
      - bodyPart: 13
        mappedPosition:
          x:
            _serializedValue: -5618409472
          y:
            _serializedValue: 6776760320
          z:
            _serializedValue: -321152000
      - bodyPart: 14
        mappedPosition:
          x:
            _serializedValue: 1852515328
          y:
            _serializedValue: 3275122176
          z:
            _serializedValue: -535232640
      - bodyPart: 15
        mappedPosition:
          x:
            _serializedValue: -9156801536
          y:
            _serializedValue: 11033788416
          z:
            _serializedValue: 1631585792
      - bodyPart: 0
        mappedPosition:
          x:
            _serializedValue: -2244435200
          y:
            _serializedValue: 12367351808
          z:
            _serializedValue: 702970368
      deltaDisplacement:
        x:
          _serializedValue: 0
        y:
          _serializedValue: 0
        z:
          _serializedValue: 0
    - frame: 20
      hitBoxMaps:
      - bodyPart: 1
        mappedPosition:
          x:
            _serializedValue: 4868364800
          y:
            _serializedValue: 17620641792
          z:
            _serializedValue: -1525895424
      - bodyPart: 2
        mappedPosition:
          x:
            _serializedValue: 1376531840
          y:
            _serializedValue: 16503987200
          z:
            _serializedValue: -326420608
      - bodyPart: 3
        mappedPosition:
          x:
            _serializedValue: -2172738560
          y:
            _serializedValue: 13681348608
          z:
            _serializedValue: 866084736
      - bodyPart: 4
        mappedPosition:
          x:
            _serializedValue: 3470429184
          y:
            _serializedValue: 17724164096
          z:
            _serializedValue: 1565411840
      - bodyPart: 5
        mappedPosition:
          x:
            _serializedValue: 1785266432
          y:
            _serializedValue: 17971843072
          z:
            _serializedValue: -2942017536
      - bodyPart: 6
        mappedPosition:
          x:
            _serializedValue: -59697608
          y:
            _serializedValue: 17026050048
          z:
            _serializedValue: 2984274944
      - bodyPart: 7
        mappedPosition:
          x:
            _serializedValue: -1973159680
          y:
            _serializedValue: 17941940224
          z:
            _serializedValue: -2027776512
      - bodyPart: 8
        mappedPosition:
          x:
            _serializedValue: -3049027328
          y:
            _serializedValue: 16105448448
          z:
            _serializedValue: 4267445760
      - bodyPart: 9
        mappedPosition:
          x:
            _serializedValue: -5197084672
          y:
            _serializedValue: 17109844992
          z:
            _serializedValue: -1441229824
      - bodyPart: 10
        mappedPosition:
          x:
            _serializedValue: -1840727808
          y:
            _serializedValue: 11876734976
          z:
            _serializedValue: 2118627968
      - bodyPart: 11
        mappedPosition:
          x:
            _serializedValue: -2568904704
          y:
            _serializedValue: 11905449984
          z:
            _serializedValue: -408620288
      - bodyPart: 12
        mappedPosition:
          x:
            _serializedValue: 2621965568
          y:
            _serializedValue: 7904957440
          z:
            _serializedValue: 398940416
      - bodyPart: 13
        mappedPosition:
          x:
            _serializedValue: -5096702464
          y:
            _serializedValue: 6228065792
          z:
            _serializedValue: -569669632
      - bodyPart: 14
        mappedPosition:
          x:
            _serializedValue: 114937464
          y:
            _serializedValue: 2624831232
          z:
            _serializedValue: -140094608
      - bodyPart: 15
        mappedPosition:
          x:
            _serializedValue: -8311920128
          y:
            _serializedValue: 10730891264
          z:
            _serializedValue: 1390605824
      - bodyPart: 0
        mappedPosition:
          x:
            _serializedValue: -2280899072
          y:
            _serializedValue: 12101804032
          z:
            _serializedValue: 879317504
      deltaDisplacement:
        x:
          _serializedValue: 0
        y:
          _serializedValue: 0
        z:
          _serializedValue: 0
    - frame: 21
      hitBoxMaps:
      - bodyPart: 1
        mappedPosition:
          x:
            _serializedValue: 4758344704
          y:
            _serializedValue: 17427691520
          z:
            _serializedValue: -1353252864
      - bodyPart: 2
        mappedPosition:
          x:
            _serializedValue: 1296808448
          y:
            _serializedValue: 16222543872
          z:
            _serializedValue: -151604864
      - bodyPart: 3
        mappedPosition:
          x:
            _serializedValue: -2225060864
          y:
            _serializedValue: 13354955776
          z:
            _serializedValue: 1052636288
      - bodyPart: 4
        mappedPosition:
          x:
            _serializedValue: 3409797376
          y:
            _serializedValue: 17413146624
          z:
            _serializedValue: 1763940864
      - bodyPart: 5
        mappedPosition:
          x:
            _serializedValue: 1684460160
          y:
            _serializedValue: 17782886400
          z:
            _serializedValue: -2725112064
      - bodyPart: 6
        mappedPosition:
          x:
            _serializedValue: -121010336
          y:
            _serializedValue: 16738969600
          z:
            _serializedValue: 3192653824
      - bodyPart: 7
        mappedPosition:
          x:
            _serializedValue: -2065986176
          y:
            _serializedValue: 17831755776
          z:
            _serializedValue: -1779458688
      - bodyPart: 8
        mappedPosition:
          x:
            _serializedValue: -3122941696
          y:
            _serializedValue: 15900934144
          z:
            _serializedValue: 4502705152
      - bodyPart: 9
        mappedPosition:
          x:
            _serializedValue: -5310003200
          y:
            _serializedValue: 17130177536
          z:
            _serializedValue: -1135841792
      - bodyPart: 10
        mappedPosition:
          x:
            _serializedValue: -1892829184
          y:
            _serializedValue: 11542668288
          z:
            _serializedValue: 2293992704
      - bodyPart: 11
        mappedPosition:
          x:
            _serializedValue: -2624531200
          y:
            _serializedValue: 11586978816
          z:
            _serializedValue: -232012288
      - bodyPart: 12
        mappedPosition:
          x:
            _serializedValue: 2110161920
          y:
            _serializedValue: 7116273664
          z:
            _serializedValue: 553001600
      - bodyPart: 13
        mappedPosition:
          x:
            _serializedValue: -4370295808
          y:
            _serializedValue: 5646691328
          z:
            _serializedValue: -792088064
      - bodyPart: 14
        mappedPosition:
          x:
            _serializedValue: -1669767552
          y:
            _serializedValue: 2629412608
          z:
            _serializedValue: 364157568
      - bodyPart: 15
        mappedPosition:
          x:
            _serializedValue: -7410786304
          y:
            _serializedValue: 10283056128
          z:
            _serializedValue: 1135416320
      - bodyPart: 0
        mappedPosition:
          x:
            _serializedValue: -2334550528
          y:
            _serializedValue: 11775453184
          z:
            _serializedValue: 1056659712
      deltaDisplacement:
        x:
          _serializedValue: 0
        y:
          _serializedValue: 0
        z:
          _serializedValue: 0
    - frame: 22
      hitBoxMaps:
      - bodyPart: 1
        mappedPosition:
          x:
            _serializedValue: 4630225408
          y:
            _serializedValue: 17275654144
          z:
            _serializedValue: -1177187840
      - bodyPart: 2
        mappedPosition:
          x:
            _serializedValue: 1204224000
          y:
            _serializedValue: 15969977344
          z:
            _serializedValue: 21272192
      - bodyPart: 3
        mappedPosition:
          x:
            _serializedValue: -2282246144
          y:
            _serializedValue: 13044893696
          z:
            _serializedValue: 1225299712
      - bodyPart: 4
        mappedPosition:
          x:
            _serializedValue: 3305636608
          y:
            _serializedValue: 17111284736
          z:
            _serializedValue: 1972142592
      - bodyPart: 5
        mappedPosition:
          x:
            _serializedValue: 1533421184
          y:
            _serializedValue: 17636288512
          z:
            _serializedValue: -2472438272
      - bodyPart: 6
        mappedPosition:
          x:
            _serializedValue: -212769408
          y:
            _serializedValue: 16385935360
          z:
            _serializedValue: 3406376960
      - bodyPart: 7
        mappedPosition:
          x:
            _serializedValue: -2213381120
          y:
            _serializedValue: 17705754624
          z:
            _serializedValue: -1513716224
      - bodyPart: 8
        mappedPosition:
          x:
            _serializedValue: -3207823104
          y:
            _serializedValue: 15559672832
          z:
            _serializedValue: 4739443712
      - bodyPart: 9
        mappedPosition:
          x:
            _serializedValue: -5466881024
          y:
            _serializedValue: 17082963968
          z:
            _serializedValue: -837713920
      - bodyPart: 10
        mappedPosition:
          x:
            _serializedValue: -1943689216
          y:
            _serializedValue: 11223221248
          z:
            _serializedValue: 2451112448
      - bodyPart: 11
        mappedPosition:
          x:
            _serializedValue: -2680507392
          y:
            _serializedValue: 11286642688
          z:
            _serializedValue: -72996864
      - bodyPart: 12
        mappedPosition:
          x:
            _serializedValue: 1305392384
          y:
            _serializedValue: 6193070592
          z:
            _serializedValue: 781068800
      - bodyPart: 13
        mappedPosition:
          x:
            _serializedValue: -3294021632
          y:
            _serializedValue: 5171173888
          z:
            _serializedValue: -1007365888
      - bodyPart: 14
        mappedPosition:
          x:
            _serializedValue: -3347068928
          y:
            _serializedValue: 2614566144
          z:
            _serializedValue: 847201280
      - bodyPart: 15
        mappedPosition:
          x:
            _serializedValue: -6467524608
          y:
            _serializedValue: 9738934272
          z:
            _serializedValue: 868840960
      - bodyPart: 0
        mappedPosition:
          x:
            _serializedValue: -2388365312
          y:
            _serializedValue: 11465179136
          z:
            _serializedValue: 1216600448
      deltaDisplacement:
        x:
          _serializedValue: 0
        y:
          _serializedValue: 0
        z:
          _serializedValue: 0
    - frame: 23
      hitBoxMaps:
      - bodyPart: 1
        mappedPosition:
          x:
            _serializedValue: 4515520512
          y:
            _serializedValue: 17202849792
          z:
            _serializedValue: -1034167296
      - bodyPart: 2
        mappedPosition:
          x:
            _serializedValue: 1122483072
          y:
            _serializedValue: 15811491840
          z:
            _serializedValue: 161650816
      - bodyPart: 3
        mappedPosition:
          x:
            _serializedValue: -2328584704
          y:
            _serializedValue: 12833438720
          z:
            _serializedValue: 1363201920
      - bodyPart: 4
        mappedPosition:
          x:
            _serializedValue: 3202532352
          y:
            _serializedValue: 16885008384
          z:
            _serializedValue: 2147118848
      - bodyPart: 5
        mappedPosition:
          x:
            _serializedValue: 1379010560
          y:
            _serializedValue: 17576464384
          z:
            _serializedValue: -2231342592
      - bodyPart: 6
        mappedPosition:
          x:
            _serializedValue: -299461248
          y:
            _serializedValue: 16084729856
          z:
            _serializedValue: 3581664768
      - bodyPart: 7
        mappedPosition:
          x:
            _serializedValue: -2363229184
          y:
            _serializedValue: 17651304448
          z:
            _serializedValue: -1255358464
      - bodyPart: 8
        mappedPosition:
          x:
            _serializedValue: -3280505344
          y:
            _serializedValue: 15232454656
          z:
            _serializedValue: 4929673216
      - bodyPart: 9
        mappedPosition:
          x:
            _serializedValue: -5620329472
          y:
            _serializedValue: 17078582272
          z:
            _serializedValue: -552936448
      - bodyPart: 10
        mappedPosition:
          x:
            _serializedValue: -1981435008
          y:
            _serializedValue: 11001684992
          z:
            _serializedValue: 2571462656
      - bodyPart: 11
        mappedPosition:
          x:
            _serializedValue: -2723813376
          y:
            _serializedValue: 11085908992
          z:
            _serializedValue: 49590528
      - bodyPart: 12
        mappedPosition:
          x:
            _serializedValue: 77719728
          y:
            _serializedValue: 5317280256
          z:
            _serializedValue: 1123907456
      - bodyPart: 13
        mappedPosition:
          x:
            _serializedValue: -1668704384
          y:
            _serializedValue: 5100331520
          z:
            _serializedValue: -1257331200
      - bodyPart: 14
        mappedPosition:
          x:
            _serializedValue: -5104144896
          y:
            _serializedValue: 2570045440
          z:
            _serializedValue: 1361440512
      - bodyPart: 15
        mappedPosition:
          x:
            _serializedValue: -5495428608
          y:
            _serializedValue: 9147534336
          z:
            _serializedValue: 595247616
      - bodyPart: 0
        mappedPosition:
          x:
            _serializedValue: -2429522944
          y:
            _serializedValue: 11253528576
          z:
            _serializedValue: 1340166016
      deltaDisplacement:
        x:
          _serializedValue: 0
        y:
          _serializedValue: 0
        z:
          _serializedValue: 0
    clip: {fileID: 7400000, guid: 9d32dc873e3f34ab899b495ed602ea94, type: 2}
    customHitBoxDefinition: {fileID: 0}
    length:
      _serializedValue: 4294967296
    bakeSpeed: 1
    hitBoxDefinitionType: 0
  _animationSpeed:
    _serializedValue: 10737418240
  wrapMode: 0
  characterPrefab: {fileID: 1272366937168992, guid: 01b0a963f13679544a22d6e63d5256c6,
    type: 3}
  moveName: All woman Dash Forward
  description: Man Dash Forward
  fps: 60
  ignoreGravity: 0
  ignoreFriction: 0
  cancelMoveWhenLanding: 1
  landingMoveLink: {fileID: 0}
  forceMirrorLeft: 0
  forceMirrorRight: 0
  invertRotationLeft: 0
  invertRotationRight: 0
  autoCorrectRotation: 0
  allowSideSwitch: 0
  frameWindowRotation: 0
  cooldown: 0
  cooldownFrames: 0
  disableHeadLook: 1
  speedKeyFrameToggle: 0
  fixedSpeed: 1
  animSpeedKeyFrame: []
  totalFrames: 24
  startUpFrames: 5
  activeFrames: 5
  recoveryFrames: 5
  applyRootMotion: 0
  lockXMotion: 0
  lockYMotion: 0
  lockZMotion: 0
  forceGrounded: 0
  rootMotionNode: 0
  overrideBlendingIn: 1
  overrideBlendingOut: 1
  _blendingIn:
    _serializedValue: 0
  _blendingOut:
    _serializedValue: 85899344
  defaultInputs:
    chargeMove: 0
    _chargeTiming:
      _serializedValue: 3006477056
    allowInputLeniency: 0
    allowNegativeEdge: 0
    forceAxisPrecision: 1
    leniencyBuffer: 0
    onReleaseExecution: 0
    requireButtonPress: 1
    onPressExecution: 1
    buttonSequence: 00000000
    buttonExecution: 00000000
    editorToggle: 1
    buttonSequenceToggle: 1
    buttonExecutionToggle: 1
  altInputs:
    chargeMove: 0
    _chargeTiming:
      _serializedValue: 3006477107
    allowInputLeniency: 0
    allowNegativeEdge: 1
    forceAxisPrecision: 0
    leniencyBuffer: 3
    onReleaseExecution: 0
    requireButtonPress: 1
    onPressExecution: 1
    buttonSequence: 
    buttonExecution: 
    editorToggle: 0
    buttonSequenceToggle: 0
    buttonExecutionToggle: 0
  previousMoves: []
  opponentConditions:
    basicMoveLimitation: 
    possibleMoveStates: []
    basicMovesToggle: 0
    statesToggle: 0
  selfConditions:
    basicMoveLimitation: 
    possibleMoveStates:
    - possibleState: 0
      jumpArc: 0
      jumpArcBegins: 0
      jumpArcEnds: 100
      opponentDistance: 0
      proximityRangeBegins: 0
      proximityRangeEnds: 100
      movingForward: 1
      movingBack: 1
      standBy: 1
      blocking: 0
      blockStunned: 0
      stunned: 0
      resetStunValue: 0
    basicMovesToggle: 0
    statesToggle: 0
  moveClassification:
    attackType: 2
    hitType: 0
    startupSpeed: 0
    recoverySpeed: 0
    hitConfirmType: 0
    preferableDistance: 3
    gaugeUsage: 2
    anyAttackType: 1
    anyHitType: 1
    anyHitConfirmType: 1
  frameLinks:
  - linkType: 2
    allowBuffer: 1
    onStrike: 1
    onBlock: 1
    onParry: 1
    activeFramesBegins: 4
    activeFramesEnds: 23
    counterMoveType: 0
    counterMoveFilter: {fileID: 0}
    disableHitImpact: 1
    anyHitStrength: 1
    hitStrength: 0
    anyStrokeHitBox: 1
    hitBoxType: 0
    anyHitType: 1
    hitType: 0
    ignoreInputs: 0
    ignorePlayerConditions: 0
    ignoreGauge: 0
    nextMoveStartupFrame: 1
    linkableMoves:
    - {fileID: 11400000, guid: 8a1c24468a7f74f399cc2746d0487b79, type: 2}
    linkableMovesToggle: 1
    hitConfirmToggle: 0
    counterMoveToggle: 0
  - linkType: 2
    allowBuffer: 1
    onStrike: 1
    onBlock: 1
    onParry: 1
    activeFramesBegins: 4
    activeFramesEnds: 23
    counterMoveType: 0
    counterMoveFilter: {fileID: 0}
    disableHitImpact: 1
    anyHitStrength: 1
    hitStrength: 0
    anyStrokeHitBox: 1
    hitBoxType: 0
    anyHitType: 1
    hitType: 0
    ignoreInputs: 0
    ignorePlayerConditions: 0
    ignoreGauge: 0
    nextMoveStartupFrame: 1
    linkableMoves:
    - {fileID: 11400000, guid: 0893153b8732f4d78b489d7e39b424c6, type: 2}
    linkableMovesToggle: 1
    hitConfirmToggle: 0
    counterMoveToggle: 0
  - linkType: 2
    allowBuffer: 1
    onStrike: 1
    onBlock: 1
    onParry: 1
    activeFramesBegins: 4
    activeFramesEnds: 23
    counterMoveType: 0
    counterMoveFilter: {fileID: 0}
    disableHitImpact: 1
    anyHitStrength: 1
    hitStrength: 0
    anyStrokeHitBox: 1
    hitBoxType: 0
    anyHitType: 1
    hitType: 0
    ignoreInputs: 0
    ignorePlayerConditions: 0
    ignoreGauge: 0
    nextMoveStartupFrame: 1
    linkableMoves:
    - {fileID: 11400000, guid: bf7f5d26797c749c3bf5fda9b5d654b3, type: 2}
    linkableMovesToggle: 1
    hitConfirmToggle: 0
    counterMoveToggle: 0
  - linkType: 2
    allowBuffer: 1
    onStrike: 1
    onBlock: 1
    onParry: 1
    activeFramesBegins: 4
    activeFramesEnds: 23
    counterMoveType: 0
    counterMoveFilter: {fileID: 0}
    disableHitImpact: 1
    anyHitStrength: 1
    hitStrength: 0
    anyStrokeHitBox: 1
    hitBoxType: 0
    anyHitType: 1
    hitType: 0
    ignoreInputs: 0
    ignorePlayerConditions: 0
    ignoreGauge: 0
    nextMoveStartupFrame: 1
    linkableMoves:
    - {fileID: 11400000, guid: f6fcfbd8fe1aa49699c0bf508d931d7f, type: 2}
    linkableMovesToggle: 1
    hitConfirmToggle: 0
    counterMoveToggle: 0
  - linkType: 2
    allowBuffer: 1
    onStrike: 1
    onBlock: 1
    onParry: 1
    activeFramesBegins: 4
    activeFramesEnds: 23
    counterMoveType: 0
    counterMoveFilter: {fileID: 0}
    disableHitImpact: 1
    anyHitStrength: 1
    hitStrength: 0
    anyStrokeHitBox: 1
    hitBoxType: 0
    anyHitType: 1
    hitType: 0
    ignoreInputs: 0
    ignorePlayerConditions: 0
    ignoreGauge: 0
    nextMoveStartupFrame: 1
    linkableMoves:
    - {fileID: 11400000, guid: 8d035f3d6e4454cf5851c8aa064b4574, type: 2}
    linkableMovesToggle: 1
    hitConfirmToggle: 0
    counterMoveToggle: 0
  gauges:
  - castingFrame: 0
    targetGauge: 0
    startDrainingGauge: 0
    inhibitGainWhileDraining: 0
    stopDrainingGauge: 0
    _gaugeDPS:
      _serializedValue: 0
    _totalDrain:
      _serializedValue: 0
    _gaugeRequired:
      _serializedValue: 0
    _gaugeUsage:
      _serializedValue: 0
    _gaugeGainOnMiss:
      _serializedValue: 0
    _gaugeGainOnHit:
      _serializedValue: 0
    _gaugeGainOnBlock:
      _serializedValue: 0
    _opGaugeGainOnBlock:
      _serializedValue: 0
    _opGaugeGainOnParry:
      _serializedValue: 0
    _opGaugeGainOnHit:
      _serializedValue: 0
    DCMove: {fileID: 0}
    DCStance: 0
    editorToggle: 0
  sortOrder: []
  particleEffects: []
  appliedForces:
  - castingFrame: 0
    resetPreviousVertical: 1
    resetPreviousHorizontal: 1
    affectAssists: 0
    affectCharacter: 1
    _force:
      x:
        _serializedValue: 171798691840
      y:
        _serializedValue: 0
      z:
        _serializedValue: 0
  opAppliedForces: []
  slowMoEffects: []
  bodyPartVisibilityChanges: []
  opponentOverride: []
  characterAssist: []
  soundEffects:
  - castingFrame: 0
    sounds:
    - {fileID: 8300000, guid: 3caf00804a97c49a894347394dcf4e48, type: 3}
    soundEffectsToggle: 1
  inGameAlert: []
  stanceChanges: []
  cameraMovements: []
  hits: []
  blockableArea:
    enabled: 1
    activeFramesBegin: 1
    activeFramesEnds: 2
    bodyPart: 0
    hitBoxDefinitionIndex: 0
    shape: 0
    rect:
      serializedVersion: 2
      x: 0
      y: 0
      width: 4
      height: 4
    _rect:
      _x:
        _serializedValue: 0
      _y:
        _serializedValue: 0
      topRight:
        x:
          _serializedValue: 0
        y:
          _serializedValue: 0
        z:
          _serializedValue: 0
      topLeft:
        x:
          _serializedValue: 0
        y:
          _serializedValue: 0
        z:
          _serializedValue: 0
      bottomRight:
        x:
          _serializedValue: 0
        y:
          _serializedValue: 0
        z:
          _serializedValue: 0
      bottomLeft:
        x:
          _serializedValue: 0
        y:
          _serializedValue: 0
        z:
          _serializedValue: 0
      width:
        _serializedValue: 0
      height:
        _serializedValue: 0
      xMax:
        _serializedValue: 0
      yMax:
        _serializedValue: 0
    followXBounds: 0
    followYBounds: 0
    _radius:
      _serializedValue: 0
    _offSet:
      x:
        _serializedValue: 0
      y:
        _serializedValue: 0
      z:
        _serializedValue: 0
    cuboidMin:
      x:
        _serializedValue: 0
      y:
        _serializedValue: 0
      z:
        _serializedValue: 0
    cuboidMax:
      x:
        _serializedValue: 0
      y:
        _serializedValue: 0
      z:
        _serializedValue: 0
    position:
      x:
        _serializedValue: 0
      y:
        _serializedValue: 0
      z:
        _serializedValue: 0
  lockOnTargets: []
  switchCharacterOptions: []
  invincibleBodyParts: []
  stateOverride: []
  armorOptions:
    activeFramesBegin: 0
    activeFramesEnds: 0
    overrideHitEffects: 0
    blockHits: 0
    hitEffects:
      hitParticle: {fileID: 0}
      killTime: 0
      hitSound: {fileID: 0}
      spawnPoint: 1
      _freezingTime:
        _serializedValue: 0
      _animationSpeed:
        _serializedValue: 429496736
      autoHitStop: 1
      sticky: 0
      _hitStop:
        _serializedValue: 429496736
      mirrorOn2PSide: 0
      shakeCharacterOnHit: 1
      shakeCameraOnHit: 1
      _shakeDensity:
        _serializedValue: 3435973888
      _shakeCameraDensity:
        _serializedValue: 3435973836
      editorToggle: 0
    hitAbsorption: 0
    damageAbsorption: 0
    nonAffectedBodyParts: 
  projectiles: []
  rotationPreview: {x: 0, y: 90, z: 0}
