%YAML 1.1
%TAG !u! tag:unity3d.com,2011:
--- !u!114 &11400000
MonoBehaviour:
  m_ObjectHideFlags: 0
  m_CorrespondingSourceObject: {fileID: 0}
  m_PrefabInstance: {fileID: 0}
  m_PrefabAsset: {fileID: 0}
  m_GameObject: {fileID: 0}
  m_Enabled: 1
  m_EditorHideFlags: 0
  m_Script: {fileID: 11500000, guid: 03f9522b1b0f53b4c87d047ac5c3794f, type: 3}
  m_Name: all_man_SuperJump
  m_EditorClassIdentifier: 
  gameplayType: 0
  animMap:
    animationMaps:
    - frame: 0
      hitBoxMaps:
      - bodyPart: 1
        mappedPosition:
          x:
            _serializedValue: 241899328
          y:
            _serializedValue: 24425723904
          z:
            _serializedValue: 638860544
      - bodyPart: 2
        mappedPosition:
          x:
            _serializedValue: 296489088
          y:
            _serializedValue: 21200713728
          z:
            _serializedValue: 1215444736
      - bodyPart: 3
        mappedPosition:
          x:
            _serializedValue: 394929152
          y:
            _serializedValue: 16317445120
          z:
            _serializedValue: 1689212032
      - bodyPart: 4
        mappedPosition:
          x:
            _serializedValue: 3469571584
          y:
            _serializedValue: 22484131840
          z:
            _serializedValue: 1580211968
      - bodyPart: 5
        mappedPosition:
          x:
            _serializedValue: -2953288704
          y:
            _serializedValue: 22330042368
          z:
            _serializedValue: 1326346496
      - bodyPart: 6
        mappedPosition:
          x:
            _serializedValue: 3777919232
          y:
            _serializedValue: 19185293312
          z:
            _serializedValue: 2478446592
      - bodyPart: 7
        mappedPosition:
          x:
            _serializedValue: -4565968896
          y:
            _serializedValue: 20053809152
          z:
            _serializedValue: -674224640
      - bodyPart: 8
        mappedPosition:
          x:
            _serializedValue: 3938923008
          y:
            _serializedValue: 17521864704
          z:
            _serializedValue: -1409901056
      - bodyPart: 9
        mappedPosition:
          x:
            _serializedValue: -1585808896
          y:
            _serializedValue: 20661032960
          z:
            _serializedValue: -3617372160
      - bodyPart: 10
        mappedPosition:
          x:
            _serializedValue: 1314952576
          y:
            _serializedValue: 14329355264
          z:
            _serializedValue: 1032422144
      - bodyPart: 11
        mappedPosition:
          x:
            _serializedValue: -1326842752
          y:
            _serializedValue: 14869669888
          z:
            _serializedValue: 1277279232
      - bodyPart: 12
        mappedPosition:
          x:
            _serializedValue: 3471331328
          y:
            _serializedValue: 11531047936
          z:
            _serializedValue: -4303713280
      - bodyPart: 13
        mappedPosition:
          x:
            _serializedValue: -3333781504
          y:
            _serializedValue: 14266580992
          z:
            _serializedValue: -4769518080
      - bodyPart: 14
        mappedPosition:
          x:
            _serializedValue: 1705137280
          y:
            _serializedValue: 7795391488
          z:
            _serializedValue: 105090688
      - bodyPart: 15
        mappedPosition:
          x:
            _serializedValue: -3551597056
          y:
            _serializedValue: 9332306944
          z:
            _serializedValue: -1288457984
      - bodyPart: 0
        mappedPosition:
          x:
            _serializedValue: 43211356
          y:
            _serializedValue: 14774596608
          z:
            _serializedValue: 1298862336
      deltaDisplacement:
        x:
          _serializedValue: 0
        y:
          _serializedValue: 0
        z:
          _serializedValue: 0
    - frame: 1
      hitBoxMaps:
      - bodyPart: 1
        mappedPosition:
          x:
            _serializedValue: 281065344
          y:
            _serializedValue: 24650629120
          z:
            _serializedValue: 811603200
      - bodyPart: 2
        mappedPosition:
          x:
            _serializedValue: 330694784
          y:
            _serializedValue: 21411352576
          z:
            _serializedValue: 1302271104
      - bodyPart: 3
        mappedPosition:
          x:
            _serializedValue: 417210912
          y:
            _serializedValue: 16516980736
          z:
            _serializedValue: 1645933056
      - bodyPart: 4
        mappedPosition:
          x:
            _serializedValue: 3512099328
          y:
            _serializedValue: 22674466816
          z:
            _serializedValue: 1665413888
      - bodyPart: 5
        mappedPosition:
          x:
            _serializedValue: -2913674752
          y:
            _serializedValue: 22547810304
          z:
            _serializedValue: 1479101952
      - bodyPart: 6
        mappedPosition:
          x:
            _serializedValue: 3893392128
          y:
            _serializedValue: 19337027584
          z:
            _serializedValue: 2372767232
      - bodyPart: 7
        mappedPosition:
          x:
            _serializedValue: -4590856192
          y:
            _serializedValue: 20534302720
          z:
            _serializedValue: -738350592
      - bodyPart: 8
        mappedPosition:
          x:
            _serializedValue: 3852084480
          y:
            _serializedValue: 18079643648
          z:
            _serializedValue: -1668205568
      - bodyPart: 9
        mappedPosition:
          x:
            _serializedValue: -1569550080
          y:
            _serializedValue: 21250031616
          z:
            _serializedValue: -3614396160
      - bodyPart: 10
        mappedPosition:
          x:
            _serializedValue: 1304644992
          y:
            _serializedValue: 14506049536
          z:
            _serializedValue: 1014308608
      - bodyPart: 11
        mappedPosition:
          x:
            _serializedValue: -1327439488
          y:
            _serializedValue: 15086460928
          z:
            _serializedValue: 1271702016
      - bodyPart: 12
        mappedPosition:
          x:
            _serializedValue: 3361591040
          y:
            _serializedValue: 11523572736
          z:
            _serializedValue: -4260979712
      - bodyPart: 13
        mappedPosition:
          x:
            _serializedValue: -3230579456
          y:
            _serializedValue: 15133115392
          z:
            _serializedValue: -4838222848
      - bodyPart: 14
        mappedPosition:
          x:
            _serializedValue: 1672599040
          y:
            _serializedValue: 7702112768
          z:
            _serializedValue: 104321920
      - bodyPart: 15
        mappedPosition:
          x:
            _serializedValue: -3431593984
          y:
            _serializedValue: 10265561088
          z:
            _serializedValue: -1263479040
      - bodyPart: 0
        mappedPosition:
          x:
            _serializedValue: 41327964
          y:
            _serializedValue: 14972965888
          z:
            _serializedValue: 1283730688
      deltaDisplacement:
        x:
          _serializedValue: 0
        y:
          _serializedValue: 0
        z:
          _serializedValue: 0
    - frame: 2
      hitBoxMaps:
      - bodyPart: 1
        mappedPosition:
          x:
            _serializedValue: 316693888
          y:
            _serializedValue: 24870940672
          z:
            _serializedValue: 977470208
      - bodyPart: 2
        mappedPosition:
          x:
            _serializedValue: 360789632
          y:
            _serializedValue: 21619685376
          z:
            _serializedValue: 1381826176
      - bodyPart: 3
        mappedPosition:
          x:
            _serializedValue: 434544800
          y:
            _serializedValue: 16717691904
          z:
            _serializedValue: 1595109504
      - bodyPart: 4
        mappedPosition:
          x:
            _serializedValue: 3550274304
          y:
            _serializedValue: 22862917632
          z:
            _serializedValue: 1742699008
      - bodyPart: 5
        mappedPosition:
          x:
            _serializedValue: -2877558784
          y:
            _serializedValue: 22761086976
          z:
            _serializedValue: 1624786688
      - bodyPart: 6
        mappedPosition:
          x:
            _serializedValue: 4000571648
          y:
            _serializedValue: 19498401792
          z:
            _serializedValue: 2254088192
      - bodyPart: 7
        mappedPosition:
          x:
            _serializedValue: -4608699392
          y:
            _serializedValue: 21030813696
          z:
            _serializedValue: -782195712
      - bodyPart: 8
        mappedPosition:
          x:
            _serializedValue: 3744182528
          y:
            _serializedValue: 18657427456
          z:
            _serializedValue: -1885863936
      - bodyPart: 9
        mappedPosition:
          x:
            _serializedValue: -1545816832
          y:
            _serializedValue: 21845854208
          z:
            _serializedValue: -3586946304
      - bodyPart: 10
        mappedPosition:
          x:
            _serializedValue: 1289011584
          y:
            _serializedValue: 14684816384
          z:
            _serializedValue: 988788480
      - bodyPart: 11
        mappedPosition:
          x:
            _serializedValue: -1332588800
          y:
            _serializedValue: 15305395200
          z:
            _serializedValue: 1259101952
      - bodyPart: 12
        mappedPosition:
          x:
            _serializedValue: 3246708736
          y:
            _serializedValue: 11512108032
          z:
            _serializedValue: -4212771328
      - bodyPart: 13
        mappedPosition:
          x:
            _serializedValue: -3084748800
          y:
            _serializedValue: 16014219264
          z:
            _serializedValue: -4855044608
      - bodyPart: 14
        mappedPosition:
          x:
            _serializedValue: 1641539200
          y:
            _serializedValue: 7602066432
          z:
            _serializedValue: 105461248
      - bodyPart: 15
        mappedPosition:
          x:
            _serializedValue: -3303937024
          y:
            _serializedValue: 11194580992
          z:
            _serializedValue: -1217005568
      - bodyPart: 0
        mappedPosition:
          x:
            _serializedValue: 34563164
          y:
            _serializedValue: 15173327872
          z:
            _serializedValue: 1261320320
      deltaDisplacement:
        x:
          _serializedValue: 0
        y:
          _serializedValue: 0
        z:
          _serializedValue: 0
    - frame: 3
      hitBoxMaps:
      - bodyPart: 1
        mappedPosition:
          x:
            _serializedValue: 359372160
          y:
            _serializedValue: 25068879872
          z:
            _serializedValue: 1158725248
      - bodyPart: 2
        mappedPosition:
          x:
            _serializedValue: 398409088
          y:
            _serializedValue: 21808084992
          z:
            _serializedValue: 1477790848
      - bodyPart: 3
        mappedPosition:
          x:
            _serializedValue: 459921312
          y:
            _serializedValue: 16902017024
          z:
            _serializedValue: 1562556928
      - bodyPart: 4
        mappedPosition:
          x:
            _serializedValue: 3595597568
          y:
            _serializedValue: 23032877056
          z:
            _serializedValue: 1833502208
      - bodyPart: 5
        mappedPosition:
          x:
            _serializedValue: -2833452288
          y:
            _serializedValue: 22951499776
          z:
            _serializedValue: 1788294144
      - bodyPart: 6
        mappedPosition:
          x:
            _serializedValue: 4263995648
          y:
            _serializedValue: 19665909760
          z:
            _serializedValue: 1865076224
      - bodyPart: 7
        mappedPosition:
          x:
            _serializedValue: -4607380480
          y:
            _serializedValue: 21547208704
          z:
            _serializedValue: -793447424
      - bodyPart: 8
        mappedPosition:
          x:
            _serializedValue: 3763946752
          y:
            _serializedValue: 19565312000
          z:
            _serializedValue: -2336354048
      - bodyPart: 9
        mappedPosition:
          x:
            _serializedValue: -1494094336
          y:
            _serializedValue: 22466195456
          z:
            _serializedValue: -3509164032
      - bodyPart: 10
        mappedPosition:
          x:
            _serializedValue: 1281897344
          y:
            _serializedValue: 14848573440
          z:
            _serializedValue: 981124352
      - bodyPart: 11
        mappedPosition:
          x:
            _serializedValue: -1328697472
          y:
            _serializedValue: 15508267008
          z:
            _serializedValue: 1264984320
      - bodyPart: 12
        mappedPosition:
          x:
            _serializedValue: 3005009664
          y:
            _serializedValue: 11256489984
          z:
            _serializedValue: -4027135488
      - bodyPart: 13
        mappedPosition:
          x:
            _serializedValue: -2914123520
          y:
            _serializedValue: 16652000256
          z:
            _serializedValue: -4828746752
      - bodyPart: 14
        mappedPosition:
          x:
            _serializedValue: 1480539520
          y:
            _serializedValue: 7203464192
          z:
            _serializedValue: 187253632
      - bodyPart: 15
        mappedPosition:
          x:
            _serializedValue: -3199923712
          y:
            _serializedValue: 11835193344
          z:
            _serializedValue: -1191579136
      - bodyPart: 0
        mappedPosition:
          x:
            _serializedValue: 36554076
          y:
            _serializedValue: 15358029824
          z:
            _serializedValue: 1257056768
      deltaDisplacement:
        x:
          _serializedValue: 0
        y:
          _serializedValue: 0
        z:
          _serializedValue: 0
    - frame: 4
      hitBoxMaps:
      - bodyPart: 1
        mappedPosition:
          x:
            _serializedValue: 404007328
          y:
            _serializedValue: 25258131456
          z:
            _serializedValue: 1329766272
      - bodyPart: 2
        mappedPosition:
          x:
            _serializedValue: 437379744
          y:
            _serializedValue: 21990033408
          z:
            _serializedValue: 1563338624
      - bodyPart: 3
        mappedPosition:
          x:
            _serializedValue: 485758368
          y:
            _serializedValue: 17083284480
          z:
            _serializedValue: 1519604480
      - bodyPart: 4
        mappedPosition:
          x:
            _serializedValue: 3642006784
          y:
            _serializedValue: 23196911616
          z:
            _serializedValue: 1913299968
      - bodyPart: 5
        mappedPosition:
          x:
            _serializedValue: -2787338752
          y:
            _serializedValue: 23133278208
          z:
            _serializedValue: 1941392384
      - bodyPart: 6
        mappedPosition:
          x:
            _serializedValue: 4498568192
          y:
            _serializedValue: 19905388544
          z:
            _serializedValue: 1448095744
      - bodyPart: 7
        mappedPosition:
          x:
            _serializedValue: -4590010368
          y:
            _serializedValue: 22069907456
          z:
            _serializedValue: -779613184
      - bodyPart: 8
        mappedPosition:
          x:
            _serializedValue: 3702656512
          y:
            _serializedValue: 20538044416
          z:
            _serializedValue: -2660242688
      - bodyPart: 9
        mappedPosition:
          x:
            _serializedValue: -1425691904
          y:
            _serializedValue: 23080349696
          z:
            _serializedValue: -3402261760
      - bodyPart: 10
        mappedPosition:
          x:
            _serializedValue: 1275032192
          y:
            _serializedValue: 15010160640
          z:
            _serializedValue: 963243008
      - bodyPart: 11
        mappedPosition:
          x:
            _serializedValue: -1323816064
          y:
            _serializedValue: 15708951552
          z:
            _serializedValue: 1260985856
      - bodyPart: 12
        mappedPosition:
          x:
            _serializedValue: 2762222336
          y:
            _serializedValue: 11021281280
          z:
            _serializedValue: -3815035648
      - bodyPart: 13
        mappedPosition:
          x:
            _serializedValue: -2718223872
          y:
            _serializedValue: 17286029312
          z:
            _serializedValue: -4782498816
      - bodyPart: 14
        mappedPosition:
          x:
            _serializedValue: 1317828608
          y:
            _serializedValue: 6801009152
          z:
            _serializedValue: 261131904
      - bodyPart: 15
        mappedPosition:
          x:
            _serializedValue: -3092756992
          y:
            _serializedValue: 12471707648
          z:
            _serializedValue: -1150100992
      - bodyPart: 0
        mappedPosition:
          x:
            _serializedValue: 39200860
          y:
            _serializedValue: 15540443136
          z:
            _serializedValue: 1242675968
      deltaDisplacement:
        x:
          _serializedValue: 0
        y:
          _serializedValue: 0
        z:
          _serializedValue: 0
    - frame: 5
      hitBoxMaps:
      - bodyPart: 1
        mappedPosition:
          x:
            _serializedValue: 447334304
          y:
            _serializedValue: 25426350080
          z:
            _serializedValue: 1506419328
      - bodyPart: 2
        mappedPosition:
          x:
            _serializedValue: 476183840
          y:
            _serializedValue: 22153398272
          z:
            _serializedValue: 1658222592
      - bodyPart: 3
        mappedPosition:
          x:
            _serializedValue: 513210016
          y:
            _serializedValue: 17249171456
          z:
            _serializedValue: 1491886720
      - bodyPart: 4
        mappedPosition:
          x:
            _serializedValue: 3687303168
          y:
            _serializedValue: 23345025024
          z:
            _serializedValue: 2000847616
      - bodyPart: 5
        mappedPosition:
          x:
            _serializedValue: -2741411584
          y:
            _serializedValue: 23293069312
          z:
            _serializedValue: 2102031744
      - bodyPart: 6
        mappedPosition:
          x:
            _serializedValue: 4860032512
          y:
            _serializedValue: 20284805120
          z:
            _serializedValue: 979095552
      - bodyPart: 7
        mappedPosition:
          x:
            _serializedValue: -4552571904
          y:
            _serializedValue: 22594977792
          z:
            _serializedValue: -729332224
      - bodyPart: 8
        mappedPosition:
          x:
            _serializedValue: 3820195584
          y:
            _serializedValue: 21676296192
          z:
            _serializedValue: -2880264960
      - bodyPart: 9
        mappedPosition:
          x:
            _serializedValue: -1329448960
          y:
            _serializedValue: 23692525568
          z:
            _serializedValue: -3243102720
      - bodyPart: 10
        mappedPosition:
          x:
            _serializedValue: 1271645312
          y:
            _serializedValue: 15158269952
          z:
            _serializedValue: 959690752
      - bodyPart: 11
        mappedPosition:
          x:
            _serializedValue: -1315479680
          y:
            _serializedValue: 15893682176
          z:
            _serializedValue: 1271031296
      - bodyPart: 12
        mappedPosition:
          x:
            _serializedValue: 2465206528
          y:
            _serializedValue: 10703201280
          z:
            _serializedValue: -3476823040
      - bodyPart: 13
        mappedPosition:
          x:
            _serializedValue: -2527109888
          y:
            _serializedValue: 17706872832
          z:
            _serializedValue: -4745577472
      - bodyPart: 14
        mappedPosition:
          x:
            _serializedValue: 1017786560
          y:
            _serializedValue: 6332730880
          z:
            _serializedValue: 436754688
      - bodyPart: 15
        mappedPosition:
          x:
            _serializedValue: -3028888064
          y:
            _serializedValue: 12871442432
          z:
            _serializedValue: -1156823552
      - bodyPart: 0
        mappedPosition:
          x:
            _serializedValue: 45132380
          y:
            _serializedValue: 15708003328
          z:
            _serializedValue: 1242565760
      deltaDisplacement:
        x:
          _serializedValue: 0
        y:
          _serializedValue: 0
        z:
          _serializedValue: 0
    - frame: 6
      hitBoxMaps:
      - bodyPart: 1
        mappedPosition:
          x:
            _serializedValue: 494605600
          y:
            _serializedValue: 25582508032
          z:
            _serializedValue: 1669690880
      - bodyPart: 2
        mappedPosition:
          x:
            _serializedValue: 518354976
          y:
            _serializedValue: 22306742272
          z:
            _serializedValue: 1739698432
      - bodyPart: 3
        mappedPosition:
          x:
            _serializedValue: 543182976
          y:
            _serializedValue: 17408122880
          z:
            _serializedValue: 1451018752
      - bodyPart: 4
        mappedPosition:
          x:
            _serializedValue: 3735715840
          y:
            _serializedValue: 23483672576
          z:
            _serializedValue: 2074503424
      - bodyPart: 5
        mappedPosition:
          x:
            _serializedValue: -2691491840
          y:
            _serializedValue: 23440822272
          z:
            _serializedValue: 2249088256
      - bodyPart: 6
        mappedPosition:
          x:
            _serializedValue: 5164256768
          y:
            _serializedValue: 20775596032
          z:
            _serializedValue: 522145280
      - bodyPart: 7
        mappedPosition:
          x:
            _serializedValue: -4495367680
          y:
            _serializedValue: 23113332736
          z:
            _serializedValue: -653160448
      - bodyPart: 8
        mappedPosition:
          x:
            _serializedValue: 3806053120
          y:
            _serializedValue: 22844262400
          z:
            _serializedValue: -2911232768
      - bodyPart: 9
        mappedPosition:
          x:
            _serializedValue: -1213382656
          y:
            _serializedValue: 24283029504
          z:
            _serializedValue: -3055779584
      - bodyPart: 10
        mappedPosition:
          x:
            _serializedValue: 1270715264
          y:
            _serializedValue: 15300248576
          z:
            _serializedValue: 943185152
      - bodyPart: 11
        mappedPosition:
          x:
            _serializedValue: -1304028800
          y:
            _serializedValue: 16072195072
          z:
            _serializedValue: 1268398464
      - bodyPart: 12
        mappedPosition:
          x:
            _serializedValue: 2171619840
          y:
            _serializedValue: 10415203328
          z:
            _serializedValue: -3091605504
      - bodyPart: 13
        mappedPosition:
          x:
            _serializedValue: -2334986752
          y:
            _serializedValue: 18112532480
          z:
            _serializedValue: -4709008384
      - bodyPart: 14
        mappedPosition:
          x:
            _serializedValue: 716330880
          y:
            _serializedValue: 5861008896
          z:
            _serializedValue: 603466688
      - bodyPart: 15
        mappedPosition:
          x:
            _serializedValue: -2966467584
          y:
            _serializedValue: 13268938752
          z:
            _serializedValue: -1151882496
      - bodyPart: 0
        mappedPosition:
          x:
            _serializedValue: 53863008
          y:
            _serializedValue: 15869292544
          z:
            _serializedValue: 1229574656
      deltaDisplacement:
        x:
          _serializedValue: 0
        y:
          _serializedValue: 0
        z:
          _serializedValue: 0
    - frame: 7
      hitBoxMaps:
      - bodyPart: 1
        mappedPosition:
          x:
            _serializedValue: 534911264
          y:
            _serializedValue: 25718419456
          z:
            _serializedValue: 1830685440
      - bodyPart: 2
        mappedPosition:
          x:
            _serializedValue: 555565824
          y:
            _serializedValue: 22441891840
          z:
            _serializedValue: 1825316608
      - bodyPart: 3
        mappedPosition:
          x:
            _serializedValue: 571523456
          y:
            _serializedValue: 17551155200
          z:
            _serializedValue: 1424159232
      - bodyPart: 4
        mappedPosition:
          x:
            _serializedValue: 3777732864
          y:
            _serializedValue: 23607848960
          z:
            _serializedValue: 2152193024
      - bodyPart: 5
        mappedPosition:
          x:
            _serializedValue: -2647263488
          y:
            _serializedValue: 23566962688
          z:
            _serializedValue: 2395261696
      - bodyPart: 6
        mappedPosition:
          x:
            _serializedValue: 5489596416
          y:
            _serializedValue: 21291972608
          z:
            _serializedValue: 283915264
      - bodyPart: 7
        mappedPosition:
          x:
            _serializedValue: -4419867136
          y:
            _serializedValue: 23610626048
          z:
            _serializedValue: -544164352
      - bodyPart: 8
        mappedPosition:
          x:
            _serializedValue: 3990940928
          y:
            _serializedValue: 23839764480
          z:
            _serializedValue: -2745105920
      - bodyPart: 9
        mappedPosition:
          x:
            _serializedValue: -1074520576
          y:
            _serializedValue: 24842725376
          z:
            _serializedValue: -2825126144
      - bodyPart: 10
        mappedPosition:
          x:
            _serializedValue: 1271331712
          y:
            _serializedValue: 15428573184
          z:
            _serializedValue: 939150848
      - bodyPart: 11
        mappedPosition:
          x:
            _serializedValue: -1291726720
          y:
            _serializedValue: 16233236480
          z:
            _serializedValue: 1277110272
      - bodyPart: 12
        mappedPosition:
          x:
            _serializedValue: 1894356096
          y:
            _serializedValue: 10178240512
          z:
            _serializedValue: -2666500608
      - bodyPart: 13
        mappedPosition:
          x:
            _serializedValue: -2164867840
          y:
            _serializedValue: 18351929344
          z:
            _serializedValue: -4698177536
      - bodyPart: 14
        mappedPosition:
          x:
            _serializedValue: 351274112
          y:
            _serializedValue: 5504821760
          z:
            _serializedValue: 839231744
      - bodyPart: 15
        mappedPosition:
          x:
            _serializedValue: -2940211200
          y:
            _serializedValue: 13487878144
          z:
            _serializedValue: -1197871360
      - bodyPart: 0
        mappedPosition:
          x:
            _serializedValue: 63457376
          y:
            _serializedValue: 16014886912
          z:
            _serializedValue: 1228696192
      deltaDisplacement:
        x:
          _serializedValue: 0
        y:
          _serializedValue: 0
        z:
          _serializedValue: 0
    - frame: 8
      hitBoxMaps:
      - bodyPart: 1
        mappedPosition:
          x:
            _serializedValue: 575281408
          y:
            _serializedValue: 25837463552
          z:
            _serializedValue: 1984107008
      - bodyPart: 2
        mappedPosition:
          x:
            _serializedValue: 592352000
          y:
            _serializedValue: 22561900544
          z:
            _serializedValue: 1903457280
      - bodyPart: 3
        mappedPosition:
          x:
            _serializedValue: 598709888
          y:
            _serializedValue: 17681633280
          z:
            _serializedValue: 1390220544
      - bodyPart: 4
        mappedPosition:
          x:
            _serializedValue: 3819113728
          y:
            _serializedValue: 23717392384
          z:
            _serializedValue: 2222066688
      - bodyPart: 5
        mappedPosition:
          x:
            _serializedValue: -2602924032
          y:
            _serializedValue: 23676268544
          z:
            _serializedValue: 2533656064
      - bodyPart: 6
        mappedPosition:
          x:
            _serializedValue: 5869701120
          y:
            _serializedValue: 22011961344
          z:
            _serializedValue: 60855296
      - bodyPart: 7
        mappedPosition:
          x:
            _serializedValue: -4329308672
          y:
            _serializedValue: 24085989376
          z:
            _serializedValue: -405047296
      - bodyPart: 8
        mappedPosition:
          x:
            _serializedValue: 4066645760
          y:
            _serializedValue: 24948838400
          z:
            _serializedValue: -2395956992
      - bodyPart: 9
        mappedPosition:
          x:
            _serializedValue: -921600192
          y:
            _serializedValue: 25365032960
          z:
            _serializedValue: -2564621056
      - bodyPart: 10
        mappedPosition:
          x:
            _serializedValue: 1270849664
          y:
            _serializedValue: 15545021440
          z:
            _serializedValue: 928221184
      - bodyPart: 11
        mappedPosition:
          x:
            _serializedValue: -1280005248
          y:
            _serializedValue: 16382275584
          z:
            _serializedValue: 1279123968
      - bodyPart: 12
        mappedPosition:
          x:
            _serializedValue: 1613776384
          y:
            _serializedValue: 9966316544
          z:
            _serializedValue: -2188721152
      - bodyPart: 13
        mappedPosition:
          x:
            _serializedValue: -2001801216
          y:
            _serializedValue: 18581336064
          z:
            _serializedValue: -4687322624
      - bodyPart: 14
        mappedPosition:
          x:
            _serializedValue: -13302506
          y:
            _serializedValue: 5144931840
          z:
            _serializedValue: 1069955392
      - bodyPart: 15
        mappedPosition:
          x:
            _serializedValue: -2918354944
          y:
            _serializedValue: 13706970112
          z:
            _serializedValue: -1235829248
      - bodyPart: 0
        mappedPosition:
          x:
            _serializedValue: 72216672
          y:
            _serializedValue: 16148461568
          z:
            _serializedValue: 1220964480
      deltaDisplacement:
        x:
          _serializedValue: 0
        y:
          _serializedValue: 0
        z:
          _serializedValue: 0
    - frame: 9
      hitBoxMaps:
      - bodyPart: 1
        mappedPosition:
          x:
            _serializedValue: 603202560
          y:
            _serializedValue: 25929742336
          z:
            _serializedValue: 2127624448
      - bodyPart: 2
        mappedPosition:
          x:
            _serializedValue: 619794688
          y:
            _serializedValue: 22656475136
          z:
            _serializedValue: 1980789248
      - bodyPart: 3
        mappedPosition:
          x:
            _serializedValue: 621790848
          y:
            _serializedValue: 17787549696
          z:
            _serializedValue: 1369216256
      - bodyPart: 4
        mappedPosition:
          x:
            _serializedValue: 3849283840
          y:
            _serializedValue: 23806181376
          z:
            _serializedValue: 2292634624
      - bodyPart: 5
        mappedPosition:
          x:
            _serializedValue: -2569576704
          y:
            _serializedValue: 23757043712
          z:
            _serializedValue: 2662994944
      - bodyPart: 6
        mappedPosition:
          x:
            _serializedValue: 6191531520
          y:
            _serializedValue: 22538424320
          z:
            _serializedValue: 126785024
      - bodyPart: 7
        mappedPosition:
          x:
            _serializedValue: -4228513792
          y:
            _serializedValue: 24509038592
          z:
            _serializedValue: -246761984
      - bodyPart: 8
        mappedPosition:
          x:
            _serializedValue: 4311352320
          y:
            _serializedValue: 25696899072
          z:
            _serializedValue: -1971106048
      - bodyPart: 9
        mappedPosition:
          x:
            _serializedValue: -758766464
          y:
            _serializedValue: 25824520192
          z:
            _serializedValue: -2282084352
      - bodyPart: 10
        mappedPosition:
          x:
            _serializedValue: 1270656128
          y:
            _serializedValue: 15639409664
          z:
            _serializedValue: 927864320
      - bodyPart: 11
        mappedPosition:
          x:
            _serializedValue: -1269452160
          y:
            _serializedValue: 16504140800
          z:
            _serializedValue: 1289875200
      - bodyPart: 12
        mappedPosition:
          x:
            _serializedValue: 1411403008
          y:
            _serializedValue: 9859733504
          z:
            _serializedValue: -1816292352
      - bodyPart: 13
        mappedPosition:
          x:
            _serializedValue: -1864373632
          y:
            _serializedValue: 18695706624
          z:
            _serializedValue: -4693300224
      - bodyPart: 14
        mappedPosition:
          x:
            _serializedValue: -309094080
          y:
            _serializedValue: 4965334016
          z:
            _serializedValue: 1281586688
      - bodyPart: 15
        mappedPosition:
          x:
            _serializedValue: -2918317568
          y:
            _serializedValue: 13802733568
          z:
            _serializedValue: -1307989248
      - bodyPart: 0
        mappedPosition:
          x:
            _serializedValue: 80054880
          y:
            _serializedValue: 16257298432
          z:
            _serializedValue: 1223233664
      deltaDisplacement:
        x:
          _serializedValue: 0
        y:
          _serializedValue: 0
        z:
          _serializedValue: 0
    - frame: 10
      hitBoxMaps:
      - bodyPart: 1
        mappedPosition:
          x:
            _serializedValue: 632100352
          y:
            _serializedValue: 26015014912
          z:
            _serializedValue: 2264069888
      - bodyPart: 2
        mappedPosition:
          x:
            _serializedValue: 647843072
          y:
            _serializedValue: 22745374720
          z:
            _serializedValue: 2051195904
      - bodyPart: 3
        mappedPosition:
          x:
            _serializedValue: 644914816
          y:
            _serializedValue: 17889751040
          z:
            _serializedValue: 1341699072
      - bodyPart: 4
        mappedPosition:
          x:
            _serializedValue: 3879911168
          y:
            _serializedValue: 23889686528
          z:
            _serializedValue: 2356078080
      - bodyPart: 5
        mappedPosition:
          x:
            _serializedValue: -2535213312
          y:
            _serializedValue: 23830882304
          z:
            _serializedValue: 2785063424
      - bodyPart: 6
        mappedPosition:
          x:
            _serializedValue: 6459721216
          y:
            _serializedValue: 23090296832
          z:
            _serializedValue: 237160448
      - bodyPart: 7
        mappedPosition:
          x:
            _serializedValue: -4114985472
          y:
            _serializedValue: 24912427008
          z:
            _serializedValue: -64294400
      - bodyPart: 8
        mappedPosition:
          x:
            _serializedValue: 4430671360
          y:
            _serializedValue: 26403868672
          z:
            _serializedValue: -1440743424
      - bodyPart: 9
        mappedPosition:
          x:
            _serializedValue: -585162880
          y:
            _serializedValue: 26250778624
          z:
            _serializedValue: -1977764224
      - bodyPart: 10
        mappedPosition:
          x:
            _serializedValue: 1270620288
          y:
            _serializedValue: 15730596864
          z:
            _serializedValue: 921140480
      - bodyPart: 11
        mappedPosition:
          x:
            _serializedValue: -1258381184
          y:
            _serializedValue: 16622683136
          z:
            _serializedValue: 1294382464
      - bodyPart: 12
        mappedPosition:
          x:
            _serializedValue: 1200115584
          y:
            _serializedValue: 9769239552
          z:
            _serializedValue: -1405257984
      - bodyPart: 13
        mappedPosition:
          x:
            _serializedValue: -1738526848
          y:
            _serializedValue: 18802436096
          z:
            _serializedValue: -4703406592
      - bodyPart: 14
        mappedPosition:
          x:
            _serializedValue: -603274688
          y:
            _serializedValue: 4782544384
          z:
            _serializedValue: 1491767296
      - bodyPart: 15
        mappedPosition:
          x:
            _serializedValue: -2923034112
          y:
            _serializedValue: 13900168192
          z:
            _serializedValue: -1375189760
      - bodyPart: 0
        mappedPosition:
          x:
            _serializedValue: 88228192
          y:
            _serializedValue: 16362813440
          z:
            _serializedValue: 1219154560
      deltaDisplacement:
        x:
          _serializedValue: 0
        y:
          _serializedValue: 0
        z:
          _serializedValue: 0
    - frame: 11
      hitBoxMaps:
      - bodyPart: 1
        mappedPosition:
          x:
            _serializedValue: 641524480
          y:
            _serializedValue: 26064812032
          z:
            _serializedValue: 2381681920
      - bodyPart: 2
        mappedPosition:
          x:
            _serializedValue: 660899584
          y:
            _serializedValue: 22799179776
          z:
            _serializedValue: 2114532096
      - bodyPart: 3
        mappedPosition:
          x:
            _serializedValue: 660600192
          y:
            _serializedValue: 17955975168
          z:
            _serializedValue: 1324680448
      - bodyPart: 4
        mappedPosition:
          x:
            _serializedValue: 3893236480
          y:
            _serializedValue: 23943727104
          z:
            _serializedValue: 2415671808
      - bodyPart: 5
        mappedPosition:
          x:
            _serializedValue: -2518612224
          y:
            _serializedValue: 23867011072
          z:
            _serializedValue: 2888594688
      - bodyPart: 6
        mappedPosition:
          x:
            _serializedValue: 6650701824
          y:
            _serializedValue: 23374471168
          z:
            _serializedValue: 451857920
      - bodyPart: 7
        mappedPosition:
          x:
            _serializedValue: -4006671360
          y:
            _serializedValue: 25234116608
          z:
            _serializedValue: 113533696
      - bodyPart: 8
        mappedPosition:
          x:
            _serializedValue: 4628466688
          y:
            _serializedValue: 26789652480
          z:
            _serializedValue: -1017592576
      - bodyPart: 9
        mappedPosition:
          x:
            _serializedValue: -422535264
          y:
            _serializedValue: 26588782592
          z:
            _serializedValue: -1683968512
      - bodyPart: 10
        mappedPosition:
          x:
            _serializedValue: 1268670592
          y:
            _serializedValue: 15788484608
          z:
            _serializedValue: 921507328
      - bodyPart: 11
        mappedPosition:
          x:
            _serializedValue: -1251508864
          y:
            _serializedValue: 16701530112
          z:
            _serializedValue: 1303636352
      - bodyPart: 12
        mappedPosition:
          x:
            _serializedValue: 1112971520
          y:
            _serializedValue: 9767775232
          z:
            _serializedValue: -1242230784
      - bodyPart: 13
        mappedPosition:
          x:
            _serializedValue: -1645204864
          y:
            _serializedValue: 18837669888
          z:
            _serializedValue: -4716099584
      - bodyPart: 14
        mappedPosition:
          x:
            _serializedValue: -720335744
          y:
            _serializedValue: 4750909440
          z:
            _serializedValue: 1583039232
      - bodyPart: 15
        mappedPosition:
          x:
            _serializedValue: -2937886720
          y:
            _serializedValue: 13924635648
          z:
            _serializedValue: -1444498432
      - bodyPart: 0
        mappedPosition:
          x:
            _serializedValue: 92742240
          y:
            _serializedValue: 16431720448
          z:
            _serializedValue: 1221495936
      deltaDisplacement:
        x:
          _serializedValue: 0
        y:
          _serializedValue: 0
        z:
          _serializedValue: 0
    - frame: 12
      hitBoxMaps:
      - bodyPart: 1
        mappedPosition:
          x:
            _serializedValue: 651905536
          y:
            _serializedValue: 26112794624
          z:
            _serializedValue: 2496668928
      - bodyPart: 2
        mappedPosition:
          x:
            _serializedValue: 674672896
          y:
            _serializedValue: 22852063232
          z:
            _serializedValue: 2175371264
      - bodyPart: 3
        mappedPosition:
          x:
            _serializedValue: 676629632
          y:
            _serializedValue: 18022598656
          z:
            _serializedValue: 1305483264
      - bodyPart: 4
        mappedPosition:
          x:
            _serializedValue: 3907197696
          y:
            _serializedValue: 23997079552
          z:
            _serializedValue: 2472694272
      - bodyPart: 5
        mappedPosition:
          x:
            _serializedValue: -2501020160
          y:
            _serializedValue: 23901435904
          z:
            _serializedValue: 2989326336
      - bodyPart: 6
        mappedPosition:
          x:
            _serializedValue: 6815760896
          y:
            _serializedValue: 23663265792
          z:
            _serializedValue: 680186880
      - bodyPart: 7
        mappedPosition:
          x:
            _serializedValue: -3890191360
          y:
            _serializedValue: 25538811904
          z:
            _serializedValue: 310996736
      - bodyPart: 8
        mappedPosition:
          x:
            _serializedValue: 4759653888
          y:
            _serializedValue: 27151841280
          z:
            _serializedValue: -550448640
      - bodyPart: 9
        mappedPosition:
          x:
            _serializedValue: -254119360
          y:
            _serializedValue: 26900031488
          z:
            _serializedValue: -1373714176
      - bodyPart: 10
        mappedPosition:
          x:
            _serializedValue: 1267190400
          y:
            _serializedValue: 15847095296
          z:
            _serializedValue: 919783936
      - bodyPart: 11
        mappedPosition:
          x:
            _serializedValue: -1243953792
          y:
            _serializedValue: 16780999680
          z:
            _serializedValue: 1310864384
      - bodyPart: 12
        mappedPosition:
          x:
            _serializedValue: 1023561472
          y:
            _serializedValue: 9769630720
          z:
            _serializedValue: -1070175488
      - bodyPart: 13
        mappedPosition:
          x:
            _serializedValue: -1558402048
          y:
            _serializedValue: 18870173696
          z:
            _serializedValue: -4729979904
      - bodyPart: 14
        mappedPosition:
          x:
            _serializedValue: -836115456
          y:
            _serializedValue: 4717703680
          z:
            _serializedValue: 1674222080
      - bodyPart: 15
        mappedPosition:
          x:
            _serializedValue: -2955588096
          y:
            _serializedValue: 13950665728
          z:
            _serializedValue: -1511500288
      - bodyPart: 0
        mappedPosition:
          x:
            _serializedValue: 97818976
          y:
            _serializedValue: 16501271552
          z:
            _serializedValue: 1221752960
      deltaDisplacement:
        x:
          _serializedValue: 0
        y:
          _serializedValue: 0
        z:
          _serializedValue: 0
    - frame: 13
      hitBoxMaps:
      - bodyPart: 1
        mappedPosition:
          x:
            _serializedValue: 634333184
          y:
            _serializedValue: 26123440128
          z:
            _serializedValue: 2581759232
      - bodyPart: 2
        mappedPosition:
          x:
            _serializedValue: 666642944
          y:
            _serializedValue: 22866941952
          z:
            _serializedValue: 2220815616
      - bodyPart: 3
        mappedPosition:
          x:
            _serializedValue: 681168768
          y:
            _serializedValue: 18048413696
          z:
            _serializedValue: 1292363520
      - bodyPart: 4
        mappedPosition:
          x:
            _serializedValue: 3896506624
          y:
            _serializedValue: 24019134464
          z:
            _serializedValue: 2519327232
      - bodyPart: 5
        mappedPosition:
          x:
            _serializedValue: -2509261568
          y:
            _serializedValue: 23895676928
          z:
            _serializedValue: 3059906304
      - bodyPart: 6
        mappedPosition:
          x:
            _serializedValue: 6857663488
          y:
            _serializedValue: 23733231616
          z:
            _serializedValue: 806422528
      - bodyPart: 7
        mappedPosition:
          x:
            _serializedValue: -3799607808
          y:
            _serializedValue: 25745831936
          z:
            _serializedValue: 472208640
      - bodyPart: 8
        mappedPosition:
          x:
            _serializedValue: 4820088832
          y:
            _serializedValue: 27255875584
          z:
            _serializedValue: -356101120
      - bodyPart: 9
        mappedPosition:
          x:
            _serializedValue: -122670776
          y:
            _serializedValue: 27114582016
          z:
            _serializedValue: -1114875648
      - bodyPart: 10
        mappedPosition:
          x:
            _serializedValue: 1260843136
          y:
            _serializedValue: 15867758592
          z:
            _serializedValue: 919448832
      - bodyPart: 11
        mappedPosition:
          x:
            _serializedValue: -1244387456
          y:
            _serializedValue: 16814770176
          z:
            _serializedValue: 1316906496
      - bodyPart: 12
        mappedPosition:
          x:
            _serializedValue: 1014599680
          y:
            _serializedValue: 9875636224
          z:
            _serializedValue: -1314096896
      - bodyPart: 13
        mappedPosition:
          x:
            _serializedValue: -1522832640
          y:
            _serializedValue: 18865942528
          z:
            _serializedValue: -4738707456
      - bodyPart: 14
        mappedPosition:
          x:
            _serializedValue: -733352704
          y:
            _serializedValue: 4991757824
          z:
            _serializedValue: 1785015552
      - bodyPart: 15
        mappedPosition:
          x:
            _serializedValue: -2977495552
          y:
            _serializedValue: 13951441920
          z:
            _serializedValue: -1538088704
      - bodyPart: 0
        mappedPosition:
          x:
            _serializedValue: 95751008
          y:
            _serializedValue: 16528902144
          z:
            _serializedValue: 1222782976
      deltaDisplacement:
        x:
          _serializedValue: 0
        y:
          _serializedValue: 0
        z:
          _serializedValue: 0
    - frame: 14
      hitBoxMaps:
      - bodyPart: 1
        mappedPosition:
          x:
            _serializedValue: 615268096
          y:
            _serializedValue: 26132830208
          z:
            _serializedValue: 2666680064
      - bodyPart: 2
        mappedPosition:
          x:
            _serializedValue: 657001984
          y:
            _serializedValue: 22881067008
          z:
            _serializedValue: 2266160896
      - bodyPart: 3
        mappedPosition:
          x:
            _serializedValue: 683901568
          y:
            _serializedValue: 18074212352
          z:
            _serializedValue: 1279314176
      - bodyPart: 4
        mappedPosition:
          x:
            _serializedValue: 3884165376
          y:
            _serializedValue: 24040486912
          z:
            _serializedValue: 2565871616
      - bodyPart: 5
        mappedPosition:
          x:
            _serializedValue: -2518949120
          y:
            _serializedValue: 23888809984
          z:
            _serializedValue: 3130185472
      - bodyPart: 6
        mappedPosition:
          x:
            _serializedValue: 6894999552
          y:
            _serializedValue: 23802075136
          z:
            _serializedValue: 934223360
      - bodyPart: 7
        mappedPosition:
          x:
            _serializedValue: -3707717632
          y:
            _serializedValue: 25938993152
          z:
            _serializedValue: 646672896
      - bodyPart: 8
        mappedPosition:
          x:
            _serializedValue: 4871580160
          y:
            _serializedValue: 27355676672
          z:
            _serializedValue: -156590080
      - bodyPart: 9
        mappedPosition:
          x:
            _serializedValue: 7958873
          y:
            _serializedValue: 27310221312
          z:
            _serializedValue: -845193984
      - bodyPart: 10
        mappedPosition:
          x:
            _serializedValue: 1252786304
          y:
            _serializedValue: 15888567296
          z:
            _serializedValue: 919224832
      - bodyPart: 11
        mappedPosition:
          x:
            _serializedValue: -1246448256
          y:
            _serializedValue: 16848623616
          z:
            _serializedValue: 1323076352
      - bodyPart: 12
        mappedPosition:
          x:
            _serializedValue: 972938368
          y:
            _serializedValue: 9979501568
          z:
            _serializedValue: -1521989120
      - bodyPart: 13
        mappedPosition:
          x:
            _serializedValue: -1488505088
          y:
            _serializedValue: 18861713408
          z:
            _serializedValue: -4746864640
      - bodyPart: 14
        mappedPosition:
          x:
            _serializedValue: -630277760
          y:
            _serializedValue: 5263738880
          z:
            _serializedValue: 1899033472
      - bodyPart: 15
        mappedPosition:
          x:
            _serializedValue: -2999835648
          y:
            _serializedValue: 13952470016
          z:
            _serializedValue: -1564487936
      - bodyPart: 0
        mappedPosition:
          x:
            _serializedValue: 92003936
          y:
            _serializedValue: 16556630016
          z:
            _serializedValue: 1223918720
      deltaDisplacement:
        x:
          _serializedValue: 0
        y:
          _serializedValue: 0
        z:
          _serializedValue: 0
    - frame: 15
      hitBoxMaps:
      - bodyPart: 1
        mappedPosition:
          x:
            _serializedValue: 508072480
          y:
            _serializedValue: 26156320768
          z:
            _serializedValue: 2649125888
      - bodyPart: 2
        mappedPosition:
          x:
            _serializedValue: 568360704
          y:
            _serializedValue: 22903517184
          z:
            _serializedValue: 2259589888
      - bodyPart: 3
        mappedPosition:
          x:
            _serializedValue: 622921600
          y:
            _serializedValue: 18093592576
          z:
            _serializedValue: 1288959744
      - bodyPart: 4
        mappedPosition:
          x:
            _serializedValue: 3788762880
          y:
            _serializedValue: 24082094080
          z:
            _serializedValue: 2557272576
      - bodyPart: 5
        mappedPosition:
          x:
            _serializedValue: -2613731584
          y:
            _serializedValue: 23896256512
          z:
            _serializedValue: 3118364672
      - bodyPart: 6
        mappedPosition:
          x:
            _serializedValue: 6774096896
          y:
            _serializedValue: 23860711424
          z:
            _serializedValue: 877088768
      - bodyPart: 7
        mappedPosition:
          x:
            _serializedValue: -3744306688
          y:
            _serializedValue: 26044700672
          z:
            _serializedValue: 691382784
      - bodyPart: 8
        mappedPosition:
          x:
            _serializedValue: 4730915328
          y:
            _serializedValue: 27398109184
          z:
            _serializedValue: -229448192
      - bodyPart: 9
        mappedPosition:
          x:
            _serializedValue: -35129708
          y:
            _serializedValue: 27489036288
          z:
            _serializedValue: -746693056
      - bodyPart: 10
        mappedPosition:
          x:
            _serializedValue: 1249781120
          y:
            _serializedValue: 15924684800
          z:
            _serializedValue: 923955968
      - bodyPart: 11
        mappedPosition:
          x:
            _serializedValue: -1275494784
          y:
            _serializedValue: 16818660352
          z:
            _serializedValue: 1317376000
      - bodyPart: 12
        mappedPosition:
          x:
            _serializedValue: 1006387712
          y:
            _serializedValue: 10313609216
          z:
            _serializedValue: -2143863168
      - bodyPart: 13
        mappedPosition:
          x:
            _serializedValue: -1761792384
          y:
            _serializedValue: 18703527936
          z:
            _serializedValue: -4779024896
      - bodyPart: 14
        mappedPosition:
          x:
            _serializedValue: -93844272
          y:
            _serializedValue: 6028864000
          z:
            _serializedValue: 1972268800
      - bodyPart: 15
        mappedPosition:
          x:
            _serializedValue: -3112253952
          y:
            _serializedValue: 13805317120
          z:
            _serializedValue: -1508534016
      - bodyPart: 0
        mappedPosition:
          x:
            _serializedValue: 70548320
          y:
            _serializedValue: 16561530880
          z:
            _serializedValue: 1224626048
      deltaDisplacement:
        x:
          _serializedValue: 0
        y:
          _serializedValue: 0
        z:
          _serializedValue: 0
    - frame: 16
      hitBoxMaps:
      - bodyPart: 1
        mappedPosition:
          x:
            _serializedValue: 395506176
          y:
            _serializedValue: 26170863616
          z:
            _serializedValue: 2631766016
      - bodyPart: 2
        mappedPosition:
          x:
            _serializedValue: 474289696
          y:
            _serializedValue: 22917150720
          z:
            _serializedValue: 2253256192
      - bodyPart: 3
        mappedPosition:
          x:
            _serializedValue: 556436608
          y:
            _serializedValue: 18104363008
          z:
            _serializedValue: 1298913280
      - bodyPart: 4
        mappedPosition:
          x:
            _serializedValue: 3687844352
          y:
            _serializedValue: 24114802688
          z:
            _serializedValue: 2548822272
      - bodyPart: 5
        mappedPosition:
          x:
            _serializedValue: -2713841664
          y:
            _serializedValue: 23894892544
          z:
            _serializedValue: 3106826752
      - bodyPart: 6
        mappedPosition:
          x:
            _serializedValue: 6646750208
          y:
            _serializedValue: 23910103040
          z:
            _serializedValue: 820464640
      - bodyPart: 7
        mappedPosition:
          x:
            _serializedValue: -3785943552
          y:
            _serializedValue: 26137559040
          z:
            _serializedValue: 739274496
      - bodyPart: 8
        mappedPosition:
          x:
            _serializedValue: 4583080960
          y:
            _serializedValue: 27430569984
          z:
            _serializedValue: -301930240
      - bodyPart: 9
        mappedPosition:
          x:
            _serializedValue: -83547760
          y:
            _serializedValue: 27653824512
          z:
            _serializedValue: -641089408
      - bodyPart: 10
        mappedPosition:
          x:
            _serializedValue: 1240804992
          y:
            _serializedValue: 15953707008
          z:
            _serializedValue: 929245184
      - bodyPart: 11
        mappedPosition:
          x:
            _serializedValue: -1308700544
          y:
            _serializedValue: 16780985344
          z:
            _serializedValue: 1312143872
      - bodyPart: 12
        mappedPosition:
          x:
            _serializedValue: 943058432
          y:
            _serializedValue: 10627713024
          z:
            _serializedValue: -2606294528
      - bodyPart: 13
        mappedPosition:
          x:
            _serializedValue: -2022447744
          y:
            _serializedValue: 18542618624
          z:
            _serializedValue: -4798706176
      - bodyPart: 14
        mappedPosition:
          x:
            _serializedValue: 427033760
          y:
            _serializedValue: 6804535296
          z:
            _serializedValue: 2044420480
      - bodyPart: 15
        mappedPosition:
          x:
            _serializedValue: -3221244416
          y:
            _serializedValue: 13656352768
          z:
            _serializedValue: -1452122624
      - bodyPart: 0
        mappedPosition:
          x:
            _serializedValue: 43987292
          y:
            _serializedValue: 16558878720
          z:
            _serializedValue: 1225820032
      deltaDisplacement:
        x:
          _serializedValue: 0
        y:
          _serializedValue: 0
        z:
          _serializedValue: 0
    - frame: 17
      hitBoxMaps:
      - bodyPart: 1
        mappedPosition:
          x:
            _serializedValue: 207638272
          y:
            _serializedValue: 26226728960
          z:
            _serializedValue: 2454521856
      - bodyPart: 2
        mappedPosition:
          x:
            _serializedValue: 304967168
          y:
            _serializedValue: 22965534720
          z:
            _serializedValue: 2152448512
      - bodyPart: 3
        mappedPosition:
          x:
            _serializedValue: 418008224
          y:
            _serializedValue: 18132353024
          z:
            _serializedValue: 1310991488
      - bodyPart: 4
        mappedPosition:
          x:
            _serializedValue: 3510167552
          y:
            _serializedValue: 24185397248
          z:
            _serializedValue: 2447906560
      - bodyPart: 5
        mappedPosition:
          x:
            _serializedValue: -2895070208
          y:
            _serializedValue: 23947239424
          z:
            _serializedValue: 2955423232
      - bodyPart: 6
        mappedPosition:
          x:
            _serializedValue: 6416386560
          y:
            _serializedValue: 24036300800
          z:
            _serializedValue: 626946048
      - bodyPart: 7
        mappedPosition:
          x:
            _serializedValue: -3974884864
          y:
            _serializedValue: 26187196416
          z:
            _serializedValue: 588811520
      - bodyPart: 8
        mappedPosition:
          x:
            _serializedValue: 4317054976
          y:
            _serializedValue: 27530076160
          z:
            _serializedValue: -512590080
      - bodyPart: 9
        mappedPosition:
          x:
            _serializedValue: -339345024
          y:
            _serializedValue: 27861319680
          z:
            _serializedValue: -786809664
      - bodyPart: 10
        mappedPosition:
          x:
            _serializedValue: 1236488064
          y:
            _serializedValue: 16033506304
          z:
            _serializedValue: 916975872
      - bodyPart: 11
        mappedPosition:
          x:
            _serializedValue: -1364390528
          y:
            _serializedValue: 16700116992
          z:
            _serializedValue: 1266313472
      - bodyPart: 12
        mappedPosition:
          x:
            _serializedValue: 1014450560
          y:
            _serializedValue: 11264285696
          z:
            _serializedValue: -3344492032
      - bodyPart: 13
        mappedPosition:
          x:
            _serializedValue: -2638936832
          y:
            _serializedValue: 18159282176
          z:
            _serializedValue: -4833002496
      - bodyPart: 14
        mappedPosition:
          x:
            _serializedValue: 1203379200
          y:
            _serializedValue: 8044800512
          z:
            _serializedValue: 1765433088
      - bodyPart: 15
        mappedPosition:
          x:
            _serializedValue: -3448865280
          y:
            _serializedValue: 13336454144
          z:
            _serializedValue: -1283822848
      - bodyPart: 0
        mappedPosition:
          x:
            _serializedValue: 491864
          y:
            _serializedValue: 16560679936
          z:
            _serializedValue: 1201517696
      deltaDisplacement:
        x:
          _serializedValue: 0
        y:
          _serializedValue: 0
        z:
          _serializedValue: 0
    clip: {fileID: 7400000, guid: a80c982b3db1145e7a355a5db6a756d2, type: 2}
    customHitBoxDefinition: {fileID: 0}
    length:
      _serializedValue: 1288490368
    bakeSpeed: 1
    hitBoxDefinitionType: 0
  _animationSpeed:
    _serializedValue: 4294967296
  wrapMode: 0
  characterPrefab: {fileID: 1272366937168992, guid: 01b0a963f13679544a22d6e63d5256c6,
    type: 3}
  moveName: All man Super Jump
  description: Man Super Jump
  fps: 60
  ignoreGravity: 0
  ignoreFriction: 0
  cancelMoveWhenLanding: 0
  landingMoveLink: {fileID: 0}
  forceMirrorLeft: 0
  forceMirrorRight: 0
  invertRotationLeft: 0
  invertRotationRight: 0
  autoCorrectRotation: 0
  allowSideSwitch: 0
  frameWindowRotation: 0
  cooldown: 0
  cooldownFrames: 0
  disableHeadLook: 1
  speedKeyFrameToggle: 0
  fixedSpeed: 1
  animSpeedKeyFrame: []
  totalFrames: 18
  startUpFrames: 19
  activeFrames: -18
  recoveryFrames: 23
  applyRootMotion: 0
  lockXMotion: 0
  lockYMotion: 0
  lockZMotion: 0
  forceGrounded: 0
  rootMotionNode: 0
  overrideBlendingIn: 0
  overrideBlendingOut: 1
  _blendingIn:
    _serializedValue: 0
  _blendingOut:
    _serializedValue: 2147483648
  defaultInputs:
    chargeMove: 0
    _chargeTiming:
      _serializedValue: 3006477056
    allowInputLeniency: 0
    allowNegativeEdge: 1
    forceAxisPrecision: 0
    leniencyBuffer: 3
    onReleaseExecution: 0
    requireButtonPress: 1
    onPressExecution: 1
    buttonSequence: 03000000
    buttonExecution: 02000000
    editorToggle: 0
    buttonSequenceToggle: 0
    buttonExecutionToggle: 0
  altInputs:
    chargeMove: 0
    _chargeTiming:
      _serializedValue: 3006477107
    allowInputLeniency: 0
    allowNegativeEdge: 1
    forceAxisPrecision: 0
    leniencyBuffer: 3
    onReleaseExecution: 0
    requireButtonPress: 1
    onPressExecution: 1
    buttonSequence: 
    buttonExecution: 
    editorToggle: 0
    buttonSequenceToggle: 0
    buttonExecutionToggle: 0
  previousMoves: []
  opponentConditions:
    basicMoveLimitation: 
    possibleMoveStates: []
    basicMovesToggle: 0
    statesToggle: 0
  selfConditions:
    basicMoveLimitation: 
    possibleMoveStates:
    - possibleState: 0
      jumpArc: 0
      jumpArcBegins: 0
      jumpArcEnds: 100
      opponentDistance: 0
      proximityRangeBegins: 0
      proximityRangeEnds: 100
      movingForward: 1
      movingBack: 1
      standBy: 1
      blocking: 0
      blockStunned: 0
      stunned: 0
      resetStunValue: 0
    - possibleState: 1
      jumpArc: 0
      jumpArcBegins: 0
      jumpArcEnds: 100
      opponentDistance: 0
      proximityRangeBegins: 0
      proximityRangeEnds: 100
      movingForward: 1
      movingBack: 1
      standBy: 1
      blocking: 0
      blockStunned: 0
      stunned: 0
      resetStunValue: 0
    basicMovesToggle: 0
    statesToggle: 1
  moveClassification:
    attackType: 0
    hitType: 0
    startupSpeed: 0
    recoverySpeed: 0
    hitConfirmType: 0
    preferableDistance: 0
    gaugeUsage: 0
    anyAttackType: 1
    anyHitType: 1
    anyHitConfirmType: 1
  frameLinks:
  - linkType: 2
    allowBuffer: 1
    onStrike: 1
    onBlock: 1
    onParry: 1
    activeFramesBegins: 1
    activeFramesEnds: 17
    counterMoveType: 0
    counterMoveFilter: {fileID: 0}
    disableHitImpact: 1
    anyHitStrength: 1
    hitStrength: 0
    anyStrokeHitBox: 1
    hitBoxType: 0
    anyHitType: 1
    hitType: 0
    ignoreInputs: 0
    ignorePlayerConditions: 0
    ignoreGauge: 0
    nextMoveStartupFrame: 1
    linkableMoves:
    - {fileID: 11400000, guid: 20e8ec3c15e3744dca4a68c1cfa77c53, type: 2}
    - {fileID: 11400000, guid: f74526133dc874f4b967792c7eb1e1b2, type: 2}
    - {fileID: 11400000, guid: 9a969e2e5487f48ea9883dca77eae76f, type: 2}
    linkableMovesToggle: 1
    hitConfirmToggle: 0
    counterMoveToggle: 0
  gauges:
  - castingFrame: 0
    targetGauge: 0
    startDrainingGauge: 0
    inhibitGainWhileDraining: 0
    stopDrainingGauge: 0
    _gaugeDPS:
      _serializedValue: 0
    _totalDrain:
      _serializedValue: 0
    _gaugeRequired:
      _serializedValue: 0
    _gaugeUsage:
      _serializedValue: 0
    _gaugeGainOnMiss:
      _serializedValue: 0
    _gaugeGainOnHit:
      _serializedValue: 0
    _gaugeGainOnBlock:
      _serializedValue: 0
    _opGaugeGainOnBlock:
      _serializedValue: 0
    _opGaugeGainOnParry:
      _serializedValue: 0
    _opGaugeGainOnHit:
      _serializedValue: 0
    DCMove: {fileID: 0}
    DCStance: 0
    editorToggle: 0
  sortOrder: []
  particleEffects: []
  appliedForces:
  - castingFrame: 4
    resetPreviousVertical: 1
    resetPreviousHorizontal: 1
    affectAssists: 0
    affectCharacter: 1
    _force:
      x:
        _serializedValue: 30064771072
      y:
        _serializedValue: 257698037760
      z:
        _serializedValue: 0
  opAppliedForces: []
  slowMoEffects: []
  bodyPartVisibilityChanges: []
  opponentOverride: []
  characterAssist: []
  soundEffects:
  - castingFrame: 0
    sounds:
    - {fileID: 8300000, guid: e32c7ec45428f427bbce0d9fa457e77e, type: 3}
    soundEffectsToggle: 1
  inGameAlert: []
  stanceChanges: []
  cameraMovements: []
  hits: []
  blockableArea:
    enabled: 1
    activeFramesBegin: 14
    activeFramesEnds: 52
    bodyPart: 2
    hitBoxDefinitionIndex: 0
    shape: 0
    rect:
      serializedVersion: 2
      x: 0
      y: 0
      width: 4
      height: 4
    _rect:
      _x:
        _serializedValue: 0
      _y:
        _serializedValue: 0
      topRight:
        x:
          _serializedValue: 0
        y:
          _serializedValue: 0
        z:
          _serializedValue: 0
      topLeft:
        x:
          _serializedValue: 0
        y:
          _serializedValue: 0
        z:
          _serializedValue: 0
      bottomRight:
        x:
          _serializedValue: 0
        y:
          _serializedValue: 0
        z:
          _serializedValue: 0
      bottomLeft:
        x:
          _serializedValue: 0
        y:
          _serializedValue: 0
        z:
          _serializedValue: 0
      width:
        _serializedValue: 0
      height:
        _serializedValue: 0
      xMax:
        _serializedValue: 0
      yMax:
        _serializedValue: 0
    followXBounds: 0
    followYBounds: 0
    _radius:
      _serializedValue: 25769803776
    _offSet:
      x:
        _serializedValue: 0
      y:
        _serializedValue: 0
      z:
        _serializedValue: 0
    cuboidMin:
      x:
        _serializedValue: 0
      y:
        _serializedValue: 0
      z:
        _serializedValue: 0
    cuboidMax:
      x:
        _serializedValue: 0
      y:
        _serializedValue: 0
      z:
        _serializedValue: 0
    position:
      x:
        _serializedValue: 0
      y:
        _serializedValue: 0
      z:
        _serializedValue: 0
  lockOnTargets: []
  switchCharacterOptions: []
  invincibleBodyParts: []
  stateOverride: []
  armorOptions:
    activeFramesBegin: 0
    activeFramesEnds: 0
    overrideHitEffects: 0
    blockHits: 0
    hitEffects:
      hitParticle: {fileID: 0}
      killTime: 0
      hitSound: {fileID: 0}
      spawnPoint: 1
      _freezingTime:
        _serializedValue: 0
      _animationSpeed:
        _serializedValue: 429496736
      autoHitStop: 1
      sticky: 0
      _hitStop:
        _serializedValue: 429496736
      mirrorOn2PSide: 0
      shakeCharacterOnHit: 1
      shakeCameraOnHit: 1
      _shakeDensity:
        _serializedValue: 3435973888
      _shakeCameraDensity:
        _serializedValue: 3435973836
      editorToggle: 0
    hitAbsorption: 0
    damageAbsorption: 0
    nonAffectedBodyParts: 
  projectiles: []
  rotationPreview: {x: 0, y: 90, z: 0}
