%YAML 1.1
%TAG !u! tag:unity3d.com,2011:
--- !u!114 &11400000
MonoBehaviour:
  m_ObjectHideFlags: 0
  m_CorrespondingSourceObject: {fileID: 0}
  m_PrefabInstance: {fileID: 0}
  m_PrefabAsset: {fileID: 0}
  m_GameObject: {fileID: 0}
  m_Enabled: 1
  m_EditorHideFlags: 0
  m_Script: {fileID: 11500000, guid: 7a72eb99efd94a347a4ab4cc0376dbb1, type: 3}
  m_Name: Satoshi_Fight_Club
  m_EditorClassIdentifier: 
  version: 2
  player1Character: {fileID: 0}
  player2Character: {fileID: 0}
  player1Team:
  - {fileID: 11400000, guid: 573f29652f969dd429ee24d097b56bc0, type: 2}
  - {fileID: 11400000, guid: 5d6dc227d62e62a40af291dbbd4c5276, type: 2}
  - {fileID: 11400000, guid: d6338f103bbb0da46ba6acf3b027f17a, type: 2}
  player2Team:
  - {fileID: 11400000, guid: ac6ffbd93fffdbb47a2a75f1f84ecd37, type: 2}
  - {fileID: 11400000, guid: 5d6dc227d62e62a40af291dbbd4c5276, type: 2}
  - {fileID: 11400000, guid: 54057043117984643925ed339c232c0d, type: 2}
  selectedStage:
    stageName: Training Room (Prefab)
    stageLoadingMethod: 0
    stagePath: 
    screenshot: {fileID: 2800000, guid: 3f68cd3743dce4909a60f6354fb575fa, type: 3}
    prefab: {fileID: 7259010295428217826, guid: 653923bf885a745419475b4e6d3f967b,
      type: 3}
    music: {fileID: 8300000, guid: 0a8021cfa80f24cb2aaf8a8ca1d60520, type: 3}
    _groundFriction:
      _serializedValue: 429496729600
    _leftBoundary:
      _serializedValue: -158913789952
    _rightBoundary:
      _serializedValue: 158913789952
    position:
      x:
        _serializedValue: 0
      y:
        _serializedValue: 0
      z:
        _serializedValue: 0
  gameName: 2D Fighter Example
  gameplayType: 0
  selectedLanguage:
    languageName: English
    start: Start
    options: Options
    credits: Credits
    selectYourCharacter: Select Your Character
    selectYourStage: Select Your Stage
    round: Round %round%
    finalRound: Final Round
    fight: Fight!
    firstHit: First Hit!
    combo: '%combo% hit combo!'
    parry: Parry!
    counterHit: Counter!
    victory: '%character% wins!'
    challengeBegins: Start!
    challengeEnds: Success!
    timeOver: Time Over
    perfect: Perfect!
    rematch: Rematch
    quit: Quit
    ko: K.O.
    draw: Draw
    defaultSelection: 1
  gameGUI:
    hasGauge: 1
    screenFadeDuration:
      _serializedValue: 2147483648
    gameFadeDuration:
      _serializedValue: 4294967296
    roundFadeDuration:
      _serializedValue: 2147483648
    screenFadeColor: {r: 0, g: 0, b: 0, a: 1}
    gameFadeColor: {r: 1, g: 1, b: 1, a: 1}
    roundFadeColor: {r: 0, g: 0, b: 0, a: 1}
    useCanvasScaler: 1
    canvasScaler:
      defaultSpriteDPI: 96
      fallbackScreenDPI: 96
      matchWidthOrHeight: 0.5
      physicalUnit: 3
      referencePixelsPerUnit: 100
      referenceResolution: {x: 1920, y: 1080}
      scaleFactor: 1
      screenMatchMode: 1
      scaleMode: 1
    introScreen: {fileID: 11400002, guid: 13b99c79eef784ed188978d675abe8fc, type: 3}
    mainMenuScreen: {fileID: 11400002, guid: 5ae2a078222193e4ca9658f7044c53ad, type: 3}
    optionsScreen: {fileID: 11400056, guid: 2737f2cf99cd3416b9a9d13df2abbe04, type: 3}
    creditsScreen: {fileID: 11400010, guid: aa93c5bcd99024642a42c5a1f110eeb1, type: 3}
    pauseScreen: {fileID: 11400000, guid: 6241d31f6482b42a88a8e7c8b62e2716, type: 3}
    characterSelectionScreen: {fileID: 11400026, guid: 044e38aaf7ac94e0fa12cf4125faf378,
      type: 3}
    teamSelectionScreen: {fileID: 0}
    stageSelectionScreen: {fileID: 11400008, guid: 4e1ca63af339f4c6b84a167dd4fc7ede,
      type: 3}
    loadingBattleScreen: {fileID: 11400008, guid: 238b7713a35be4f919fcef89a9d43a23,
      type: 3}
    battleGUI: {fileID: 11400032, guid: 7b1be4ee7b5ed438f831c6ff0194fa54, type: 3}
    storyModeContinueScreen: {fileID: 11400018, guid: 979dfe6c6baae4df1ae04fdbd4bcbff1,
      type: 3}
    storyModeGameOverScreen: {fileID: 11400004, guid: 79e43a319a85a4c7ea68f019b05163cc,
      type: 3}
    storyModeCongratulationsScreen: {fileID: 11400002, guid: a49fe14e0eee247a9a37e3b60f3ba43c,
      type: 3}
    versusModeScreen: {fileID: 11400002, guid: 6fdc52782d12e4326bba5e38d46c1a6d, type: 3}
    versusModeAfterBattleScreen: {fileID: 11400022, guid: faff96cd836074bcf89bbe5e914bfd28,
      type: 3}
    challengeModeScreen: {fileID: 7082322167716509983, guid: 6fe84af768cedd240bcffa7356ca9ccf,
      type: 3}
    challengeModeOverlay: {fileID: 8654781917466002062, guid: 95508208faac9b044bbff3f0b9d4a801,
      type: 3}
    challengeModeAfterBattleScreen: {fileID: -6250319895440792964, guid: 53d723a65a7cda64e8378227002c9eb7,
      type: 3}
    connectionLostScreen: {fileID: 11400056, guid: b7dfceca5ceb74e21acc87a67266dd9c,
      type: 3}
    replayTools: {fileID: 5718944953315841217, guid: f7b89f06da72baa4ea79bfba7192ac81,
      type: 3}
    hostGameScreen: {fileID: 11400056, guid: 20827629319bf498baddba260447ef19, type: 3}
    joinGameScreen: {fileID: 11400056, guid: 589cc9185deee47bfab715e2b150de86, type: 3}
    networkOptionsScreen: {fileID: 3765330613820590689, guid: 0ddc9cef5c9874f4da993c4a29b44ec7,
      type: 3}
    roomMatchScreen: {fileID: 11400056, guid: 1c549561c9df3fd4aa8093097fad8855, type: 3}
    bluetoothGameScreen: {fileID: 11452450, guid: eca2a5fbf89b74f2ca90a8e7b2315da3,
      type: 3}
    bluetoothHostGameScreen: {fileID: 4680136479829771402, guid: 85ad8d4baa8a14ed6a360c272b165094,
      type: 3}
    bluetoothJoinGameScreen: {fileID: 1280977612704507517, guid: 4ef139d7b4fcc405d969d2c14596b826,
      type: 3}
    randomMatchScreen: {fileID: 11465242, guid: 7a59eda27876247fbb0780cb1cd96a82,
      type: 3}
    searchMatchScreen: {fileID: 114939548062205918, guid: 225082b9f66e99f49882494921e238c1,
      type: 3}
    onlineModeAfterBattleScreen: {fileID: 3037139450037907122, guid: 091e344efe34e334cace17124d4c47ed,
      type: 3}
  storyMode:
    useSameStoryForAllCharacters: 1
    canCharactersFightAgainstThemselves: 1
    defaultStory:
      opening: {fileID: 11400004, guid: 40c65adfe829a4a59bf7fc39d9560079, type: 3}
      ending: {fileID: 11400004, guid: bb6bf06c538904fd8bce94fe3390c7e4, type: 3}
      fightsGroups:
      - maxFights: 3
        mode: 1
        name: Random Fights
        opponents:
        - conversationBeforeBattle: {fileID: 11400004, guid: 9994f2f4c6d0c4bbaadbe0fd864bec81,
            type: 3}
          conversationAfterBattle: {fileID: 11400004, guid: d9ebcacaabc5e44bba98188d32b0a703,
            type: 3}
          opponentCharacterIndex: 1
          possibleStagesIndexes: 000000000100000002000000030000000400000005000000
        - conversationBeforeBattle: {fileID: 11400004, guid: 9994f2f4c6d0c4bbaadbe0fd864bec81,
            type: 3}
          conversationAfterBattle: {fileID: 11400004, guid: d9ebcacaabc5e44bba98188d32b0a703,
            type: 3}
          opponentCharacterIndex: 0
          possibleStagesIndexes: 000000000100000002000000030000000400000005000000
        - conversationBeforeBattle: {fileID: 11400004, guid: 9994f2f4c6d0c4bbaadbe0fd864bec81,
            type: 3}
          conversationAfterBattle: {fileID: 11400004, guid: d9ebcacaabc5e44bba98188d32b0a703,
            type: 3}
          opponentCharacterIndex: 1
          possibleStagesIndexes: 000000000100000002000000030000000400000005000000
        showOpponentsInEditor: 1
      showStoryInEditor: 1
    selectableCharactersInStoryMode: 0100000000000000
    selectableCharactersInVersusMode: 0000000001000000
    characterStories:
      _keys: 0000000001000000
      _values:
      - opening: {fileID: 0}
        ending: {fileID: 0}
        fightsGroups: []
        showStoryInEditor: 0
      - opening: {fileID: 0}
        ending: {fileID: 0}
        fightsGroups: []
        showStoryInEditor: 0
  fps: 60
  _gameSpeed:
    _serializedValue: 4294967296
  executionBufferTime: 30
  executionBufferType: 0
  plinkingDelay: 2
  _preloadingTime:
    _serializedValue: 4294967296
  preloadStage: 1
  preloadHitEffects: 1
  warmAllShaders: 1
  _gravity:
    _serializedValue: 1803886208
  detect3D_Hits: 0
  lockZAxis: 0
  runInBackground: 1
  useFixedUpdateInputs: 0
  sortCharacterOnHit: 1
  foregroundSortLayer: 200
  backgroundSortLayer: 100
  languages:
  - languageName: English
    start: Start
    options: Options
    credits: Credits
    selectYourCharacter: Select Your Character
    selectYourStage: Select Your Stage
    round: Round %round%
    finalRound: Final Round
    fight: Fight!
    firstHit: First Hit!
    combo: '%combo% hit combo!'
    parry: Parry!
    counterHit: Counter!
    victory: '%character% wins!'
    challengeBegins: Start!
    challengeEnds: Success!
    timeOver: Time Over
    perfect: Perfect!
    rematch: Rematch
    quit: Quit
    ko: K.O.
    draw: Draw
    defaultSelection: 1
  deploymentOptions:
    deploymentType: 0
    activeCharacters:
    - {fileID: 11400000, guid: 5cf583706355c4285ab26c71eb3fae5e, type: 2}
    - {fileID: 11400000, guid: 5cf583706355c4285ab26c71eb3fae5e, type: 2}
    - {fileID: 11400000, guid: d6338f103bbb0da46ba6acf3b027f17a, type: 2}
    - {fileID: 11400000, guid: ac6ffbd93fffdbb47a2a75f1f84ecd37, type: 2}
    - {fileID: 11400000, guid: 5d6dc227d62e62a40af291dbbd4c5276, type: 2}
    - {fileID: 11400000, guid: 54057043117984643925ed339c232c0d, type: 2}
    - {fileID: 11400000, guid: f0ed0d0ea0c86e24e8af99019d695928, type: 2}
    - {fileID: 0}
    - {fileID: 0}
    - {fileID: 0}
    - {fileID: 0}
    - {fileID: 0}
    - {fileID: 0}
    - {fileID: 0}
    - {fileID: 0}
    - {fileID: 0}
    - {fileID: 0}
    - {fileID: 0}
    - {fileID: 0}
    AIControlled: 00000000000000010101010101010101010101
    selectedTeamMode: 0
    skipLoadingScreen: 0
  cameraOptions:
    initialDistance: {x: 0, y: 9, z: -46}
    initialRotation: {x: 7, y: 0, z: 0}
    enableLookAt: 1
    dollyAngle: 0
    distance3d: 0
    height3d: 0
    stabilizeDolly: 1
    enableZoom: 1
    followCharacters: 0
    initialFieldOfView: 14
    verticalPriority: 1
    verticalThreshold: 2
    movementSpeed: 12
    minZoom: 40
    maxZoom: 60
    _maxDistance:
      _serializedValue: 77309411328
    rotationSpeed: 14
    heightOffSet: 0.5
    rotationOffSet: {x: 0, y: 3.5, z: 0}
    motionSensor: 0
    motionSensibility: 1
  lockOnOptions:
    lockOnType: 0
    lockOnButtonEnabled: 0
    lockOnButton: 0
    lockOutEnabled: 0
    lockOutButton: 0
    targetSwitchType: 0
    switchButton: 0
    rotationSpeed:
      _serializedValue: 0
  characterRotationOptions:
    alwaysFaceOpponent: 1
    autoMirror: 1
    rotateWhileJumping: 0
    rotateOnMoveOnly: 0
    allowAirBorneSideSwitch: 0
    fixRotationWhenStunned: 0
    fixRotationWhenBlocking: 1
    fixRotationOnHit: 0
    allowCornerStealing: 1
    smoothRotation: 1
    _rotationSpeed:
      _serializedValue: 128849018880
    _mirrorBlending:
      _serializedValue: 171798688
  roundOptions:
    totalRounds: 3
    hasTimer: 1
    _timer:
      _serializedValue: 425201762304
    _timerSpeed:
      _serializedValue: 429496729600
    _p1XPosition:
      x:
        _serializedValue: -21474836480
      y:
        _serializedValue: 0
      z:
        _serializedValue: 0
    _p2XPosition:
      x:
        _serializedValue: 21474836480
      y:
        _serializedValue: 0
      z:
        _serializedValue: 0
    _p1XRotation:
      x:
        _serializedValue: -21474836480
      y:
        _serializedValue: 0
      z:
        _serializedValue: 0
    _p2XRotation:
      x:
        _serializedValue: 21474836480
      y:
        _serializedValue: 0
      z:
        _serializedValue: 0
    _endGameDelay:
      _serializedValue: 17179869184
    _showMenuDelay:
      _serializedValue: 15032385536
    _newRoundDelay:
      _serializedValue: 4294967296
    _slowMoTimer:
      _serializedValue: 12884901888
    _slowMoSpeed:
      _serializedValue: 858993472
    victoryMusic: {fileID: 8300000, guid: 35779441e741748d685c363ff0a9425a, type: 3}
    resetLifePoints: 1
    resetPositions: 1
    allowMovementStart: 0
    allowMovementEnd: 0
    playIntrosAtSameTime: 0
    inhibitGaugeGain: 1
    rotateBodyKO: 1
    slowMotionKO: 1
    cameraZoomKO: 1
    freezeCamAfterOutro: 1
  groundBounceOptions:
    bounceForce: 2
    bouncePrefab: {fileID: 197042, guid: 843fef1ba393e374396b9fd4fbbb02a0, type: 3}
    bounceKillTime: 0.6
    _minimumBounceForce:
      _serializedValue: 171798691840
    _maximumBounces:
      _serializedValue: 8589934592
    sticky: 0
    bounceHitBoxes: 1
    shakeCamOnBounce: 1
    _shakeDensity:
      _serializedValue: 2576980480
    bounceSound: {fileID: 8300000, guid: 7cec4e4ba24f7db48b78639aa5b10a64, type: 3}
  wallBounceOptions:
    bounceForce: 2
    bouncePrefab: {fileID: 0}
    bounceKillTime: 0.6
    _minimumBounceForce:
      _serializedValue: 150323855360
    _maximumBounces:
      _serializedValue: 8589934592
    sticky: 0
    bounceHitBoxes: 1
    shakeCamOnBounce: 1
    _shakeDensity:
      _serializedValue: 2576980480
    bounceSound: {fileID: 8300000, guid: 7cec4e4ba24f7db48b78639aa5b10a64, type: 3}
  counterHitOptions:
    startUpFrames: 0
    activeFrames: 0
    recoveryFrames: 0
    _damageIncrease:
      _serializedValue: 0
    _hitStunIncrease:
      _serializedValue: 64424509440
    sound: {fileID: 8300000, guid: 5b3bea24171c6534b81c07a298e51803, type: 3}
  comboOptions:
    comboDisplayMode: 0
    hitStunDeterioration: 1
    damageDeterioration: 2
    airJuggleDeterioration: 1
    _minHitStun: 1
    _minDamage:
      _serializedValue: 21474836480
    _minPushForce:
      _serializedValue: 85899345920
    maxConsecutiveCrumple: 3
    airJuggleDeteriorationType: 1
    neverAirRecover: 1
    airRecoveryType: 2
    resetFallingForceOnHit: 1
    maxCombo: 99
    _knockBackMinForce:
      _serializedValue: 42949672960
    neverCornerPush: 0
    fixJuggleWeight: 1
    _juggleWeight:
      _serializedValue: 1288490188800
  blockOptions:
    blockType: 1
    allowAirBlock: 0
    ignoreAppliedForceBlock: 0
    allowMoveCancel: 0
    blockHitEffects:
      hitParticle: {fileID: 112666, guid: 3fd40a270c5473142bd7faab396e2b41, type: 3}
      killTime: 0.5
      hitSound: {fileID: 8300000, guid: de89d708a053cb74d8701568c5ef36c9, type: 3}
      spawnPoint: 1
      _freezingTime:
        _serializedValue: 0
      _animationSpeed:
        _serializedValue: 429496736
      autoHitStop: 1
      sticky: 0
      _hitStop:
        _serializedValue: 0
      mirrorOn2PSide: 0
      shakeCharacterOnHit: 1
      shakeCameraOnHit: 1
      _shakeDensity:
        _serializedValue: 3435973888
      _shakeCameraDensity:
        _serializedValue: 3435973888
      editorToggle: 0
    parryType: 0
    _parryTiming:
      _serializedValue: 1288490240
    parryStunType: 0
    parryStunFrames: 2
    parryColor: {r: 1, g: 0.014705896, b: 0.014705896, a: 0}
    allowAirParry: 0
    highlightWhenParry: 1
    resetButtonSequence: 1
    easyParry: 0
    ignoreAppliedForceParry: 1
    parryHitEffects:
      hitParticle: {fileID: 100006, guid: 1851f237d4f2a334899ca51cc1f67528, type: 2}
      killTime: 0.6
      hitSound: {fileID: 8300000, guid: cb2782c81be7d634080146612802d65f, type: 3}
      spawnPoint: 1
      _freezingTime:
        _serializedValue: 0
      _animationSpeed:
        _serializedValue: 429496736
      autoHitStop: 0
      sticky: 0
      _hitStop:
        _serializedValue: 429496736
      mirrorOn2PSide: 0
      shakeCharacterOnHit: 0
      shakeCameraOnHit: 0
      _shakeDensity:
        _serializedValue: 3435973888
      _shakeCameraDensity:
        _serializedValue: 3435973836
      editorToggle: 0
    blockPushForce: 0
    pushBlockButtons: 
  knockDownOptions:
    air:
      _knockedOutTime:
        _serializedValue: 2147483648
      _standUpTime:
        _serializedValue: 1288490240
      hideHitBoxesOnFrame: 10
      hideHitBoxes: 0
      editorToggle: 1
      hasQuickStand: 0
      _predefinedPushForce:
        x:
          _serializedValue: 0
        y:
          _serializedValue: 0
        z:
          _serializedValue: 0
      quickStandButtons: 
      minQuickStandTime:
        _serializedValue: 0
      hasDelayedStand: 0
      delayedStandButtons: 
      maxDelayedStandTime:
        _serializedValue: 0
    high:
      _knockedOutTime:
        _serializedValue: 5153960960
      _standUpTime:
        _serializedValue: 1288490240
      hideHitBoxesOnFrame: 10
      hideHitBoxes: 0
      editorToggle: 0
      hasQuickStand: 0
      _predefinedPushForce:
        x:
          _serializedValue: 0
        y:
          _serializedValue: 0
        z:
          _serializedValue: 0
      quickStandButtons: 
      minQuickStandTime:
        _serializedValue: 0
      hasDelayedStand: 0
      delayedStandButtons: 
      maxDelayedStandTime:
        _serializedValue: 0
    highLow:
      _knockedOutTime:
        _serializedValue: 5153960960
      _standUpTime:
        _serializedValue: 2576980480
      hideHitBoxesOnFrame: 10
      hideHitBoxes: 0
      editorToggle: 0
      hasQuickStand: 0
      _predefinedPushForce:
        x:
          _serializedValue: 0
        y:
          _serializedValue: 0
        z:
          _serializedValue: 0
      quickStandButtons: 
      minQuickStandTime:
        _serializedValue: 0
      hasDelayedStand: 0
      delayedStandButtons: 
      maxDelayedStandTime:
        _serializedValue: 0
    sweep:
      _knockedOutTime:
        _serializedValue: 2576980480
      _standUpTime:
        _serializedValue: 1717986944
      hideHitBoxesOnFrame: 10
      hideHitBoxes: 0
      editorToggle: 0
      hasQuickStand: 0
      _predefinedPushForce:
        x:
          _serializedValue: 34359738368
        y:
          _serializedValue: 51539607552
        z:
          _serializedValue: 0
      quickStandButtons: 
      minQuickStandTime:
        _serializedValue: 0
      hasDelayedStand: 0
      delayedStandButtons: 
      maxDelayedStandTime:
        _serializedValue: 0
    crumple:
      _knockedOutTime:
        _serializedValue: 4294967296
      _standUpTime:
        _serializedValue: 4294967296
      hideHitBoxesOnFrame: 10
      hideHitBoxes: 1
      editorToggle: 1
      hasQuickStand: 0
      _predefinedPushForce:
        x:
          _serializedValue: 0
        y:
          _serializedValue: 0
        z:
          _serializedValue: 0
      quickStandButtons: 
      minQuickStandTime:
        _serializedValue: 0
      hasDelayedStand: 0
      delayedStandButtons: 
      maxDelayedStandTime:
        _serializedValue: 0
    wallbounce:
      _knockedOutTime:
        _serializedValue: 3006477056
      _standUpTime:
        _serializedValue: 1288490240
      hideHitBoxesOnFrame: 10
      hideHitBoxes: 0
      editorToggle: 0
      hasQuickStand: 0
      _predefinedPushForce:
        x:
          _serializedValue: 0
        y:
          _serializedValue: 0
        z:
          _serializedValue: 0
      quickStandButtons: 
      minQuickStandTime:
        _serializedValue: 0
      hasDelayedStand: 0
      delayedStandButtons: 
      maxDelayedStandTime:
        _serializedValue: 0
  hitOptions:
    resetAnimationOnHit: 1
    weakHit:
      hitParticle: {fileID: 194664, guid: b71a09eefd747c94787f6bc98149a21d, type: 3}
      killTime: 0.6
      hitSound: {fileID: 8300000, guid: 591a29322671baa479c0ef02c3a59bc8, type: 3}
      spawnPoint: 1
      _freezingTime:
        _serializedValue: 429496736
      _animationSpeed:
        _serializedValue: 0
      autoHitStop: 1
      sticky: 0
      _hitStop:
        _serializedValue: 429496736
      mirrorOn2PSide: 1
      shakeCharacterOnHit: 0
      shakeCameraOnHit: 1
      _shakeDensity:
        _serializedValue: 2576980480
      _shakeCameraDensity:
        _serializedValue: 3865470464
      editorToggle: 1
    mediumHit:
      hitParticle: {fileID: 109728, guid: 9e918342d2a8f7842a691dff3f82f043, type: 3}
      killTime: 0.6
      hitSound: {fileID: 8300000, guid: 5b3bea24171c6534b81c07a298e51803, type: 3}
      spawnPoint: 1
      _freezingTime:
        _serializedValue: 515396064
      _animationSpeed:
        _serializedValue: 0
      autoHitStop: 1
      sticky: 0
      _hitStop:
        _serializedValue: 515396064
      mirrorOn2PSide: 1
      shakeCharacterOnHit: 0
      shakeCameraOnHit: 1
      _shakeDensity:
        _serializedValue: 3435973888
      _shakeCameraDensity:
        _serializedValue: 5153960960
      editorToggle: 1
    heavyHit:
      hitParticle: {fileID: 184198, guid: 9c74fc77f6403ad4dba5b180423b14d1, type: 3}
      killTime: 0.6
      hitSound: {fileID: 8300000, guid: 2ffc3ee185d024740bdafff00742a713, type: 3}
      spawnPoint: 1
      _freezingTime:
        _serializedValue: 644245120
      _animationSpeed:
        _serializedValue: 0
      autoHitStop: 1
      sticky: 0
      _hitStop:
        _serializedValue: 644245120
      mirrorOn2PSide: 0
      shakeCharacterOnHit: 0
      shakeCameraOnHit: 1
      _shakeDensity:
        _serializedValue: 5153960960
      _shakeCameraDensity:
        _serializedValue: 7730940928
      editorToggle: 1
    crumpleHit:
      hitParticle: {fileID: 1459499847029934, guid: e78df5c3545b7324991134d6f0eb6528,
        type: 3}
      killTime: 0.6
      hitSound: {fileID: 8300000, guid: e4715de8219e096478750b23cf52d2fc, type: 3}
      spawnPoint: 1
      _freezingTime:
        _serializedValue: 1288490240
      _animationSpeed:
        _serializedValue: 429496736
      autoHitStop: 1
      sticky: 0
      _hitStop:
        _serializedValue: 1288490240
      mirrorOn2PSide: 0
      shakeCharacterOnHit: 0
      shakeCameraOnHit: 1
      _shakeDensity:
        _serializedValue: 3435973888
      _shakeCameraDensity:
        _serializedValue: 3435973888
      editorToggle: 1
    customHit1:
      hitParticle: {fileID: 0}
      killTime: 0
      hitSound: {fileID: 0}
      spawnPoint: 1
      _freezingTime:
        _serializedValue: 0
      _animationSpeed:
        _serializedValue: 429496736
      autoHitStop: 1
      sticky: 0
      _hitStop:
        _serializedValue: 0
      mirrorOn2PSide: 0
      shakeCharacterOnHit: 1
      shakeCameraOnHit: 1
      _shakeDensity:
        _serializedValue: 3435973888
      _shakeCameraDensity:
        _serializedValue: 3435973888
      editorToggle: 0
    customHit2:
      hitParticle: {fileID: 0}
      killTime: 0
      hitSound: {fileID: 0}
      spawnPoint: 1
      _freezingTime:
        _serializedValue: 0
      _animationSpeed:
        _serializedValue: 429496736
      autoHitStop: 1
      sticky: 0
      _hitStop:
        _serializedValue: 0
      mirrorOn2PSide: 0
      shakeCharacterOnHit: 1
      shakeCameraOnHit: 1
      _shakeDensity:
        _serializedValue: 3435973888
      _shakeCameraDensity:
        _serializedValue: 3435973836
      editorToggle: 0
    customHit3:
      hitParticle: {fileID: 0}
      killTime: 0
      hitSound: {fileID: 0}
      spawnPoint: 1
      _freezingTime:
        _serializedValue: 0
      _animationSpeed:
        _serializedValue: 429496736
      autoHitStop: 1
      sticky: 0
      _hitStop:
        _serializedValue: 0
      mirrorOn2PSide: 0
      shakeCharacterOnHit: 1
      shakeCameraOnHit: 1
      _shakeDensity:
        _serializedValue: 3435973888
      _shakeCameraDensity:
        _serializedValue: 3435973836
      editorToggle: 0
    customHit4:
      hitParticle: {fileID: 0}
      killTime: 0
      hitSound: {fileID: 0}
      spawnPoint: 1
      _freezingTime:
        _serializedValue: 0
      _animationSpeed:
        _serializedValue: 429496729
      autoHitStop: 1
      sticky: 0
      _hitStop:
        _serializedValue: 429496729
      mirrorOn2PSide: 0
      shakeCharacterOnHit: 1
      shakeCameraOnHit: 1
      _shakeDensity:
        _serializedValue: 3435973836
      _shakeCameraDensity:
        _serializedValue: 3435973836
      editorToggle: 0
    customHit5:
      hitParticle: {fileID: 0}
      killTime: 0
      hitSound: {fileID: 0}
      spawnPoint: 1
      _freezingTime:
        _serializedValue: 0
      _animationSpeed:
        _serializedValue: 429496729
      autoHitStop: 1
      sticky: 0
      _hitStop:
        _serializedValue: 429496729
      mirrorOn2PSide: 0
      shakeCharacterOnHit: 1
      shakeCameraOnHit: 1
      _shakeDensity:
        _serializedValue: 3435973836
      _shakeCameraDensity:
        _serializedValue: 3435973836
      editorToggle: 0
    customHit6:
      hitParticle: {fileID: 0}
      killTime: 0
      hitSound: {fileID: 0}
      spawnPoint: 1
      _freezingTime:
        _serializedValue: 0
      _animationSpeed:
        _serializedValue: 429496736
      autoHitStop: 1
      sticky: 0
      _hitStop:
        _serializedValue: 0
      mirrorOn2PSide: 0
      shakeCharacterOnHit: 1
      shakeCameraOnHit: 1
      _shakeDensity:
        _serializedValue: 3435973888
      _shakeCameraDensity:
        _serializedValue: 3435973888
      editorToggle: 0
  player1_Inputs:
  - inputType: 0
    inputButtonName: P1KeyboardHorizontal
    engineRelatedButton: 0
    joystickAxisName: P1JoystickHorizontal
    cInputPositiveKeyName: P1Right
    cInputPositiveDefaultKey: D
    cInputPositiveAlternativeKey: Joy1 Axis 1+
    cInputNegativeKeyName: P1Left
    cInputNegativeDefaultKey: A
    cInputNegativeAlternativeKey: Joy1 Axis 1-
    inputViewerIcon1: {fileID: 2800000, guid: f029529e09f1c12428dcc1a8c7dcb91c, type: 3}
    inputViewerIcon2: {fileID: 2800000, guid: 0f1eb58df8917b74f804b8cb97615fd5, type: 3}
    inputViewerIcon3: {fileID: 2800000, guid: 917c18f4aaf6f3a41a72d01a8fa79c1a, type: 3}
    inputViewerIcon4: {fileID: 2800000, guid: a2811adde7913ac46a9b47b6cd73abd7, type: 3}
    inputViewerIcon5: {fileID: 2800000, guid: 10d86991785f12942b8581c6ed5a0f1f, type: 3}
    inputViewerIcon6: {fileID: 2800000, guid: 90523496d8897124e989ad256f109d27, type: 3}
  - inputType: 1
    inputButtonName: P1KeyboardVertical
    engineRelatedButton: 3
    joystickAxisName: P1JoystickVertical
    cInputPositiveKeyName: P1Up
    cInputPositiveDefaultKey: W
    cInputPositiveAlternativeKey: Joy1 Axis 2+
    cInputNegativeKeyName: P1Down
    cInputNegativeDefaultKey: S
    cInputNegativeAlternativeKey: Joy1 Axis 2-
    inputViewerIcon1: {fileID: 2800000, guid: 0f803e1627a596e468c46d268cea841a, type: 3}
    inputViewerIcon2: {fileID: 2800000, guid: 7681f77e08529604096afaded862f563, type: 3}
    inputViewerIcon3: {fileID: 0}
    inputViewerIcon4: {fileID: 0}
    inputViewerIcon5: {fileID: 0}
    inputViewerIcon6: {fileID: 0}
  - inputType: 2
    inputButtonName: P1Button1
    engineRelatedButton: 4
    joystickAxisName: 
    cInputPositiveKeyName: 
    cInputPositiveDefaultKey: T
    cInputPositiveAlternativeKey: Joystick1Button0
    cInputNegativeKeyName: 
    cInputNegativeDefaultKey: 
    cInputNegativeAlternativeKey: 
    inputViewerIcon1: {fileID: 2800000, guid: 44dd7049b4286cb429154691fc16a0ae, type: 3}
    inputViewerIcon2: {fileID: 0}
    inputViewerIcon3: {fileID: 0}
    inputViewerIcon4: {fileID: 0}
    inputViewerIcon5: {fileID: 0}
    inputViewerIcon6: {fileID: 0}
  - inputType: 2
    inputButtonName: P1Button2
    engineRelatedButton: 5
    joystickAxisName: 
    cInputPositiveKeyName: 
    cInputPositiveDefaultKey: Y
    cInputPositiveAlternativeKey: Joystick1Button1
    cInputNegativeKeyName: 
    cInputNegativeDefaultKey: 
    cInputNegativeAlternativeKey: 
    inputViewerIcon1: {fileID: 2800000, guid: b645b84b92239ac4e81cad4802c7d032, type: 3}
    inputViewerIcon2: {fileID: 0}
    inputViewerIcon3: {fileID: 0}
    inputViewerIcon4: {fileID: 0}
    inputViewerIcon5: {fileID: 0}
    inputViewerIcon6: {fileID: 0}
  - inputType: 2
    inputButtonName: P1Button3
    engineRelatedButton: 6
    joystickAxisName: 
    cInputPositiveKeyName: 
    cInputPositiveDefaultKey: U
    cInputPositiveAlternativeKey: Joystick1Button2
    cInputNegativeKeyName: 
    cInputNegativeDefaultKey: 
    cInputNegativeAlternativeKey: 
    inputViewerIcon1: {fileID: 2800000, guid: 754551564b367f24da34c48590c306df, type: 3}
    inputViewerIcon2: {fileID: 0}
    inputViewerIcon3: {fileID: 0}
    inputViewerIcon4: {fileID: 0}
    inputViewerIcon5: {fileID: 0}
    inputViewerIcon6: {fileID: 0}
  - inputType: 2
    inputButtonName: P1Button4
    engineRelatedButton: 7
    joystickAxisName: 
    cInputPositiveKeyName: 
    cInputPositiveDefaultKey: G
    cInputPositiveAlternativeKey: Joystick1Button3
    cInputNegativeKeyName: 
    cInputNegativeDefaultKey: 
    cInputNegativeAlternativeKey: 
    inputViewerIcon1: {fileID: 2800000, guid: d20d91e4857c2204e850158037155457, type: 3}
    inputViewerIcon2: {fileID: 0}
    inputViewerIcon3: {fileID: 0}
    inputViewerIcon4: {fileID: 0}
    inputViewerIcon5: {fileID: 0}
    inputViewerIcon6: {fileID: 0}
  - inputType: 2
    inputButtonName: P1Button5
    engineRelatedButton: 8
    joystickAxisName: 
    cInputPositiveKeyName: 
    cInputPositiveDefaultKey: H
    cInputPositiveAlternativeKey: Joystick1Button4
    cInputNegativeKeyName: 
    cInputNegativeDefaultKey: 
    cInputNegativeAlternativeKey: 
    inputViewerIcon1: {fileID: 2800000, guid: fa0d984a6d12fda47940eea0201a6431, type: 3}
    inputViewerIcon2: {fileID: 0}
    inputViewerIcon3: {fileID: 0}
    inputViewerIcon4: {fileID: 0}
    inputViewerIcon5: {fileID: 0}
    inputViewerIcon6: {fileID: 0}
  - inputType: 2
    inputButtonName: P1Button6
    engineRelatedButton: 9
    joystickAxisName: 
    cInputPositiveKeyName: 
    cInputPositiveDefaultKey: J
    cInputPositiveAlternativeKey: Joystick1Button5
    cInputNegativeKeyName: 
    cInputNegativeDefaultKey: 
    cInputNegativeAlternativeKey: 
    inputViewerIcon1: {fileID: 2800000, guid: b95421dc6f1a4b74aaf1833fb225074c, type: 3}
    inputViewerIcon2: {fileID: 0}
    inputViewerIcon3: {fileID: 0}
    inputViewerIcon4: {fileID: 0}
    inputViewerIcon5: {fileID: 0}
    inputViewerIcon6: {fileID: 0}
  - inputType: 2
    inputButtonName: P1Start
    engineRelatedButton: 20
    joystickAxisName: 
    cInputPositiveKeyName: 
    cInputPositiveDefaultKey: 
    cInputPositiveAlternativeKey: 
    cInputNegativeKeyName: 
    cInputNegativeDefaultKey: 
    cInputNegativeAlternativeKey: 
    inputViewerIcon1: {fileID: 0}
    inputViewerIcon2: {fileID: 0}
    inputViewerIcon3: {fileID: 0}
    inputViewerIcon4: {fileID: 0}
    inputViewerIcon5: {fileID: 0}
    inputViewerIcon6: {fileID: 0}
  - inputType: 2
    inputButtonName: P1Button7
    engineRelatedButton: 10
    joystickAxisName: 
    cInputPositiveKeyName: 
    cInputPositiveDefaultKey: 
    cInputPositiveAlternativeKey: 
    cInputNegativeKeyName: 
    cInputNegativeDefaultKey: 
    cInputNegativeAlternativeKey: 
    inputViewerIcon1: {fileID: 0}
    inputViewerIcon2: {fileID: 0}
    inputViewerIcon3: {fileID: 0}
    inputViewerIcon4: {fileID: 0}
    inputViewerIcon5: {fileID: 0}
    inputViewerIcon6: {fileID: 0}
  - inputType: 2
    inputButtonName: P1Button8
    engineRelatedButton: 11
    joystickAxisName: 
    cInputPositiveKeyName: 
    cInputPositiveDefaultKey: 
    cInputPositiveAlternativeKey: 
    cInputNegativeKeyName: 
    cInputNegativeDefaultKey: 
    cInputNegativeAlternativeKey: 
    inputViewerIcon1: {fileID: 0}
    inputViewerIcon2: {fileID: 0}
    inputViewerIcon3: {fileID: 0}
    inputViewerIcon4: {fileID: 0}
    inputViewerIcon5: {fileID: 0}
    inputViewerIcon6: {fileID: 0}
  - inputType: 2
    inputButtonName: P1Button9
    engineRelatedButton: 12
    joystickAxisName: 
    cInputPositiveKeyName: 
    cInputPositiveDefaultKey: 
    cInputPositiveAlternativeKey: 
    cInputNegativeKeyName: 
    cInputNegativeDefaultKey: 
    cInputNegativeAlternativeKey: 
    inputViewerIcon1: {fileID: 0}
    inputViewerIcon2: {fileID: 0}
    inputViewerIcon3: {fileID: 0}
    inputViewerIcon4: {fileID: 0}
    inputViewerIcon5: {fileID: 0}
    inputViewerIcon6: {fileID: 0}
  - inputType: 2
    inputButtonName: P1Button10
    engineRelatedButton: 13
    joystickAxisName: 
    cInputPositiveKeyName: 
    cInputPositiveDefaultKey: 
    cInputPositiveAlternativeKey: 
    cInputNegativeKeyName: 
    cInputNegativeDefaultKey: 
    cInputNegativeAlternativeKey: 
    inputViewerIcon1: {fileID: 0}
    inputViewerIcon2: {fileID: 0}
    inputViewerIcon3: {fileID: 0}
    inputViewerIcon4: {fileID: 0}
    inputViewerIcon5: {fileID: 0}
    inputViewerIcon6: {fileID: 0}
  - inputType: 2
    inputButtonName: P1Button11
    engineRelatedButton: 14
    joystickAxisName: 
    cInputPositiveKeyName: 
    cInputPositiveDefaultKey: 
    cInputPositiveAlternativeKey: 
    cInputNegativeKeyName: 
    cInputNegativeDefaultKey: 
    cInputNegativeAlternativeKey: 
    inputViewerIcon1: {fileID: 0}
    inputViewerIcon2: {fileID: 0}
    inputViewerIcon3: {fileID: 0}
    inputViewerIcon4: {fileID: 0}
    inputViewerIcon5: {fileID: 0}
    inputViewerIcon6: {fileID: 0}
  - inputType: 2
    inputButtonName: P1Button12
    engineRelatedButton: 15
    joystickAxisName: 
    cInputPositiveKeyName: 
    cInputPositiveDefaultKey: 
    cInputPositiveAlternativeKey: 
    cInputNegativeKeyName: 
    cInputNegativeDefaultKey: 
    cInputNegativeAlternativeKey: 
    inputViewerIcon1: {fileID: 0}
    inputViewerIcon2: {fileID: 0}
    inputViewerIcon3: {fileID: 0}
    inputViewerIcon4: {fileID: 0}
    inputViewerIcon5: {fileID: 0}
    inputViewerIcon6: {fileID: 0}
  player2_Inputs:
  - inputType: 0
    inputButtonName: P2KeyboardHorizontal
    engineRelatedButton: 0
    joystickAxisName: P2JoystickHorizontal
    cInputPositiveKeyName: P2Right
    cInputPositiveDefaultKey: RightArrow
    cInputPositiveAlternativeKey: Joy2 Axis 1+
    cInputNegativeKeyName: P2Left
    cInputNegativeDefaultKey: LeftArrow
    cInputNegativeAlternativeKey: Joy2 Axis 1-
    inputViewerIcon1: {fileID: 2800000, guid: f029529e09f1c12428dcc1a8c7dcb91c, type: 3}
    inputViewerIcon2: {fileID: 2800000, guid: 0f1eb58df8917b74f804b8cb97615fd5, type: 3}
    inputViewerIcon3: {fileID: 2800000, guid: 917c18f4aaf6f3a41a72d01a8fa79c1a, type: 3}
    inputViewerIcon4: {fileID: 2800000, guid: a2811adde7913ac46a9b47b6cd73abd7, type: 3}
    inputViewerIcon5: {fileID: 2800000, guid: 10d86991785f12942b8581c6ed5a0f1f, type: 3}
    inputViewerIcon6: {fileID: 2800000, guid: 90523496d8897124e989ad256f109d27, type: 3}
  - inputType: 1
    inputButtonName: P2KeyboardVertical
    engineRelatedButton: 3
    joystickAxisName: P2JoystickVertical
    cInputPositiveKeyName: P2Up
    cInputPositiveDefaultKey: UpArrow
    cInputPositiveAlternativeKey: Joy2 Axis 2+
    cInputNegativeKeyName: P2Down
    cInputNegativeDefaultKey: DownArrow
    cInputNegativeAlternativeKey: Joy2 Axis 2-
    inputViewerIcon1: {fileID: 2800000, guid: 0f803e1627a596e468c46d268cea841a, type: 3}
    inputViewerIcon2: {fileID: 2800000, guid: 7681f77e08529604096afaded862f563, type: 3}
    inputViewerIcon3: {fileID: 0}
    inputViewerIcon4: {fileID: 0}
    inputViewerIcon5: {fileID: 0}
    inputViewerIcon6: {fileID: 0}
  - inputType: 2
    inputButtonName: P2Button1
    engineRelatedButton: 4
    joystickAxisName: 
    cInputPositiveKeyName: 
    cInputPositiveDefaultKey: Insert
    cInputPositiveAlternativeKey: Joystick2Button0
    cInputNegativeKeyName: 
    cInputNegativeDefaultKey: 
    cInputNegativeAlternativeKey: 
    inputViewerIcon1: {fileID: 2800000, guid: 44dd7049b4286cb429154691fc16a0ae, type: 3}
    inputViewerIcon2: {fileID: 0}
    inputViewerIcon3: {fileID: 0}
    inputViewerIcon4: {fileID: 0}
    inputViewerIcon5: {fileID: 0}
    inputViewerIcon6: {fileID: 0}
  - inputType: 2
    inputButtonName: P2Button2
    engineRelatedButton: 5
    joystickAxisName: 
    cInputPositiveKeyName: 
    cInputPositiveDefaultKey: Home
    cInputPositiveAlternativeKey: Joystick2Button1
    cInputNegativeKeyName: 
    cInputNegativeDefaultKey: 
    cInputNegativeAlternativeKey: 
    inputViewerIcon1: {fileID: 2800000, guid: b645b84b92239ac4e81cad4802c7d032, type: 3}
    inputViewerIcon2: {fileID: 0}
    inputViewerIcon3: {fileID: 0}
    inputViewerIcon4: {fileID: 0}
    inputViewerIcon5: {fileID: 0}
    inputViewerIcon6: {fileID: 0}
  - inputType: 2
    inputButtonName: P2Button3
    engineRelatedButton: 6
    joystickAxisName: 
    cInputPositiveKeyName: 
    cInputPositiveDefaultKey: PageUp
    cInputPositiveAlternativeKey: Joystick2Button2
    cInputNegativeKeyName: 
    cInputNegativeDefaultKey: 
    cInputNegativeAlternativeKey: 
    inputViewerIcon1: {fileID: 2800000, guid: 754551564b367f24da34c48590c306df, type: 3}
    inputViewerIcon2: {fileID: 0}
    inputViewerIcon3: {fileID: 0}
    inputViewerIcon4: {fileID: 0}
    inputViewerIcon5: {fileID: 0}
    inputViewerIcon6: {fileID: 0}
  - inputType: 2
    inputButtonName: P2Button4
    engineRelatedButton: 7
    joystickAxisName: 
    cInputPositiveKeyName: 
    cInputPositiveDefaultKey: Delete
    cInputPositiveAlternativeKey: Joystick2Button3
    cInputNegativeKeyName: 
    cInputNegativeDefaultKey: 
    cInputNegativeAlternativeKey: 
    inputViewerIcon1: {fileID: 2800000, guid: d20d91e4857c2204e850158037155457, type: 3}
    inputViewerIcon2: {fileID: 0}
    inputViewerIcon3: {fileID: 0}
    inputViewerIcon4: {fileID: 0}
    inputViewerIcon5: {fileID: 0}
    inputViewerIcon6: {fileID: 0}
  - inputType: 2
    inputButtonName: P2Button5
    engineRelatedButton: 8
    joystickAxisName: 
    cInputPositiveKeyName: 
    cInputPositiveDefaultKey: End
    cInputPositiveAlternativeKey: Joystick2Button4
    cInputNegativeKeyName: 
    cInputNegativeDefaultKey: 
    cInputNegativeAlternativeKey: 
    inputViewerIcon1: {fileID: 2800000, guid: fa0d984a6d12fda47940eea0201a6431, type: 3}
    inputViewerIcon2: {fileID: 0}
    inputViewerIcon3: {fileID: 0}
    inputViewerIcon4: {fileID: 0}
    inputViewerIcon5: {fileID: 0}
    inputViewerIcon6: {fileID: 0}
  - inputType: 2
    inputButtonName: P2Button6
    engineRelatedButton: 9
    joystickAxisName: 
    cInputPositiveKeyName: 
    cInputPositiveDefaultKey: PageDown
    cInputPositiveAlternativeKey: Joystick2Button5
    cInputNegativeKeyName: 
    cInputNegativeDefaultKey: 
    cInputNegativeAlternativeKey: 
    inputViewerIcon1: {fileID: 2800000, guid: b95421dc6f1a4b74aaf1833fb225074c, type: 3}
    inputViewerIcon2: {fileID: 0}
    inputViewerIcon3: {fileID: 0}
    inputViewerIcon4: {fileID: 0}
    inputViewerIcon5: {fileID: 0}
    inputViewerIcon6: {fileID: 0}
  - inputType: 2
    inputButtonName: P2Button7
    engineRelatedButton: 10
    joystickAxisName: 
    cInputPositiveKeyName: 
    cInputPositiveDefaultKey: 
    cInputPositiveAlternativeKey: 
    cInputNegativeKeyName: 
    cInputNegativeDefaultKey: 
    cInputNegativeAlternativeKey: 
    inputViewerIcon1: {fileID: 0}
    inputViewerIcon2: {fileID: 0}
    inputViewerIcon3: {fileID: 0}
    inputViewerIcon4: {fileID: 0}
    inputViewerIcon5: {fileID: 0}
    inputViewerIcon6: {fileID: 0}
  - inputType: 2
    inputButtonName: P2Start
    engineRelatedButton: 20
    joystickAxisName: 
    cInputPositiveKeyName: 
    cInputPositiveDefaultKey: 
    cInputPositiveAlternativeKey: 
    cInputNegativeKeyName: 
    cInputNegativeDefaultKey: 
    cInputNegativeAlternativeKey: 
    inputViewerIcon1: {fileID: 0}
    inputViewerIcon2: {fileID: 0}
    inputViewerIcon3: {fileID: 0}
    inputViewerIcon4: {fileID: 0}
    inputViewerIcon5: {fileID: 0}
    inputViewerIcon6: {fileID: 0}
  - inputType: 2
    inputButtonName: P2Button8
    engineRelatedButton: 11
    joystickAxisName: 
    cInputPositiveKeyName: 
    cInputPositiveDefaultKey: 
    cInputPositiveAlternativeKey: 
    cInputNegativeKeyName: 
    cInputNegativeDefaultKey: 
    cInputNegativeAlternativeKey: 
    inputViewerIcon1: {fileID: 0}
    inputViewerIcon2: {fileID: 0}
    inputViewerIcon3: {fileID: 0}
    inputViewerIcon4: {fileID: 0}
    inputViewerIcon5: {fileID: 0}
    inputViewerIcon6: {fileID: 0}
  - inputType: 2
    inputButtonName: P2Button9
    engineRelatedButton: 12
    joystickAxisName: 
    cInputPositiveKeyName: 
    cInputPositiveDefaultKey: 
    cInputPositiveAlternativeKey: 
    cInputNegativeKeyName: 
    cInputNegativeDefaultKey: 
    cInputNegativeAlternativeKey: 
    inputViewerIcon1: {fileID: 0}
    inputViewerIcon2: {fileID: 0}
    inputViewerIcon3: {fileID: 0}
    inputViewerIcon4: {fileID: 0}
    inputViewerIcon5: {fileID: 0}
    inputViewerIcon6: {fileID: 0}
  - inputType: 2
    inputButtonName: P2Button10
    engineRelatedButton: 13
    joystickAxisName: 
    cInputPositiveKeyName: 
    cInputPositiveDefaultKey: 
    cInputPositiveAlternativeKey: 
    cInputNegativeKeyName: 
    cInputNegativeDefaultKey: 
    cInputNegativeAlternativeKey: 
    inputViewerIcon1: {fileID: 0}
    inputViewerIcon2: {fileID: 0}
    inputViewerIcon3: {fileID: 0}
    inputViewerIcon4: {fileID: 0}
    inputViewerIcon5: {fileID: 0}
    inputViewerIcon6: {fileID: 0}
  - inputType: 2
    inputButtonName: P2Button11
    engineRelatedButton: 14
    joystickAxisName: 
    cInputPositiveKeyName: 
    cInputPositiveDefaultKey: 
    cInputPositiveAlternativeKey: 
    cInputNegativeKeyName: 
    cInputNegativeDefaultKey: 
    cInputNegativeAlternativeKey: 
    inputViewerIcon1: {fileID: 0}
    inputViewerIcon2: {fileID: 0}
    inputViewerIcon3: {fileID: 0}
    inputViewerIcon4: {fileID: 0}
    inputViewerIcon5: {fileID: 0}
    inputViewerIcon6: {fileID: 0}
  - inputType: 2
    inputButtonName: P2Button12
    engineRelatedButton: 15
    joystickAxisName: 
    cInputPositiveKeyName: 
    cInputPositiveDefaultKey: 
    cInputPositiveAlternativeKey: 
    cInputNegativeKeyName: 
    cInputNegativeDefaultKey: 
    cInputNegativeAlternativeKey: 
    inputViewerIcon1: {fileID: 0}
    inputViewerIcon2: {fileID: 0}
    inputViewerIcon3: {fileID: 0}
    inputViewerIcon4: {fileID: 0}
    inputViewerIcon5: {fileID: 0}
    inputViewerIcon6: {fileID: 0}
  inputOptions:
    inputManagerType: 2
    cInputAllowDuplicates: 0
    cInputGravity: 3
    cInputSensitivity: 3
    cInputDeadZone: 0.001
    cInputSkin: {fileID: 0}
    controlFreakPrefab: {fileID: 0}
    controlFreak2Prefab: {fileID: 11475796, guid: 3887d31706a34f94a9dc10682b07f613,
      type: 3}
    controlFreakDeadZone: 0.5
    forceDigitalInput: 0
    confirmButton: 16
    cancelButton: 17
  stages:
  - stageName: Training Room (Prefab)
    stageLoadingMethod: 0
    stagePath: 
    screenshot: {fileID: 2800000, guid: 3f68cd3743dce4909a60f6354fb575fa, type: 3}
    prefab: {fileID: 7259010295428217826, guid: 653923bf885a745419475b4e6d3f967b,
      type: 3}
    music: {fileID: 8300000, guid: 0a8021cfa80f24cb2aaf8a8ca1d60520, type: 3}
    _groundFriction:
      _serializedValue: 429496729600
    _leftBoundary:
      _serializedValue: -158913789952
    _rightBoundary:
      _serializedValue: 158913789952
    position:
      x:
        _serializedValue: 0
      y:
        _serializedValue: 0
      z:
        _serializedValue: 0
  - stageName: zal
    stageLoadingMethod: 0
    stagePath: 
    screenshot: {fileID: 2800000, guid: caaeb2e7f2cfc4a20ad618e74c6555de, type: 3}
    prefab: {fileID: 1701999111723396, guid: e6b4bc34c128c4d4c849d25ad17281fb, type: 3}
    music: {fileID: 8300000, guid: 95be74fd20e334db4ba084f954d6840d, type: 3}
    _groundFriction:
      _serializedValue: 429496729600
    _leftBoundary:
      _serializedValue: -90913808384
    _rightBoundary:
      _serializedValue: 87913775104
    position:
      x:
        _serializedValue: 0
      y:
        _serializedValue: 0
      z:
        _serializedValue: 0
  - stageName: zavod
    stageLoadingMethod: 0
    stagePath: 
    screenshot: {fileID: 2800000, guid: 53257e7bd49e2429482cbf063f88d693, type: 3}
    prefab: {fileID: 1283577037496398, guid: 379a87c5b38c04fc8ac61d6a5ab70b7b, type: 3}
    music: {fileID: 8300000, guid: 97f3b685d16de447e93477c52ba0710b, type: 3}
    _groundFriction:
      _serializedValue: 429496729600
    _leftBoundary:
      _serializedValue: -150323855360
    _rightBoundary:
      _serializedValue: 150323855360
    position:
      x:
        _serializedValue: 0
      y:
        _serializedValue: 0
      z:
        _serializedValue: 0
  - stageName: roof
    stageLoadingMethod: 0
    stagePath: 
    screenshot: {fileID: 2800000, guid: 7175b15f6aec6417991ec45471560ae6, type: 3}
    prefab: {fileID: 8908454262826339368, guid: 6bd54e2875dcf4b1b8a1181b070e12a1,
      type: 3}
    music: {fileID: 8300000, guid: 44e627a05721e4b6a84c909eb962190c, type: 3}
    _groundFriction:
      _serializedValue: 429496729600
    _leftBoundary:
      _serializedValue: -130913779712
    _rightBoundary:
      _serializedValue: 158913789952
    position:
      x:
        _serializedValue: 0
      y:
        _serializedValue: 0
      z:
        _serializedValue: 0
  - stageName: hram
    stageLoadingMethod: 0
    stagePath: 
    screenshot: {fileID: 2800000, guid: 2bce9004c099b4bbb80cca5e388346de, type: 3}
    prefab: {fileID: 6882836137610584255, guid: ca856bf9284c443b2a7661499fe08e0b,
      type: 3}
    music: {fileID: 8300000, guid: 4f20254c0e6e44ed79a48daeec6686aa, type: 3}
    _groundFriction:
      _serializedValue: 429496729600
    _leftBoundary:
      _serializedValue: -120259084288
    _rightBoundary:
      _serializedValue: 115964116992
    position:
      x:
        _serializedValue: 0
      y:
        _serializedValue: 0
      z:
        _serializedValue: 0
  - stageName: hram green
    stageLoadingMethod: 0
    stagePath: 
    screenshot: {fileID: 2800000, guid: 0d2dd1c86509d4287a995997b3748246, type: 3}
    prefab: {fileID: 1444370207938433092, guid: e47a5d335b275499fb310f2b30de8f2f,
      type: 3}
    music: {fileID: 8300000, guid: 04242390646f84d64bb7217456fcbe05, type: 3}
    _groundFriction:
      _serializedValue: 429496729600
    _leftBoundary:
      _serializedValue: -120259084288
    _rightBoundary:
      _serializedValue: 115964116992
    position:
      x:
        _serializedValue: 0
      y:
        _serializedValue: 0
      z:
        _serializedValue: 0
  characters:
  - {fileID: 11400000, guid: 65c0cffa1d0cc3841b5ad8957a0ee4f2, type: 2}
  - {fileID: 11400000, guid: 8d5404975f0df455fa20c42bb5965926, type: 2}
  teamModes:
  - modeName: Tag Battle (DBZF\Marvel) - 2D 3v3 Tag Team
    teams:
    - characters:
      - player: 0
        endWhenDies: 0
        spawnPosition:
          x:
            _serializedValue: 0
          y:
            _serializedValue: 0
          z:
            _serializedValue: 0
      - player: 0
        endWhenDies: 0
        spawnPosition:
          x:
            _serializedValue: 0
          y:
            _serializedValue: 0
          z:
            _serializedValue: 0
      - player: 0
        endWhenDies: 0
        spawnPosition:
          x:
            _serializedValue: 0
          y:
            _serializedValue: 0
          z:
            _serializedValue: 0
      teamName: Team 1
      teamType: 0
      charactersToggle: 0
    - characters:
      - player: 1
        endWhenDies: 0
        spawnPosition:
          x:
            _serializedValue: 0
          y:
            _serializedValue: 0
          z:
            _serializedValue: 0
      - player: 1
        endWhenDies: 0
        spawnPosition:
          x:
            _serializedValue: 0
          y:
            _serializedValue: 0
          z:
            _serializedValue: 0
      - player: 1
        endWhenDies: 0
        spawnPosition:
          x:
            _serializedValue: 0
          y:
            _serializedValue: 0
          z:
            _serializedValue: 0
      teamName: Team 2
      teamType: 0
      charactersToggle: 0
    teamsToggle: 1
  - modeName: Scramble (SFxTK) - 2D 2v2 Team Fight
    teams:
    - characters:
      - player: 0
        endWhenDies: 0
        spawnPosition:
          x:
            _serializedValue: 21474836480
          y:
            _serializedValue: 0
          z:
            _serializedValue: 0
      - player: 0
        endWhenDies: 0
        spawnPosition:
          x:
            _serializedValue: 17179869184
          y:
            _serializedValue: 0
          z:
            _serializedValue: 0
      teamName: Team 1
      teamType: 1
      charactersToggle: 0
    - characters:
      - player: 1
        endWhenDies: 0
        spawnPosition:
          x:
            _serializedValue: -17179869184
          y:
            _serializedValue: 0
          z:
            _serializedValue: 0
      - player: 1
        endWhenDies: 0
        spawnPosition:
          x:
            _serializedValue: -193273528320
          y:
            _serializedValue: 0
          z:
            _serializedValue: 0
      teamName: Team 2
      teamType: 1
      charactersToggle: 0
    teamsToggle: 0
  - modeName: Dynamic Battle (SFA3) - 2D 2v1 Boss Fight
    teams:
    - characters:
      - player: 0
        endWhenDies: 0
        spawnPosition:
          x:
            _serializedValue: 21474836480
          y:
            _serializedValue: 0
          z:
            _serializedValue: 0
      - player: 0
        endWhenDies: 0
        spawnPosition:
          x:
            _serializedValue: 17179869184
          y:
            _serializedValue: 0
          z:
            _serializedValue: 0
      teamName: Team 1
      teamType: 1
      charactersToggle: 0
    - characters:
      - player: 1
        endWhenDies: 1
        spawnPosition:
          x:
            _serializedValue: -17179869184
          y:
            _serializedValue: 0
          z:
            _serializedValue: 0
      teamName: Team 2
      teamType: 1
      charactersToggle: 0
    teamsToggle: 0
  - modeName: Tag Boss (MvC3) - 2D 3v1 Boss Fight
    teams:
    - characters:
      - player: 0
        endWhenDies: 0
        spawnPosition:
          x:
            _serializedValue: 21474836480
          y:
            _serializedValue: 0
          z:
            _serializedValue: 0
      - player: 0
        endWhenDies: 0
        spawnPosition:
          x:
            _serializedValue: 17179869184
          y:
            _serializedValue: 0
          z:
            _serializedValue: 0
      - player: 0
        endWhenDies: 0
        spawnPosition:
          x:
            _serializedValue: 17179869184
          y:
            _serializedValue: 0
          z:
            _serializedValue: 0
      teamName: Team 1
      teamType: 0
      charactersToggle: 0
    - characters:
      - player: 1
        endWhenDies: 1
        spawnPosition:
          x:
            _serializedValue: -17179869184
          y:
            _serializedValue: 0
          z:
            _serializedValue: 0
      teamName: Team 2
      teamType: 1
      charactersToggle: 0
    teamsToggle: 0
  debugOptions:
    debugMode: 0
    emulateNetwork: 0
    trainingModeDebugger: 1
    preloadedObjects: 0
    inputsToggle: 0
    networkToggle: 0
    recordToggle: 0
    hitboxColorsToggle: 0
    displayCollisionMassGizmos: 0
    connectionLog: 1
    ping: 1
    frameDelay: 1
    currentLocalFrame: 0
    currentNetworkFrame: 0
    rollbackLog: 1
    stateTrackerTest: 0
    recordMatchTools: 0
    playbackPhysics: 0
    displayInputsNetwork: 0
    displayInputsVersus: 0
    displayInputsTraining: 0
    displayInputsStoryMode: 0
    displayInputsChallengeMode: 0
    p1DebugInfo:
      toggle: 0
      currentMove: 1
      position: 1
      lifePoints: 1
      gaugePoints: 1
      currentState: 1
      currentSubState: 1
      stunTime: 1
      comboHits: 1
      comboDamage: 1
      inputs: 0
      buttonSequence: 0
      aiWeightList: 0
    p2DebugInfo:
      toggle: 0
      currentMove: 1
      position: 1
      lifePoints: 1
      gaugePoints: 1
      currentState: 1
      currentSubState: 1
      stunTime: 1
      comboHits: 1
      comboDamage: 1
      inputs: 0
      buttonSequence: 0
      aiWeightList: 0
  trainingModeOptions:
    freezeTime: 1
    p1StartingLife: 100
    p2StartingLife: 100
    p1StartingGauge: 0
    p2StartingGauge: 0
    p1Life: 0
    p1Gauge: 1
    p2Life: 0
    p2Gauge: 1
    refillTime: 3
  challengeModeOptions:
  - challengeName: Walk
    description: Press Back, then Forward (A, D)
    character: {fileID: 11400000, guid: 573f29652f969dd429ee24d097b56bc0, type: 2}
    opCharacter: {fileID: 11400000, guid: ac6ffbd93fffdbb47a2a75f1f84ecd37, type: 2}
    ai: {fileID: 0}
    isCombo: 0
    aiOpponent: 0
    challengeSequence: 0
    autoMoveNext: 1
    reloadMatch: 0
    skipOutro: 0
    nextChallengeDelay: 2
    actionListToggle: 1
    actionSequence:
    - actionType: 2
      specialMove: {fileID: 0}
      basicMove: 12
      button: 1
      executionOnly: 0
    - actionType: 0
      specialMove: {fileID: 0}
      basicMove: 0
      button: 0
      executionOnly: 0
  - challengeName: Crouch
    description: Press Down (S)
    character: {fileID: 11400000, guid: 573f29652f969dd429ee24d097b56bc0, type: 2}
    opCharacter: {fileID: 11400000, guid: ac6ffbd93fffdbb47a2a75f1f84ecd37, type: 2}
    ai: {fileID: 0}
    isCombo: 0
    aiOpponent: 0
    challengeSequence: 0
    autoMoveNext: 1
    reloadMatch: 0
    skipOutro: 0
    nextChallengeDelay: 2
    actionListToggle: 0
    actionSequence:
    - actionType: 2
      specialMove: {fileID: 0}
      basicMove: 3
      button: 9
      executionOnly: 0
  - challengeName: Jump
    description: Press Up (W)
    character: {fileID: 11400000, guid: 573f29652f969dd429ee24d097b56bc0, type: 2}
    opCharacter: {fileID: 11400000, guid: ac6ffbd93fffdbb47a2a75f1f84ecd37, type: 2}
    ai: {fileID: 0}
    isCombo: 0
    aiOpponent: 0
    challengeSequence: 0
    autoMoveNext: 0
    reloadMatch: 0
    skipOutro: 0
    nextChallengeDelay: 2
    actionListToggle: 0
    actionSequence:
    - actionType: 2
      specialMove: {fileID: 0}
      basicMove: 5
      button: 9
      executionOnly: 0
  - challengeName: Attack Buttons
    description: 'Press All Attack Buttons: T, Y, U, G, H, J'
    character: {fileID: 11400000, guid: 54057043117984643925ed339c232c0d, type: 2}
    opCharacter: {fileID: 11400000, guid: d6338f103bbb0da46ba6acf3b027f17a, type: 2}
    ai: {fileID: 0}
    isCombo: 0
    aiOpponent: 0
    challengeSequence: 0
    autoMoveNext: 0
    reloadMatch: 0
    skipOutro: 1
    nextChallengeDelay: 2
    actionListToggle: 0
    actionSequence:
    - actionType: 0
      specialMove: {fileID: 0}
      basicMove: 5
      button: 4
      executionOnly: 0
    - actionType: 0
      specialMove: {fileID: 0}
      basicMove: 0
      button: 5
      executionOnly: 0
    - actionType: 0
      specialMove: {fileID: 0}
      basicMove: 0
      button: 6
      executionOnly: 0
    - actionType: 0
      specialMove: {fileID: 0}
      basicMove: 0
      button: 7
      executionOnly: 0
    - actionType: 0
      specialMove: {fileID: 0}
      basicMove: 0
      button: 8
      executionOnly: 0
    - actionType: 0
      specialMove: {fileID: 0}
      basicMove: 0
      button: 9
      executionOnly: 0
  - challengeName: Light Fireball
    description: Down, Forward, Button 1 (T)
    character: {fileID: 11400000, guid: 573f29652f969dd429ee24d097b56bc0, type: 2}
    opCharacter: {fileID: 11400000, guid: f0ed0d0ea0c86e24e8af99019d695928, type: 2}
    ai: {fileID: 0}
    isCombo: 0
    aiOpponent: 0
    challengeSequence: 0
    autoMoveNext: 0
    reloadMatch: 0
    skipOutro: 1
    nextChallengeDelay: 2
    actionListToggle: 0
    actionSequence:
    - actionType: 1
      specialMove: {fileID: 11400000, guid: 61605bd8baf05b041a05edd5c2b6c2a3, type: 2}
      basicMove: 0
      button: 0
      executionOnly: 0
  - challengeName: Heavy Dragon Punch
    description: Forward, Down, Forward, Button 3 (U)
    character: {fileID: 11400000, guid: 54057043117984643925ed339c232c0d, type: 2}
    opCharacter: {fileID: 11400000, guid: 573f29652f969dd429ee24d097b56bc0, type: 2}
    ai: {fileID: 0}
    isCombo: 1
    aiOpponent: 0
    challengeSequence: 0
    autoMoveNext: 0
    reloadMatch: 0
    skipOutro: 1
    nextChallengeDelay: 2
    actionListToggle: 0
    actionSequence:
    - actionType: 1
      specialMove: {fileID: 11400000, guid: b27d4e6a2973c1a47a13969a087e1eff, type: 2}
      basicMove: 0
      button: 0
      executionOnly: 0
  - challengeName: Shinku Hadoken
    description: Down, Forward, Down, Forward, Button 1 (T)
    character: {fileID: 11400000, guid: 54057043117984643925ed339c232c0d, type: 2}
    opCharacter: {fileID: 11400000, guid: 573f29652f969dd429ee24d097b56bc0, type: 2}
    ai: {fileID: 0}
    isCombo: 0
    aiOpponent: 0
    challengeSequence: 0
    autoMoveNext: 0
    reloadMatch: 0
    skipOutro: 1
    nextChallengeDelay: 2
    actionListToggle: 0
    actionSequence:
    - actionType: 1
      specialMove: {fileID: 11400000, guid: 8c36bc67aa9f6a34da526ae64c16569d, type: 2}
      basicMove: 0
      button: 0
      executionOnly: 0
  - challengeName: Hyakuretsukyaku
    description: Button 4 x 3 (G, G, G)
    character: {fileID: 11400000, guid: f0ed0d0ea0c86e24e8af99019d695928, type: 2}
    opCharacter: {fileID: 11400000, guid: ac6ffbd93fffdbb47a2a75f1f84ecd37, type: 2}
    ai: {fileID: 0}
    isCombo: 1
    aiOpponent: 0
    challengeSequence: 0
    autoMoveNext: 0
    reloadMatch: 0
    skipOutro: 1
    nextChallengeDelay: 2
    actionListToggle: 0
    actionSequence:
    - actionType: 1
      specialMove: {fileID: 11400000, guid: a1dcede3ea039844a952770ab0eb3427, type: 2}
      basicMove: 0
      button: 0
      executionOnly: 0
  - challengeName: HouyokuSen
    description: Back (Hold), Forward, Back, Forward, Button 6 (J)
    character: {fileID: 11400000, guid: f0ed0d0ea0c86e24e8af99019d695928, type: 2}
    opCharacter: {fileID: 11400000, guid: 573f29652f969dd429ee24d097b56bc0, type: 2}
    ai: {fileID: 0}
    isCombo: 1
    aiOpponent: 0
    challengeSequence: 0
    autoMoveNext: 0
    reloadMatch: 0
    skipOutro: 1
    nextChallengeDelay: 6
    actionListToggle: 0
    actionSequence:
    - actionType: 1
      specialMove: {fileID: 11400000, guid: d8c6f26a92c1051468eb9f2e5e54fb1e, type: 2}
      basicMove: 0
      button: 0
      executionOnly: 0
  - challengeName: Assist Call
    description: Press Button 4 (G)
    character: {fileID: 11400000, guid: 5d6dc227d62e62a40af291dbbd4c5276, type: 2}
    opCharacter: {fileID: 11400000, guid: ac6ffbd93fffdbb47a2a75f1f84ecd37, type: 2}
    ai: {fileID: 0}
    isCombo: 0
    aiOpponent: 0
    challengeSequence: 0
    autoMoveNext: 0
    reloadMatch: 0
    skipOutro: 1
    nextChallengeDelay: 3
    actionListToggle: 0
    actionSequence:
    - actionType: 1
      specialMove: {fileID: 11400000, guid: acb4d7a241211504aa0fee49b458dbd4, type: 2}
      basicMove: 0
      button: 0
      executionOnly: 0
  - challengeName: Butterfly
    description: Forward, Down, Forward, Button 3
    character: {fileID: 11400000, guid: 5d6dc227d62e62a40af291dbbd4c5276, type: 2}
    opCharacter: {fileID: 11400000, guid: ac6ffbd93fffdbb47a2a75f1f84ecd37, type: 2}
    ai: {fileID: 0}
    isCombo: 1
    aiOpponent: 0
    challengeSequence: 0
    autoMoveNext: 0
    reloadMatch: 0
    skipOutro: 1
    nextChallengeDelay: 4
    actionListToggle: 0
    actionSequence:
    - actionType: 1
      specialMove: {fileID: 11400000, guid: 069844d353e0db9498fc08cfd2a8fad2, type: 2}
      basicMove: 0
      button: 0
      executionOnly: 0
  - challengeName: Power Up Butterfly
    description: '%list%'
    character: {fileID: 11400000, guid: 5d6dc227d62e62a40af291dbbd4c5276, type: 2}
    opCharacter: {fileID: 11400000, guid: ac6ffbd93fffdbb47a2a75f1f84ecd37, type: 2}
    ai: {fileID: 0}
    isCombo: 1
    aiOpponent: 0
    challengeSequence: 0
    autoMoveNext: 0
    reloadMatch: 0
    skipOutro: 1
    nextChallengeDelay: 6
    actionListToggle: 0
    actionSequence:
    - actionType: 1
      specialMove: {fileID: 11400000, guid: 2875ba2b82ba4414684bdca9090da7d4, type: 2}
      basicMove: 0
      button: 0
      executionOnly: 1
    - actionType: 1
      specialMove: {fileID: 11400000, guid: 069844d353e0db9498fc08cfd2a8fad2, type: 2}
      basicMove: 0
      button: 0
      executionOnly: 0
  - challengeName: Rekkaken
    description: '%list%'
    character: {fileID: 11400000, guid: 5d6dc227d62e62a40af291dbbd4c5276, type: 2}
    opCharacter: {fileID: 11400000, guid: ac6ffbd93fffdbb47a2a75f1f84ecd37, type: 2}
    ai: {fileID: 0}
    isCombo: 1
    aiOpponent: 0
    challengeSequence: 0
    autoMoveNext: 0
    reloadMatch: 0
    skipOutro: 1
    nextChallengeDelay: 2
    actionListToggle: 0
    actionSequence:
    - actionType: 1
      specialMove: {fileID: 11400000, guid: 4ff8210b96b80eb49a738f5ec697bc1a, type: 2}
      basicMove: 0
      button: 0
      executionOnly: 0
    - actionType: 1
      specialMove: {fileID: 11400000, guid: d4bd5e580de9ab840aae07e0b7f055a7, type: 2}
      basicMove: 0
      button: 0
      executionOnly: 0
    - actionType: 1
      specialMove: {fileID: 11400000, guid: a320b3894d27c7140a5cca16ec987e8d, type: 2}
      basicMove: 0
      button: 0
      executionOnly: 0
  - challengeName: Power Up  Rekkaken
    description: '%list%'
    character: {fileID: 11400000, guid: 5d6dc227d62e62a40af291dbbd4c5276, type: 2}
    opCharacter: {fileID: 11400000, guid: ac6ffbd93fffdbb47a2a75f1f84ecd37, type: 2}
    ai: {fileID: 0}
    isCombo: 1
    aiOpponent: 0
    challengeSequence: 0
    autoMoveNext: 0
    reloadMatch: 0
    skipOutro: 1
    nextChallengeDelay: 3
    actionListToggle: 0
    actionSequence:
    - actionType: 1
      specialMove: {fileID: 11400000, guid: 2875ba2b82ba4414684bdca9090da7d4, type: 2}
      basicMove: 0
      button: 0
      executionOnly: 1
    - actionType: 1
      specialMove: {fileID: 11400000, guid: 4ff8210b96b80eb49a738f5ec697bc1a, type: 2}
      basicMove: 0
      button: 0
      executionOnly: 0
    - actionType: 1
      specialMove: {fileID: 11400000, guid: d4bd5e580de9ab840aae07e0b7f055a7, type: 2}
      basicMove: 0
      button: 0
      executionOnly: 0
    - actionType: 1
      specialMove: {fileID: 11400000, guid: a320b3894d27c7140a5cca16ec987e8d, type: 2}
      basicMove: 0
      button: 0
      executionOnly: 0
  - challengeName: Super Assist Call
    description: Down, Forward, Button 4
    character: {fileID: 11400000, guid: 5d6dc227d62e62a40af291dbbd4c5276, type: 2}
    opCharacter: {fileID: 11400000, guid: ac6ffbd93fffdbb47a2a75f1f84ecd37, type: 2}
    ai: {fileID: 0}
    isCombo: 0
    aiOpponent: 0
    challengeSequence: 0
    autoMoveNext: 0
    reloadMatch: 0
    skipOutro: 1
    nextChallengeDelay: 5
    actionListToggle: 0
    actionSequence:
    - actionType: 1
      specialMove: {fileID: 11400000, guid: 9248942738b045444ac31f453cf4f4c9, type: 2}
      basicMove: 0
      button: 0
      executionOnly: 0
  - challengeName: Combo Challenge 1
    description: '%list%'
    character: {fileID: 11400000, guid: 573f29652f969dd429ee24d097b56bc0, type: 2}
    opCharacter: {fileID: 11400000, guid: 5d6dc227d62e62a40af291dbbd4c5276, type: 2}
    ai: {fileID: 0}
    isCombo: 1
    aiOpponent: 0
    challengeSequence: 0
    autoMoveNext: 0
    reloadMatch: 0
    skipOutro: 1
    nextChallengeDelay: 3
    actionListToggle: 0
    actionSequence:
    - actionType: 1
      specialMove: {fileID: 11400000, guid: ed8fe64afd430fb40a6208419e3df4f8, type: 2}
      basicMove: 0
      button: 0
      executionOnly: 0
    - actionType: 1
      specialMove: {fileID: 11400000, guid: 304fc07e190e22248901f8df3867899e, type: 2}
      basicMove: 0
      button: 0
      executionOnly: 0
    - actionType: 1
      specialMove: {fileID: 11400000, guid: 3a6b1321720e6ed4e8dd777e899fff59, type: 2}
      basicMove: 0
      button: 0
      executionOnly: 0
  - challengeName: Combo Challenge 2
    description: '%list%'
    character: {fileID: 11400000, guid: 573f29652f969dd429ee24d097b56bc0, type: 2}
    opCharacter: {fileID: 11400000, guid: 54057043117984643925ed339c232c0d, type: 2}
    ai: {fileID: 0}
    isCombo: 1
    aiOpponent: 0
    challengeSequence: 0
    autoMoveNext: 0
    reloadMatch: 0
    skipOutro: 1
    nextChallengeDelay: 3
    actionListToggle: 0
    actionSequence:
    - actionType: 1
      specialMove: {fileID: 11400000, guid: 4b9d5ea5671119d4880ef55ab362d82f, type: 2}
      basicMove: 0
      button: 0
      executionOnly: 0
    - actionType: 1
      specialMove: {fileID: 11400000, guid: 5bae5c2d681fa5847a12e18677e8a6c0, type: 2}
      basicMove: 0
      button: 0
      executionOnly: 0
    - actionType: 1
      specialMove: {fileID: 11400000, guid: 304fc07e190e22248901f8df3867899e, type: 2}
      basicMove: 0
      button: 0
      executionOnly: 0
    - actionType: 1
      specialMove: {fileID: 11400000, guid: 3a6b1321720e6ed4e8dd777e899fff59, type: 2}
      basicMove: 0
      button: 0
      executionOnly: 0
  - challengeName: Combo Challenge 3
    description: '%list%'
    character: {fileID: 11400000, guid: 573f29652f969dd429ee24d097b56bc0, type: 2}
    opCharacter: {fileID: 11400000, guid: 573f29652f969dd429ee24d097b56bc0, type: 2}
    ai: {fileID: 0}
    isCombo: 1
    aiOpponent: 0
    challengeSequence: 1
    autoMoveNext: 0
    reloadMatch: 0
    skipOutro: 0
    nextChallengeDelay: 3
    actionListToggle: 0
    actionSequence:
    - actionType: 1
      specialMove: {fileID: 11400000, guid: 606f9b5f2f9e5314e953190dfab8352c, type: 2}
      basicMove: 0
      button: 0
      executionOnly: 0
    - actionType: 1
      specialMove: {fileID: 11400000, guid: 67aeb1212cc4a2a49ab0ae2c36977bf9, type: 2}
      basicMove: 0
      button: 0
      executionOnly: 0
    - actionType: 1
      specialMove: {fileID: 11400000, guid: ed8fe64afd430fb40a6208419e3df4f8, type: 2}
      basicMove: 0
      button: 0
      executionOnly: 0
    - actionType: 1
      specialMove: {fileID: 11400000, guid: 4b9d5ea5671119d4880ef55ab362d82f, type: 2}
      basicMove: 0
      button: 0
      executionOnly: 0
    - actionType: 1
      specialMove: {fileID: 11400000, guid: 304fc07e190e22248901f8df3867899e, type: 2}
      basicMove: 0
      button: 0
      executionOnly: 0
    - actionType: 1
      specialMove: {fileID: 11400000, guid: 3a6b1321720e6ed4e8dd777e899fff59, type: 2}
      basicMove: 0
      button: 0
      executionOnly: 0
    - actionType: 1
      specialMove: {fileID: 11400000, guid: 8d9defa77c9024c439672d309bea025a, type: 2}
      basicMove: 0
      button: 0
      executionOnly: 0
    - actionType: 1
      specialMove: {fileID: 11400000, guid: 606f9b5f2f9e5314e953190dfab8352c, type: 2}
      basicMove: 0
      button: 0
      executionOnly: 0
    - actionType: 1
      specialMove: {fileID: 11400000, guid: 5de776f961c4bd44386c4a3132766cfb, type: 2}
      basicMove: 0
      button: 0
      executionOnly: 0
    - actionType: 1
      specialMove: {fileID: 11400000, guid: 50091ccf7790fc041b1348f8f47f9056, type: 2}
      basicMove: 0
      button: 0
      executionOnly: 0
    - actionType: 1
      specialMove: {fileID: 11400000, guid: 4b9d5ea5671119d4880ef55ab362d82f, type: 2}
      basicMove: 0
      button: 0
      executionOnly: 0
    - actionType: 1
      specialMove: {fileID: 11400000, guid: 5bae5c2d681fa5847a12e18677e8a6c0, type: 2}
      basicMove: 0
      button: 0
      executionOnly: 0
    - actionType: 1
      specialMove: {fileID: 11400000, guid: ad8e56a260bd08b41865c65791498d28, type: 2}
      basicMove: 0
      button: 0
      executionOnly: 0
  aiOptions:
    engine: 1
    attackWhenEnemyIsDown: 0
    moveWhenEnemyIsDown: 1
    inputFrequency: 0
    behaviourToggle: 1
    distanceBehaviour:
    - characterDistance: 2
      proximityRangeBegins: 0
      proximityRangeEnds: 30
      movingForwardProbability: 0
      movingBackProbability: 0.3
      jumpingProbability: 0.6
      crouchProbability: 0.5
      attackProbability: 0.9
    - characterDistance: 3
      proximityRangeBegins: 31
      proximityRangeEnds: 70
      movingForwardProbability: 0.6
      movingBackProbability: 0.3
      jumpingProbability: 0.5
      crouchProbability: 0.5
      attackProbability: 0.1
    - characterDistance: 4
      proximityRangeBegins: 71
      proximityRangeEnds: 100
      movingForwardProbability: 0.9
      movingBackProbability: 0
      jumpingProbability: 0.6
      crouchProbability: 0.5
      attackProbability: 0
    multiCoreSupport: 1
    persistentBehavior: 0
    difficultyToggle: 0
    difficultySettings:
    - difficultyLevel: 0
      overrideTimeBetweenDecisions: 1
      timeBetweenDecisions: 0.4
      overrideTimeBetweenActions: 1
      timeBetweenActions: 0.1
      overrideAggressiveness: 1
      aggressiveness: 0.1
      overrideRuleCompliance: 0
      ruleCompliance: 0.9
      overrideComboEfficiency: 1
      comboEfficiency: 0.1
      startupBehavior: 3
    - difficultyLevel: 1
      overrideTimeBetweenDecisions: 1
      timeBetweenDecisions: 0.3
      overrideTimeBetweenActions: 1
      timeBetweenActions: 0.1
      overrideAggressiveness: 1
      aggressiveness: 0.3
      overrideRuleCompliance: 0
      ruleCompliance: 0.9
      overrideComboEfficiency: 1
      comboEfficiency: 0.2
      startupBehavior: 3
    - difficultyLevel: 2
      overrideTimeBetweenDecisions: 1
      timeBetweenDecisions: 0
      overrideTimeBetweenActions: 1
      timeBetweenActions: 0.05
      overrideAggressiveness: 1
      aggressiveness: 0.7
      overrideRuleCompliance: 1
      ruleCompliance: 0.9
      overrideComboEfficiency: 1
      comboEfficiency: 1
      startupBehavior: 3
    - difficultyLevel: 3
      overrideTimeBetweenDecisions: 1
      timeBetweenDecisions: 0.1
      overrideTimeBetweenActions: 1
      timeBetweenActions: 0.05
      overrideAggressiveness: 1
      aggressiveness: 0.6
      overrideRuleCompliance: 0
      ruleCompliance: 0.9
      overrideComboEfficiency: 1
      comboEfficiency: 1
      startupBehavior: 4
    - difficultyLevel: 4
      overrideTimeBetweenDecisions: 1
      timeBetweenDecisions: 0
      overrideTimeBetweenActions: 1
      timeBetweenActions: 0.05
      overrideAggressiveness: 1
      aggressiveness: 0.6
      overrideRuleCompliance: 1
      ruleCompliance: 0.9
      overrideComboEfficiency: 1
      comboEfficiency: 1
      startupBehavior: 4
    - difficultyLevel: 5
      overrideTimeBetweenDecisions: 1
      timeBetweenDecisions: 0
      overrideTimeBetweenActions: 1
      timeBetweenActions: 0
      overrideAggressiveness: 1
      aggressiveness: 0.7
      overrideRuleCompliance: 1
      ruleCompliance: 0.9
      overrideComboEfficiency: 1
      comboEfficiency: 1
      startupBehavior: 5
    selectedDifficultyLevel: 5
    selectedDifficulty:
      difficultyLevel: 5
      overrideTimeBetweenDecisions: 1
      timeBetweenDecisions: 0
      overrideTimeBetweenActions: 1
      timeBetweenActions: 0
      overrideAggressiveness: 1
      aggressiveness: 0.7
      overrideRuleCompliance: 1
      ruleCompliance: 0.9
      overrideComboEfficiency: 1
      comboEfficiency: 1
      startupBehavior: 5
  networkOptions:
    forceAnimationControl: 1
    disableRootMotion: 0
    disableBlending: 0
    disableRotationBlend: 0
    applyFrameDelayOffline: 0
    recordingBuffer: 360
    port: 1337
    floatDesynchronizationThreshold: 0.0001
    logSyncMsg: 1
    postRollbackRecording: 1
    generateVariableLog: 1
    textFilePath: VariableLog.txt
    networkService: 1
    authKey: 
    lobbies:
    - lobbyName: 
      matchMakingType: 0
      gameMode: 0
      allowPrivateRooms: 0
      matchMakingToggle: 0
      winnerToggle: 0
      loserToggle: 0
      matchMakingUserData: []
      winnerUserData: []
      loserUserData: []
    photonHostingService: 0
    playFabTitleId: 795
    photonApplicationId: 809-9d76dc2df375c7-b809-9d76dc2df375
    lanDiscoveryPort: 1338
    lanDiscoveryBroadcastInterval: 1
    lanDiscoverySearchInterval: 5
    lanDiscoverySearchTimeout: 120
    allowRollBacks: 1
    rollbackBalancing: 2
    frameDelayType: 1
    minFrameDelay: 2
    maxFrameDelay: 4
    defaultFrameDelay: 3
    maxBufferSize: 360
    maxFastForwards: 30
    spawnBuffer: 30
    ufeTrackers: 0
    networkMessageSize: 2
    onlySendInputChanges: 1
    inputMessageFrequency: 0
    synchronizationMessageFrequency: 0
    synchronizationAction: 0
  music: 1
  musicVolume: 1
  soundfx: 1
  soundfxVolume: 1
  colorStateOne: {r: 1, g: 0, b: 0, a: 1}
  colorIsHit: {r: 1, g: 0, b: 1, a: 1}
  colorBodyCollider: {r: 1, g: 0.92156863, b: 0.015686275, a: 1}
  colorNoCollider: {r: 1, g: 1, b: 1, a: 1}
  colorThrowCollider: {r: 1, g: 0, b: 0.5, a: 1}
  colorPhysicalInvincibleCollider: {r: 0.5, g: 0.5, b: 0.5, a: 1}
  colorProjectileInvincibleCollider: {r: 0, g: 1, b: 1, a: 1}
  colorHitCollider: {r: 0, g: 1, b: 0, a: 1}
  colorLowHitBoxType: {r: 1, g: 0, b: 0, a: 1}
  colorHighHitBoxType: {r: 1, g: 0.92156863, b: 0.015686275, a: 1}
  colorCollisionBox: {r: 1, g: 0.92156863, b: 0.015686275, a: 1}
  colorHurtBoxThrow: {r: 1, g: 0.5, b: 0, a: 1}
  colorHurtBoxNotThrow: {r: 0, g: 1, b: 1, a: 1}
  colorBlockBox: {r: 0, g: 0, b: 1, a: 1}
  colorStateOneFill: 0
  colorIsHitFill: 0
  colorBodyColliderFill: 0
  colorNoColliderFill: 0
  colorThrowColliderFill: 0
  colorPhysicalInvincibleColliderFill: 0
  colorProjectileInvincibleColliderFill: 0
  colorHitColliderFill: 0
  colorLowHitBoxTypeFill: 0
  colorHighHitBoxTypeFill: 0
  colorCollisionBoxFill: 0
  colorHurtBoxThrowFill: 0
  colorHurtBoxNotThrowFill: 0
  colorBlockBoxFill: 0
