Time,header.seq,header.stamp.secs,header.stamp.nsecs,header.frame_id,latitude,longitude,altitude,utm_easting,utm_northing,zone,letter
1644343592.2841876,44,0,0,,42.204755,71.059602,38.1,670027.0625390466,4674563.756089874,42,T
1644343593.2743874,45,0,0,,42.204755,71.059602,38.1,670027.0625390466,4674563.756089874,42,T
1644343594.2780592,46,0,0,,42.204755,71.059602,38.1,670027.0625390466,4674563.756089874,42,T
1644343595.278431,47,0,0,,42.204755,71.059602,38.1,670027.0625390466,4674563.756089874,42,T
1644343596.279697,48,0,0,,42.204755,71.059602,38.1,670027.0625390466,4674563.756089874,42,T
1644343597.277423,49,0,0,,42.204755,71.059602,38.1,670027.0625390466,4674563.756089874,42,T
1644343598.2798157,50,0,0,,42.204755,71.059602,38.2,670027.0625390466,4674563.756089874,42,T
1644343599.2847857,51,0,0,,42.204755,71.059602,38.2,670027.0625390466,4674563.756089874,42,T
1644343600.2767484,52,0,0,,42.204755,71.059602,38.2,670027.0625390466,4674563.756089874,42,T
1644343601.2775583,53,0,0,,42.204755,71.059602,38.2,670027.0625390466,4674563.756089874,42,T
1644343602.2794836,54,0,0,,42.204755,71.059602,38.2,670027.0625390466,4674563.756089874,42,T
1644343603.284682,55,0,0,,42.204755,71.059602,38.2,670027.0625390466,4674563.756089874,42,T
1644343604.280192,56,0,0,,42.204755,71.059602,38.2,670027.0625390466,4674563.756089874,42,T
1644343605.2753649,57,0,0,,42.204755,71.059602,38.2,670027.0625390466,4674563.756089874,42,T
1644343606.2755685,58,0,0,,42.204755,71.059602,38.2,670027.0625390466,4674563.756089874,42,T
1644343607.2789857,59,0,0,,42.204755,71.059602,38.2,670027.0625390466,4674563.756089874,42,T
1644343608.286905,60,0,0,,42.204755,71.059602,38.2,670027.0625390466,4674563.756089874,42,T
1644343609.2837226,61,0,0,,42.204755,71.059602,38.2,670027.0625390466,4674563.756089874,42,T
1644343610.2773,62,0,0,,42.204755,71.059602,38.2,670027.0625390466,4674563.756089874,42,T
1644343611.2789977,63,0,0,,42.204755,71.059602,38.2,670027.0625390466,4674563.756089874,42,T
1644343612.2897172,64,0,0,,42.204755,71.059602,38.2,670027.0625390466,4674563.756089874,42,T
1644343613.2809455,65,0,0,,42.204755,71.059602,38.2,670027.0625390466,4674563.756089874,42,T
1644343614.2790914,66,0,0,,42.204755,71.059602,38.3,670027.0625390466,4674563.756089874,42,T
1644343615.2761278,67,0,0,,42.204755,71.059602,38.3,670027.0625390466,4674563.756089874,42,T
1644343616.292413,68,0,0,,42.204755,71.059602,38.3,670027.0625390466,4674563.756089874,42,T
1644343617.2949126,69,0,0,,42.204755,71.059602,38.3,670027.0625390466,4674563.756089874,42,T
1644343618.2946262,70,0,0,,42.204755,71.059602,38.3,670027.0625390466,4674563.756089874,42,T
1644343619.2941697,71,0,0,,42.204755,71.059602,38.3,670027.0625390466,4674563.756089874,42,T
1644343620.297249,72,0,0,,42.204755,71.059602,38.3,670027.0625390466,4674563.756089874,42,T
1644343621.2979822,73,0,0,,42.204755,71.059602,38.4,670027.0625390466,4674563.756089874,42,T
1644343622.2965126,74,0,0,,42.204755,71.059602,38.4,670027.0625390466,4674563.756089874,42,T
1644343623.2996874,75,0,0,,42.204754,71.059602,38.4,670027.0652216505,4674563.64504993,42,T
1644343624.3075798,76,0,0,,42.204754,71.059601,38.4,670026.9826647671,4674563.643055446,42,T
1644343625.3027778,77,0,0,,42.204754,71.059601,38.4,670026.9826647671,4674563.643055446,42,T
1644343626.2955544,78,0,0,,42.204754,71.059601,38.4,670026.9826647671,4674563.643055446,42,T
1644343627.2959566,79,0,0,,42.204754,71.059601,38.4,670026.9826647671,4674563.643055446,42,T
1644343628.2957299,80,0,0,,42.204754,71.059601,38.5,670026.9826647671,4674563.643055446,42,T
1644343629.294443,81,0,0,,42.204754,71.059601,38.5,670026.9826647671,4674563.643055446,42,T
1644343630.2955594,82,0,0,,42.204754,71.059601,38.5,670026.9826647671,4674563.643055446,42,T
1644343631.279775,83,0,0,,42.204754,71.059601,38.5,670026.9826647671,4674563.643055446,42,T
1644343632.296061,84,0,0,,42.204754,71.059601,38.5,670026.9826647671,4674563.643055446,42,T
1644343633.3011649,85,0,0,,42.204754,71.059601,38.5,670026.9826647671,4674563.643055446,42,T
1644343634.2804503,86,0,0,,42.204754,71.059601,38.5,670026.9826647671,4674563.643055446,42,T
1644343635.2955356,87,0,0,,42.204754,71.059601,38.5,670026.9826647671,4674563.643055446,42,T
1644343636.2813718,88,0,0,,42.204754,71.059601,38.5,670026.9826647671,4674563.643055446,42,T
1644343637.2788627,89,0,0,,42.204754,71.059601,38.5,670026.9826647671,4674563.643055446,42,T
1644343638.2785828,90,0,0,,42.204754,71.059601,38.6,670026.9826647671,4674563.643055446,42,T
1644343639.2797275,91,0,0,,42.204754,71.059601,38.6,670026.9826647671,4674563.643055446,42,T
1644343640.282167,92,0,0,,42.204754,71.059601,38.6,670026.9826647671,4674563.643055446,42,T
1644343641.279947,93,0,0,,42.204754,71.059601,38.6,670026.9826647671,4674563.643055446,42,T
1644343642.279323,94,0,0,,42.204754,71.059601,38.6,670026.9826647671,4674563.643055446,42,T
1644343643.278333,95,0,0,,42.204754,71.059601,38.6,670026.9826647671,4674563.643055446,42,T
1644343644.2809587,96,0,0,,42.204754,71.059601,38.6,670026.9826647671,4674563.643055446,42,T
1644343645.2791083,97,0,0,,42.204754,71.059601,38.6,670026.9826647671,4674563.643055446,42,T
1644343646.2806613,98,0,0,,42.204754,71.059601,38.6,670026.9826647671,4674563.643055446,42,T
1644343647.2792776,99,0,0,,42.204754,71.059601,38.6,670026.9826647671,4674563.643055446,42,T
1644343648.27898,100,0,0,,42.204754,71.059601,38.6,670026.9826647671,4674563.643055446,42,T
1644343649.2818472,101,0,0,,42.204754,71.059601,38.6,670026.9826647671,4674563.643055446,42,T
1644343650.2796578,102,0,0,,42.204754,71.059601,38.6,670026.9826647671,4674563.643055446,42,T
1644343651.2803786,103,0,0,,42.204754,71.059601,38.6,670026.9826647671,4674563.643055446,42,T
1644343652.2786334,104,0,0,,42.204754,71.059601,38.6,670026.9826647671,4674563.643055446,42,T
1644343653.2780473,105,0,0,,42.204754,71.059601,38.7,670026.9826647671,4674563.643055446,42,T
1644343654.2805223,106,0,0,,42.204754,71.059601,38.7,670026.9826647671,4674563.643055446,42,T
1644343655.277678,107,0,0,,42.204754,71.059601,38.7,670026.9826647671,4674563.643055446,42,T
1644343656.2821872,108,0,0,,42.204754,71.059601,38.7,670026.9826647671,4674563.643055446,42,T
1644343657.2781272,109,0,0,,42.204754,71.059601,38.7,670026.9826647671,4674563.643055446,42,T
1644343658.2794702,110,0,0,,42.204754,71.059601,38.7,670026.9826647671,4674563.643055446,42,T
1644343659.2796474,111,0,0,,42.204754,71.059601,38.7,670026.9826647671,4674563.643055446,42,T
1644343660.2805421,112,0,0,,42.204754,71.059601,38.7,670026.9826647671,4674563.643055446,42,T
1644343661.2773173,113,0,0,,42.204754,71.059602,39.5,670027.0652216505,4674563.64504993,42,T
1644343662.2810972,114,0,0,,42.204754,71.059602,39.4,670027.0652216505,4674563.64504993,42,T
1644343663.2774897,115,0,0,,42.204753000000004,71.059606,40.3,670027.3981317916,4674563.541987931,42,T
1644343664.2811277,116,0,0,,42.204754,71.059606,41.0,670027.3954491825,4674563.653027874,42,T
1644343665.2769737,117,0,0,,42.204754,71.059604,41.9,670027.2303354155,4674563.649038901,42,T
1644343666.2920222,118,0,0,,42.204750999999995,71.059629,41.1,670029.3023054156,4674563.365781531,42,T
1644343667.2946064,119,0,0,,42.204750999999995,71.059629,41.1,670029.3023054156,4674563.365781531,42,T
1644343668.2804801,120,0,0,,42.204750999999995,71.059629,41.1,670029.3023054156,4674563.365781531,42,T
1644343669.2938032,121,0,0,,42.204752,71.05963,41.0,670029.3821796607,4674563.478815984,42,T
1644343670.2938194,122,0,0,,42.204752,71.05963200000001,40.8,670029.5472934353,4674563.482805009,42,T
1644343671.2942374,123,0,0,,42.204752,71.05963200000001,40.6,670029.5472934353,4674563.482805009,42,T
1644343672.2968936,124,0,0,,42.204753000000004,71.05963,40.7,670029.3794970204,4674563.589855927,42,T
1644343673.2945426,125,0,0,,42.204753000000004,71.059631,40.7,670029.4620539073,4674563.591850439,42,T
1644343674.2941456,126,0,0,,42.204753000000004,71.05963200000001,40.5,670029.5446107923,4674563.593844952,42,T
1644343675.2961998,127,0,0,,42.204753000000004,71.05963200000001,40.5,670029.5446107923,4674563.593844952,42,T
1644343676.295558,128,0,0,,42.204753000000004,71.05963200000001,40.5,670029.5446107923,4674563.593844952,42,T
1644343677.295827,129,0,0,,42.204753000000004,71.05963200000001,40.5,670029.5446107923,4674563.593844952,42,T
1644343678.2938457,130,0,0,,42.204753000000004,71.05963200000001,40.5,670029.5446107923,4674563.593844952,42,T
1644343679.2969162,131,0,0,,42.204753000000004,71.05963200000001,40.5,670029.5446107923,4674563.593844952,42,T
1644343680.299621,132,0,0,,42.204753000000004,71.05963200000001,40.5,670029.5446107923,4674563.593844952,42,T
1644343681.2976384,133,0,0,,42.204753000000004,71.05963200000001,40.5,670029.5446107923,4674563.593844952,42,T
1644343682.27858,134,0,0,,42.204753000000004,71.05963200000001,40.5,670029.5446107923,4674563.593844952,42,T
1644343683.2934005,135,0,0,,42.204753000000004,71.05963200000001,40.5,670029.5446107923,4674563.593844952,42,T
1644343684.296287,136,0,0,,42.204754,71.059634,40.3,670029.7070419146,4674563.708873924,42,T
1644343685.2781157,137,0,0,,42.204754,71.059634,40.3,670029.7070419146,4674563.708873924,42,T
1644343686.2955425,138,0,0,,42.204754,71.059635,40.3,670029.7895987981,4674563.71086844,42,T
1644343687.2790205,139,0,0,,42.204754,71.059635,40.3,670029.7895987981,4674563.71086844,42,T
1644343688.2789242,140,0,0,,42.204754,71.059635,40.3,670029.7895987981,4674563.71086844,42,T
1644343689.2834208,141,0,0,,42.204754,71.059635,40.3,670029.7895987981,4674563.71086844,42,T
1644343690.2782068,142,0,0,,42.204754,71.059635,40.3,670029.7895987981,4674563.71086844,42,T
1644343691.278441,143,0,0,,42.204754,71.059635,40.3,670029.7895987981,4674563.71086844,42,T
1644343692.2813609,144,0,0,,42.204754,71.059635,40.3,670029.7895987981,4674563.71086844,42,T
1644343693.2795475,145,0,0,,42.204754,71.059635,40.3,670029.7895987981,4674563.71086844,42,T
1644343694.2780564,146,0,0,,42.204754,71.059635,40.3,670029.7895987981,4674563.71086844,42,T
1644343695.2782137,147,0,0,,42.204754,71.059635,40.3,670029.7895987981,4674563.71086844,42,T
1644343696.2808328,148,0,0,,42.204754,71.059635,40.3,670029.7895987981,4674563.71086844,42,T
1644343697.3058405,149,0,0,,42.204754,71.059635,40.3,670029.7895987981,4674563.71086844,42,T
1644343698.2783406,150,0,0,,42.204754,71.059635,40.3,670029.7895987981,4674563.71086844,42,T
1644343699.2812626,151,0,0,,42.204754,71.059635,40.3,670029.7895987981,4674563.71086844,42,T
1644343700.2782989,152,0,0,,42.204754,71.059635,40.3,670029.7895987981,4674563.71086844,42,T
1644343701.278406,153,0,0,,42.204754,71.059635,40.3,670029.7895987981,4674563.71086844,42,T
1644343702.2783084,154,0,0,,42.204754,71.059635,40.3,670029.7895987981,4674563.71086844,42,T
1644343703.2776735,155,0,0,,42.204754,71.059635,40.3,670029.7895987981,4674563.71086844,42,T
1644343704.2794878,156,0,0,,42.204754,71.059635,40.3,670029.7895987981,4674563.71086844,42,T
1644343705.2789118,157,0,0,,42.204754,71.059635,40.3,670029.7895987981,4674563.71086844,42,T
1644343706.2793891,158,0,0,,42.204754,71.059635,40.3,670029.7895987981,4674563.71086844,42,T
1644343707.2777007,159,0,0,,42.204754,71.059635,40.3,670029.7895987981,4674563.71086844,42,T
1644343708.2774558,160,0,0,,42.204755,71.05963700000001,40.2,670029.9520299159,4674563.825897417,42,T
1644343709.276994,161,0,0,,42.204755,71.05963700000001,40.2,670029.9520299159,4674563.825897417,42,T
1644343710.277293,162,0,0,,42.204755,71.059638,40.1,670030.0345867983,4674563.827891936,42,T
1644343711.2787514,163,0,0,,42.204755,71.059638,40.1,670030.0345867983,4674563.827891936,42,T
1644343712.2771788,164,0,0,,42.204755,71.059638,40.1,670030.0345867983,4674563.827891936,42,T
1644343713.2775226,165,0,0,,42.204755,71.059638,40.1,670030.0345867983,4674563.827891936,42,T
1644343714.2761307,166,0,0,,42.204755999999996,71.059639,40.2,670030.1144610263,4674563.940926398,42,T
1644343715.279967,167,0,0,,42.204755999999996,71.059639,40.2,670030.1144610263,4674563.940926398,42,T
1644343716.2786899,168,0,0,,42.204755999999996,71.059639,40.2,670030.1144610263,4674563.940926398,42,T
1644343717.2915218,169,0,0,,42.204755999999996,71.059642,39.9,670030.3621316695,4674563.946909962,42,T
1644343718.2952054,170,0,0,,42.204755999999996,71.059645,39.8,670030.6098023129,4674563.952893537,42,T
1644343719.2946844,171,0,0,,42.204755999999996,71.059647,39.6,670030.774916073,4674563.95688259,42,T
1644343720.2942178,172,0,0,,42.204755999999996,71.059649,39.5,670030.9400298331,4674563.960871648,42,T
1644343721.2780564,173,0,0,,42.204755999999996,71.05965,39.5,670031.0225867163,4674563.962866178,42,T
1644343722.2942963,174,0,0,,42.204755999999996,71.059652,39.3,670031.1877004786,4674563.966855242,42,T
1644343723.297531,175,0,0,,42.204755999999996,71.059652,39.3,670031.1877004786,4674563.966855242,42,T
1644343724.2943888,176,0,0,,42.204757,71.059654,39.1,670031.3501315669,4674564.081884254,42,T
1644343725.2933035,177,0,0,,42.204757,71.059656,39.1,670031.5152453267,4674564.085873324,42,T
1644343726.296325,178,0,0,,42.204757,71.059651,40.4,670031.1024609274,4674564.075900653,42,T
1644343727.2962277,179,0,0,,42.204758,71.059648,41.5,670030.8521076259,4674564.180957005,42,T
1644343728.2964418,180,0,0,,42.204757,71.059647,41.5,670030.7722334103,4674564.067922534,42,T
1644343729.297001,181,0,0,,42.204758,71.059646,42.1,670030.6869938689,4674564.176967949,42,T
1644343730.2942007,182,0,0,,42.204758,71.059647,41.9,670030.7695507475,4674564.178962477,42,T
1644343731.2951345,183,0,0,,42.204759,71.05965,41.8,670031.0145387162,4674564.295986009,42,T
1644343732.29577,184,0,0,,42.204759,71.059649,41.8,670030.9319818369,4674564.293991478,42,T
1644343733.279034,185,0,0,,42.204759,71.059649,41.8,670030.9319818369,4674564.293991478,42,T
1644343734.2958114,186,0,0,,42.204759,71.059649,41.8,670030.9319818369,4674564.293991478,42,T
1644343735.2992594,187,0,0,,42.204759,71.059649,41.8,670030.9319818369,4674564.293991478,42,T
1644343736.278474,188,0,0,,42.204759,71.059649,41.8,670030.9319818369,4674564.293991478,42,T
1644343737.2928035,189,0,0,,42.204759,71.05965,41.7,670031.0145387162,4674564.295986009,42,T
1644343738.2761517,190,0,0,,42.204759,71.05965,41.8,670031.0145387162,4674564.295986009,42,T
1644343739.2783568,191,0,0,,42.204759,71.05965,41.8,670031.0145387162,4674564.295986009,42,T
1644343740.2770348,192,0,0,,42.204759,71.05965,41.8,670031.0145387162,4674564.295986009,42,T
1644343741.2789536,193,0,0,,42.204759,71.05965,41.8,670031.0145387162,4674564.295986009,42,T
1644343742.2758043,194,0,0,,42.20475999999999,71.059651,41.8,670031.0944129232,4674564.409020483,42,T
1644343743.2780778,195,0,0,,42.20475999999999,71.059651,41.8,670031.0944129232,4674564.409020483,42,T
1644343744.2764452,196,0,0,,42.20475999999999,71.059651,41.9,670031.0944129232,4674564.409020483,42,T
1644343745.276875,197,0,0,,42.20475999999999,71.059651,41.9,670031.0944129232,4674564.409020483,42,T
1644343746.2761292,198,0,0,,42.20475999999999,71.059651,42.0,670031.0944129232,4674564.409020483,42,T
1644343747.2779975,199,0,0,,42.20475999999999,71.059651,42.0,670031.0944129232,4674564.409020483,42,T
1644343748.280092,200,0,0,,42.204761,71.059651,42.0,670031.091730255,4674564.520060425,42,T
1644343749.2769728,201,0,0,,42.204761,71.059651,42.1,670031.091730255,4674564.520060425,42,T
1644343750.2779794,202,0,0,,42.204761,71.059651,42.1,670031.091730255,4674564.520060425,42,T
1644343751.2782047,203,0,0,,42.204761,71.05965,42.3,670031.0091733825,4674564.518065893,42,T
1644343752.2800026,204,0,0,,42.204761,71.05965,42.3,670031.0091733825,4674564.518065893,42,T
1644343753.277192,205,0,0,,42.204761,71.05965,42.3,670031.0091733825,4674564.518065893,42,T
1644343754.2786324,206,0,0,,42.204761,71.05965,42.3,670031.0091733825,4674564.518065893,42,T
1644343755.2787085,207,0,0,,42.204761,71.05965,42.3,670031.0091733825,4674564.518065893,42,T
1644343756.2779026,208,0,0,,42.204761,71.05965,42.3,670031.0091733825,4674564.518065893,42,T
1644343757.2762296,209,0,0,,42.204762,71.05965,42.4,670031.0064907157,4674564.629105837,42,T
1644343758.2783298,210,0,0,,42.204762,71.05965,42.4,670031.0064907157,4674564.629105837,42,T
1644343759.2781882,211,0,0,,42.204762,71.05965,42.4,670031.0064907157,4674564.629105837,42,T
1644343760.2783418,212,0,0,,42.204762,71.05965,42.4,670031.0064907157,4674564.629105837,42,T
1644343761.2760885,213,0,0,,42.204762,71.059648,42.8,670030.841376969,4674564.625116777,42,T
1644343762.278863,214,0,0,,42.204762,71.059648,42.8,670030.841376969,4674564.625116777,42,T
1644343763.2775466,215,0,0,,42.204762,71.059648,42.8,670030.841376969,4674564.625116777,42,T
1644343764.2798586,216,0,0,,42.204762,71.059648,42.8,670030.841376969,4674564.625116777,42,T
1644343765.2800493,217,0,0,,42.204762,71.059648,42.8,670030.841376969,4674564.625116777,42,T
1644343766.2776825,218,0,0,,42.204762,71.059648,42.8,670030.841376969,4674564.625116777,42,T
1644343767.279006,219,0,0,,42.204762,71.059648,42.8,670030.841376969,4674564.625116777,42,T
1644343768.2964041,220,0,0,,42.204762,71.059648,42.8,670030.841376969,4674564.625116777,42,T
1644343769.2941022,221,0,0,,42.204762,71.059648,42.9,670030.841376969,4674564.625116777,42,T
1644343770.294734,222,0,0,,42.204762,71.059648,42.9,670030.841376969,4674564.625116777,42,T
1644343771.2941258,223,0,0,,42.204762,71.059648,42.9,670030.841376969,4674564.625116777,42,T
1644343772.2782521,224,0,0,,42.204762,71.059648,42.9,670030.841376969,4674564.625116777,42,T
1644343773.2934806,225,0,0,,42.204762,71.059648,42.9,670030.841376969,4674564.625116777,42,T
1644343774.294238,226,0,0,,42.204762,71.059648,42.9,670030.841376969,4674564.625116777,42,T
1644343775.2955327,227,0,0,,42.204762,71.059648,42.9,670030.841376969,4674564.625116777,42,T
1644343776.2971017,228,0,0,,42.204762,71.059646,43.3,670030.6762632225,4674564.621127721,42,T
1644343777.295077,229,0,0,,42.204763,71.059646,43.3,670030.6735805606,4674564.732167664,42,T
1644343778.2935977,230,0,0,,42.204763,71.059646,43.3,670030.6735805606,4674564.732167664,42,T
1644343779.2960815,231,0,0,,42.204763,71.059646,43.3,670030.6735805606,4674564.732167664,42,T
1644343780.2949975,232,0,0,,42.204763,71.059647,43.3,670030.7561374326,4674564.734162192,42,T
1644343781.2958753,233,0,0,,42.204763,71.059647,43.3,670030.7561374326,4674564.734162192,42,T
1644343782.2946415,234,0,0,,42.204763,71.059647,43.3,670030.7561374326,4674564.734162192,42,T
1644343783.2944024,235,0,0,,42.204764,71.059647,43.4,670030.7534547695,4674564.845202134,42,T
1644343784.3067956,236,0,0,,42.204764,71.059647,43.4,670030.7534547695,4674564.845202134,42,T
1644343785.291448,237,0,0,,42.204764,71.059647,43.4,670030.7534547695,4674564.845202134,42,T
1644343786.3060684,238,0,0,,42.204764,71.059647,43.4,670030.7534547695,4674564.845202134,42,T
1644343787.2914004,239,0,0,,42.204764,71.059647,43.4,670030.7534547695,4674564.845202134,42,T
1644343788.2979145,240,0,0,,42.204764,71.059647,43.4,670030.7534547695,4674564.845202134,42,T
1644343789.2876635,241,0,0,,42.204764,71.059647,43.4,670030.7534547695,4674564.845202134,42,T
1644343790.2773752,242,0,0,,42.204764,71.059647,43.4,670030.7534547695,4674564.845202134,42,T
1644343791.2792451,243,0,0,,42.204764,71.059646,43.5,670030.6708978988,4674564.843207607,42,T
1644343792.2798364,244,0,0,,42.204764,71.059646,43.6,670030.6708978988,4674564.843207607,42,T
1644343793.2804623,245,0,0,,42.204764,71.059646,43.6,670030.6708978988,4674564.843207607,42,T
1644343794.2807946,246,0,0,,42.204764,71.059645,43.6,670030.5883410303,4674564.84121308,42,T
1644343795.278579,247,0,0,,42.204763,71.059645,43.7,670030.5910236908,4674564.730173138,42,T
1644343796.2795992,248,0,0,,42.204764,71.059645,43.7,670030.5883410303,4674564.84121308,42,T
1644343797.2814245,249,0,0,,42.204764,71.059645,43.7,670030.5883410303,4674564.84121308,42,T
1644343798.275966,250,0,0,,42.204764,71.059646,43.7,670030.6708978988,4674564.843207607,42,T
1644343799.2771833,251,0,0,,42.204764,71.059647,43.6,670030.7534547695,4674564.845202134,42,T
1644343800.2764087,252,0,0,,42.204764,71.059647,43.6,670030.7534547695,4674564.845202134,42,T
1644343801.2781808,253,0,0,,42.204764,71.059647,43.6,670030.7534547695,4674564.845202134,42,T
1644343802.27766,254,0,0,,42.204764,71.059649,43.5,670030.9185685088,4674564.849191193,42,T
1644343803.2768934,255,0,0,,42.204764,71.05965,43.6,670031.0011253817,4674564.851185722,42,T
1644343804.2776637,256,0,0,,42.204764,71.059651,43.5,670031.0836822502,4674564.853180254,42,T
1644343805.277677,257,0,0,,42.204764,71.059652,43.5,670031.1662391231,4674564.855174786,42,T
1644343806.2781088,258,0,0,,42.204764,71.059653,43.4,670031.2487959918,4674564.85716932,42,T
1644343807.280242,259,0,0,,42.204764999999995,71.059654,43.4,670031.3286701902,4674564.970203797,42,T
1644343808.2795181,260,0,0,,42.204764999999995,71.059654,43.4,670031.3286701902,4674564.970203797,42,T
1644343809.279146,261,0,0,,42.204764999999995,71.059656,43.4,670031.4937839289,4674564.974192869,42,T
1644343810.2778287,262,0,0,,42.204764999999995,71.059656,43.4,670031.4937839289,4674564.974192869,42,T
1644343811.279855,263,0,0,,42.204764999999995,71.059656,43.4,670031.4937839289,4674564.974192869,42,T
1644343812.2790852,264,0,0,,42.204766,71.059658,43.4,670031.6562149882,4674565.089221888,42,T
1644343813.2779956,265,0,0,,42.204767000000004,71.059659,43.4,670031.7360891773,4674565.20225637,42,T
1644343814.2799356,266,0,0,,42.204767000000004,71.059659,43.3,670031.7360891773,4674565.20225637,42,T
1644343815.2793252,267,0,0,,42.204768,71.059659,43.4,670031.7334064984,4674565.313296313,42,T
1644343816.2790926,268,0,0,,42.204769,71.05966000000001,43.4,670031.8132806837,4674565.426330798,42,T
1644343817.2768297,269,0,0,,42.204769,71.05966099999999,43.4,670031.8958375457,4674565.428325339,42,T
1644343818.2932017,270,0,0,,42.204769999999996,71.05966099999999,43.5,670031.8931548641,4674565.539365281,42,T
1644343819.2935102,271,0,0,,42.204771,71.05966099999999,43.5,670031.8904721823,4674565.650405226,42,T
1644343820.28,272,0,0,,42.204772000000006,71.059662,43.5,670031.970346363,4674565.763439711,42,T
1644343821.2942526,273,0,0,,42.204772000000006,71.059662,43.4,670031.970346363,4674565.763439711,42,T
1644343822.2926462,274,0,0,,42.204772999999996,71.059663,43.4,670032.0502205368,4674565.876474197,42,T
1644343823.2950659,275,0,0,,42.204772999999996,71.059664,43.4,670032.132777398,4674565.878468741,42,T
1644343824.2950675,276,0,0,,42.204772999999996,71.059664,43.4,670032.132777398,4674565.878468741,42,T
1644343825.2787566,277,0,0,,42.204774,71.059664,43.4,670032.1300947121,4674565.989508685,42,T
1644343826.2954414,278,0,0,,42.204776,71.05966599999999,43.3,670032.2898430487,4674566.215577663,42,T
1644343827.2942502,279,0,0,,42.204776,71.059667,43.3,670032.3723999037,4674566.21757221,42,T
1644343828.2960799,280,0,0,,42.204776,71.059667,43.3,670032.3723999037,4674566.21757221,42,T
1644343829.2946498,281,0,0,,42.20477700000001,71.059669,43.2,670032.5348309216,4674566.332601251,42,T
1644343830.2968006,282,0,0,,42.204778,71.05967,43.2,670032.6147050795,4674566.4456357425,42,T
1644343831.2948046,283,0,0,,42.204779,71.059673,43.2,670032.8596929393,4674566.562659344,42,T
1644343832.2950408,284,0,0,,42.204781000000004,71.059675,43.2,670033.0194412388,4674566.788728339,42,T
1644343833.29277,285,0,0,,42.204781000000004,71.059674,43.2,670032.9368843923,4674566.786733784,42,T
1644343834.2924697,286,0,0,,42.204781999999994,71.059675,43.2,670033.0167585383,4674566.899768281,42,T
1644343835.2766097,287,0,0,,42.204783,71.059675,43.3,670033.0140758377,4674567.010808226,42,T
1644343836.2947812,288,0,0,,42.204783,71.059674,43.3,670032.9315189938,4674567.008813671,42,T
1644343837.2943919,289,0,0,,42.204783,71.059675,43.3,670033.0140758377,4674567.010808226,42,T
1644343838.2795172,290,0,0,,42.204783,71.059676,43.3,670033.0966326859,4674567.012802782,42,T
1644343839.2935245,291,0,0,,42.204783,71.059676,43.3,670033.0966326859,4674567.012802782,42,T
1644343840.2780583,292,0,0,,42.204784,71.059678,43.4,670033.2590636734,4674567.12783184,42,T
1644343841.2748716,293,0,0,,42.204784,71.05968,43.5,670033.424177361,4674567.131820958,42,T
1644343842.2762282,294,0,0,,42.204785,71.05968200000001,43.6,670033.5866083406,4674567.246850025,42,T
1644343843.2780204,295,0,0,,42.204786000000006,71.059684,43.8,670033.749039313,4674567.3618790945,42,T
1644343844.2798953,296,0,0,,42.204786000000006,71.059684,43.7,670033.749039313,4674567.3618790945,42,T
1644343845.2813988,297,0,0,,42.204786000000006,71.059684,43.7,670033.749039313,4674567.3618790945,42,T
1644343846.278,298,0,0,,42.204786000000006,71.059684,43.8,670033.749039313,4674567.3618790945,42,T
1644343847.2764802,299,0,0,,42.204786999999996,71.059684,43.9,670033.7463566004,4674567.472919038,42,T
1644343848.2782793,300,0,0,,42.204786999999996,71.059685,44.0,670033.8289134435,4674567.474913602,42,T
1644343849.2792172,301,0,0,,42.204788,71.059685,44.0,670033.8262307296,4674567.585953545,42,T
1644343850.276315,302,0,0,,42.204788,71.059685,44.0,670033.8262307296,4674567.585953545,42,T
1644343851.2779546,303,0,0,,42.204788,71.059685,44.1,670033.8262307296,4674567.585953545,42,T
1644343852.276269,304,0,0,,42.204788,71.059685,44.1,670033.8262307296,4674567.585953545,42,T
1644343853.2759936,305,0,0,,42.204788,71.059685,44.1,670033.8262307296,4674567.585953545,42,T
1644343854.276713,306,0,0,,42.204788,71.059685,44.1,670033.8262307296,4674567.585953545,42,T
1644343855.2734191,307,0,0,,42.204788,71.059691,44.3,670034.321571763,4674567.597920952,42,T
1644343856.2760277,308,0,0,,42.204786999999996,71.059696,44.4,670034.7370386873,4674567.496853875,42,T
1644343857.2753527,309,0,0,,42.204788,71.05970099999999,44.5,670035.1471401553,4674567.617866709,42,T
1644343858.2793257,310,0,0,,42.204788,71.05970099999999,44.6,670035.1471401553,4674567.617866709,42,T
1644343859.2770984,311,0,0,,42.204789,71.05970599999999,44.5,670035.5572416103,4674567.738879568,42,T
1644343860.2778392,312,0,0,,42.204789,71.05970599999999,44.5,670035.5572416103,4674567.738879568,42,T
1644343861.286326,313,0,0,,42.20479,71.05971,44.6,670035.8847862172,4674567.857897862,42,T
1644343862.2770832,314,0,0,,42.20479,71.059718,43.0,670036.5452409122,4674567.8738546055,42,T
1644343863.2785983,315,0,0,,42.20479,71.059718,43.0,670036.5452409122,4674567.8738546055,42,T
1644343864.2781737,316,0,0,,42.20479,71.059724,41.8,670037.0405819332,4674567.885822205,42,T
1644343865.2808769,317,0,0,,42.20479,71.059724,41.8,670037.0405819332,4674567.885822205,42,T
1644343866.2817318,318,0,0,,42.204789,71.059724,41.8,670037.043264698,4674567.774782262,42,T
1644343867.2789845,319,0,0,,42.204789,71.059724,41.8,670037.043264698,4674567.774782262,42,T
1644343868.2790425,320,0,0,,42.204789,71.059724,41.8,670037.043264698,4674567.774782262,42,T
1644343869.295209,321,0,0,,42.204789,71.059724,41.8,670037.043264698,4674567.774782262,42,T
1644343870.2942307,322,0,0,,42.204789,71.059724,41.7,670037.043264698,4674567.774782262,42,T
1644343871.2803576,323,0,0,,42.204789,71.059724,41.7,670037.043264698,4674567.774782262,42,T
1644343872.295442,324,0,0,,42.204789,71.059724,41.7,670037.043264698,4674567.774782262,42,T
1644343873.2936423,325,0,0,,42.204789,71.059724,41.7,670037.043264698,4674567.774782262,42,T
1644343874.2962074,326,0,0,,42.204789,71.059724,41.7,670037.043264698,4674567.774782262,42,T
1644343875.2785668,327,0,0,,42.204789,71.059724,41.7,670037.043264698,4674567.774782262,42,T
1644343876.2975838,328,0,0,,42.204789,71.059724,41.7,670037.043264698,4674567.774782262,42,T
1644343877.2781212,329,0,0,,42.204789,71.059724,41.7,670037.043264698,4674567.774782262,42,T
1644343878.2788918,330,0,0,,42.204789,71.059724,41.6,670037.043264698,4674567.774782262,42,T
1644343879.280793,331,0,0,,42.204789,71.059725,41.6,670037.1258215365,4674567.776776865,42,T
1644343880.2801466,332,0,0,,42.204789,71.059725,41.6,670037.1258215365,4674567.776776865,42,T
1644343881.2950568,333,0,0,,42.204789,71.059725,41.6,670037.1258215365,4674567.776776865,42,T
1644343882.2942033,334,0,0,,42.204789,71.059725,41.6,670037.1258215365,4674567.776776865,42,T
1644343883.2798674,335,0,0,,42.204789,71.059725,41.6,670037.1258215365,4674567.776776865,42,T
1644343884.2952375,336,0,0,,42.204789,71.059725,41.6,670037.1258215365,4674567.776776865,42,T
1644343885.2945907,337,0,0,,42.204789,71.059725,41.6,670037.1258215365,4674567.776776865,42,T
1644343886.2779698,338,0,0,,42.204789,71.059725,41.5,670037.1258215365,4674567.776776865,42,T
1644343887.2964535,339,0,0,,42.204789,71.059725,41.5,670037.1258215365,4674567.776776865,42,T
1644343888.2959003,340,0,0,,42.204789,71.059725,41.5,670037.1258215365,4674567.776776865,42,T
1644343889.2782693,341,0,0,,42.204789,71.059725,41.5,670037.1258215365,4674567.776776865,42,T
1644343890.294738,342,0,0,,42.204789,71.059725,41.5,670037.1258215365,4674567.776776865,42,T
1644343891.2867126,343,0,0,,42.204788,71.05973,40.1,670037.5412885016,4674567.675709951,42,T
1644343892.295473,344,0,0,,42.204788,71.05973,40.1,670037.5412885016,4674567.675709951,42,T
1644343893.2957432,345,0,0,,42.204788,71.05973,40.0,670037.5412885016,4674567.675709951,42,T
1644343894.277838,346,0,0,,42.204788,71.05973,40.0,670037.5412885016,4674567.675709951,42,T
1644343895.2786589,347,0,0,,42.204788,71.05973,40.0,670037.5412885016,4674567.675709951,42,T
1644343896.2959323,348,0,0,,42.204788,71.05973,40.0,670037.5412885016,4674567.675709951,42,T
1644343897.295402,349,0,0,,42.204788,71.05973,40.0,670037.5412885016,4674567.675709951,42,T
1644343898.2760098,350,0,0,,42.204788,71.05973,40.0,670037.5412885016,4674567.675709951,42,T
1644343899.2940497,351,0,0,,42.204788,71.05973,40.0,670037.5412885016,4674567.675709951,42,T
1644343900.2790182,352,0,0,,42.204788,71.05973,40.0,670037.5412885016,4674567.675709951,42,T
1644343901.2768018,353,0,0,,42.204788,71.05973,40.0,670037.5412885016,4674567.675709951,42,T
1644343902.279169,354,0,0,,42.204788,71.05973,40.0,670037.5412885016,4674567.675709951,42,T
1644343903.276325,355,0,0,,42.204788,71.05973,40.0,670037.5412885016,4674567.675709951,42,T
1644343904.2775042,356,0,0,,42.204788,71.05973,40.0,670037.5412885016,4674567.675709951,42,T
1644343905.276469,357,0,0,,42.204788,71.05973,40.0,670037.5412885016,4674567.675709951,42,T
1644343906.276349,358,0,0,,42.204788,71.05973,40.0,670037.5412885016,4674567.675709951,42,T
1644343907.276841,359,0,0,,42.204788,71.05973,40.0,670037.5412885016,4674567.675709951,42,T
1644343908.2779691,360,0,0,,42.204786999999996,71.05973,40.1,670037.5439712743,4674567.564670006,42,T
1644343909.2774813,361,0,0,,42.204786999999996,71.05973,40.1,670037.5439712743,4674567.564670006,42,T
1644343910.2771223,362,0,0,,42.204786999999996,71.05973,40.1,670037.5439712743,4674567.564670006,42,T
1644343911.2770379,363,0,0,,42.204786999999996,71.05973,40.1,670037.5439712743,4674567.564670006,42,T
1644343912.277397,364,0,0,,42.204786999999996,71.05973,40.1,670037.5439712743,4674567.564670006,42,T
1644343913.2768903,365,0,0,,42.204786999999996,71.05973,40.1,670037.5439712743,4674567.564670006,42,T
1644343914.274953,366,0,0,,42.204786999999996,71.05973,40.2,670037.5439712743,4674567.564670006,42,T
1644343915.2773142,367,0,0,,42.204786999999996,71.05973,40.2,670037.5439712743,4674567.564670006,42,T
1644343916.2746773,368,0,0,,42.204786999999996,71.059729,40.2,670037.461414431,4674567.562675398,42,T
1644343917.2746875,369,0,0,,42.204786000000006,71.059729,40.3,670037.4640972022,4674567.451635456,42,T
1644343918.277418,370,0,0,,42.204786000000006,71.059729,40.3,670037.4640972022,4674567.451635456,42,T
1644343919.277742,371,0,0,,42.204786000000006,71.059729,40.3,670037.4640972022,4674567.451635456,42,T
1644343920.2929282,372,0,0,,42.204786000000006,71.05972799999999,40.4,670037.3815403598,4674567.449640849,42,T
1644343921.2910078,373,0,0,,42.204786000000006,71.059729,40.4,670037.4640972022,4674567.451635456,42,T
1644343922.2910392,374,0,0,,42.204786000000006,71.059729,40.4,670037.4640972022,4674567.451635456,42,T
1644343923.2764678,375,0,0,,42.204786000000006,71.059729,40.4,670037.4640972022,4674567.451635456,42,T
1644343924.2925253,376,0,0,,42.204786000000006,71.059729,40.4,670037.4640972022,4674567.451635456,42,T
1644343925.2904198,377,0,0,,42.204786000000006,71.059729,40.5,670037.4640972022,4674567.451635456,42,T
1644343926.2765324,378,0,0,,42.204786000000006,71.059729,40.5,670037.4640972022,4674567.451635456,42,T
1644343927.2915547,379,0,0,,42.204786000000006,71.059729,40.5,670037.4640972022,4674567.451635456,42,T
1644343928.2771165,380,0,0,,42.204785,71.059729,40.5,670037.4667799734,4674567.340595511,42,T
1644343929.2772117,381,0,0,,42.204786000000006,71.059729,40.5,670037.4640972022,4674567.451635456,42,T
1644343930.2741604,382,0,0,,42.204786000000006,71.059729,40.5,670037.4640972022,4674567.451635456,42,T
1644343931.2755075,383,0,0,,42.204786000000006,71.059729,40.5,670037.4640972022,4674567.451635456,42,T
1644343932.2952461,384,0,0,,42.204786000000006,71.059729,40.5,670037.4640972022,4674567.451635456,42,T
1644343933.2920785,385,0,0,,42.204785,71.059729,40.6,670037.4667799734,4674567.340595511,42,T
1644343934.2923713,386,0,0,,42.204786000000006,71.05972799999999,40.6,670037.3815403598,4674567.449640849,42,T
1644343935.291724,387,0,0,,42.204785,71.05972799999999,40.7,670037.3842231296,4674567.338600904,42,T
1644343936.276069,388,0,0,,42.204785,71.05972700000001,40.8,670037.301666288,4674567.336606298,42,T
1644343937.290874,389,0,0,,42.204785,71.059725,41.0,670037.1365526007,4674567.332617088,42,T
1644343938.2751243,390,0,0,,42.204785,71.059726,40.9,670037.2191094444,4674567.3346116925,42,T
1644343939.2895694,391,0,0,,42.204785,71.059726,40.9,670037.2191094444,4674567.3346116925,42,T
1644343940.2770221,392,0,0,,42.204785,71.059725,41.1,670037.1365526007,4674567.332617088,42,T
1644343941.2916932,393,0,0,,42.204785,71.059725,41.0,670037.1365526007,4674567.332617088,42,T
1644343942.2931976,394,0,0,,42.204785,71.05972799999999,41.0,670037.3842231296,4674567.338600904,42,T
1644343943.27835,395,0,0,,42.204785,71.059732,40.9,670037.7144505046,4674567.346579338,42,T
1644343944.2953408,396,0,0,,42.204785,71.059729,40.9,670037.4667799734,4674567.340595511,42,T
1644343945.2801273,397,0,0,,42.204785,71.059729,40.9,670037.4667799734,4674567.340595511,42,T
1644343946.279336,398,0,0,,42.204785,71.059729,40.9,670037.4667799734,4674567.340595511,42,T
1644343947.295762,399,0,0,,42.204785,71.059729,40.9,670037.4667799734,4674567.340595511,42,T
1644343948.2962885,400,0,0,,42.204785,71.059729,40.9,670037.4667799734,4674567.340595511,42,T
1644343949.276339,401,0,0,,42.204785,71.059729,40.9,670037.4667799734,4674567.340595511,42,T
1644343950.2806127,402,0,0,,42.204785,71.059729,40.9,670037.4667799734,4674567.340595511,42,T
1644343951.2738476,403,0,0,,42.204785,71.059729,40.9,670037.4667799734,4674567.340595511,42,T
1644343952.2623248,404,0,0,,42.204785,71.059729,40.9,670037.4667799734,4674567.340595511,42,T
1644343953.2622602,405,0,0,,42.204785,71.059729,40.9,670037.4667799734,4674567.340595511,42,T
1644343954.2654545,406,0,0,,42.204785,71.059729,40.9,670037.4667799734,4674567.340595511,42,T
1644343955.2635949,407,0,0,,42.204785,71.059729,40.9,670037.4667799734,4674567.340595511,42,T
1644343956.2741454,408,0,0,,42.204781999999994,71.05972700000001,40.9,670037.3097145935,4674567.003486464,42,T
1644343957.276595,409,0,0,,42.204784,71.05972700000001,40.9,670037.3043490566,4674567.225566353,42,T
1644343958.276239,410,0,0,,42.204781999999994,71.059724,41.1,670037.0620440505,4674566.997502651,42,T
1644343959.2773254,411,0,0,,42.204781999999994,71.05972200000001,41.5,670036.8969303574,4674566.993513447,42,T
1644343960.2769876,412,0,0,,42.204781999999994,71.05972,41.7,670036.7318166601,4674566.989524247,42,T
1644343961.2767332,413,0,0,,42.204781999999994,71.059719,42.0,670036.6492598146,4674566.987529649,42,T
1644343962.2768404,414,0,0,,42.204781000000004,71.05972,41.8,670036.7344994193,4674566.878484306,42,T
1644343963.2775717,415,0,0,,42.204781000000004,71.05972,41.8,670036.7344994193,4674566.878484306,42,T
1644343964.280451,416,0,0,,42.204781000000004,71.059719,41.8,670036.6519425726,4674566.876489707,42,T
1644343965.2766335,417,0,0,,42.204781000000004,71.059718,41.9,670036.5693857237,4674566.87449511,42,T
1644343966.2765918,418,0,0,,42.204781000000004,71.059718,42.1,670036.5693857237,4674566.87449511,42,T
1644343967.2786152,419,0,0,,42.20478,71.059718,42.1,670036.5720684803,4674566.763455164,42,T
1644343968.2777367,420,0,0,,42.20478,71.059718,42.2,670036.5720684803,4674566.763455164,42,T
1644343969.277403,421,0,0,,42.20478,71.059717,42.3,670036.48951163,4674566.761460568,42,T
1644343970.2793283,422,0,0,,42.20478,71.059717,42.3,670036.48951163,4674566.761460568,42,T
1644343971.2937403,423,0,0,,42.20478,71.059717,42.4,670036.48951163,4674566.761460568,42,T
1644343972.296651,424,0,0,,42.20478,71.059717,42.4,670036.48951163,4674566.761460568,42,T
1644343973.29249,425,0,0,,42.204779,71.059716,42.5,670036.4096375338,4674566.648426031,42,T
1644343974.2924385,426,0,0,,42.204779,71.059716,42.6,670036.4096375338,4674566.648426031,42,T
1644343975.2798998,427,0,0,,42.204779,71.059715,42.6,670036.3270806823,4674566.646431437,42,T
1644343976.293945,428,0,0,,42.204779,71.059715,42.7,670036.3270806823,4674566.646431437,42,T
1644343977.2780232,429,0,0,,42.204779,71.059715,42.7,670036.3270806823,4674566.646431437,42,T
1644343978.2924936,430,0,0,,42.204779,71.059715,42.7,670036.3270806823,4674566.646431437,42,T
1644343979.2804844,431,0,0,,42.204779,71.059715,42.7,670036.3270806823,4674566.646431437,42,T
1644343980.2774458,432,0,0,,42.204779,71.059715,42.7,670036.3270806823,4674566.646431437,42,T
1644343981.2925274,433,0,0,,42.204779,71.059715,42.7,670036.3270806823,4674566.646431437,42,T
1644343982.2789693,434,0,0,,42.204779,71.059715,42.7,670036.3270806823,4674566.646431437,42,T
1644343983.2963314,435,0,0,,42.204779,71.059715,42.7,670036.3270806823,4674566.646431437,42,T
1644343984.2933438,436,0,0,,42.204779,71.059715,42.7,670036.3270806823,4674566.646431437,42,T
1644343985.2922618,437,0,0,,42.204778,71.059715,42.7,670036.3297634348,4674566.53539149,42,T
1644343986.2930827,438,0,0,,42.204778,71.059716,42.7,670036.4123202877,4674566.537386085,42,T
1644343987.293609,439,0,0,,42.204778,71.059716,42.7,670036.4123202877,4674566.537386085,42,T
1644343988.2779517,440,0,0,,42.20477700000001,71.059716,42.8,670036.4150030414,4674566.426346143,42,T
1644343989.2763195,441,0,0,,42.20477700000001,71.059716,42.8,670036.4150030414,4674566.426346143,42,T
1644343990.2922041,442,0,0,,42.20477700000001,71.059716,42.8,670036.4150030414,4674566.426346143,42,T
1644343991.2754898,443,0,0,,42.20477700000001,71.059717,42.8,670036.4975598955,4674566.428340738,42,T
1644343992.2948282,444,0,0,,42.204776,71.059717,42.8,670036.5002426505,4674566.317300795,42,T
1644343993.2906034,445,0,0,,42.204776,71.059717,42.9,670036.5002426505,4674566.317300795,42,T
1644343994.2738433,446,0,0,,42.204776,71.059717,42.9,670036.5002426505,4674566.317300795,42,T
1644343995.2925196,447,0,0,,42.204776,71.059717,42.9,670036.5002426505,4674566.317300795,42,T
1644343996.2754772,448,0,0,,42.204775,71.059717,43.0,670036.5029254056,4674566.206260849,42,T
1644343997.2792358,449,0,0,,42.204775,71.059717,43.0,670036.5029254056,4674566.206260849,42,T
1644343998.2916787,450,0,0,,42.204775,71.059717,43.0,670036.5029254056,4674566.206260849,42,T
1644343999.2939687,451,0,0,,42.204775,71.059717,43.1,670036.5029254056,4674566.206260849,42,T
1644344000.2762463,452,0,0,,42.204775,71.059718,43.1,670036.5854822623,4674566.208255445,42,T
1644344001.2909951,453,0,0,,42.204774,71.059718,43.2,670036.5881650185,4674566.097215502,42,T
1644344002.2738378,454,0,0,,42.204774,71.059718,43.2,670036.5881650185,4674566.097215502,42,T
1644344003.2731354,455,0,0,,42.204774,71.059718,43.3,670036.5881650185,4674566.097215502,42,T
1644344004.2734535,456,0,0,,42.204774,71.059718,43.3,670036.5881650185,4674566.097215502,42,T
1644344005.277971,457,0,0,,42.204772999999996,71.059718,43.4,670036.5908477746,4674565.9861755585,42,T
1644344006.2742603,458,0,0,,42.204772999999996,71.059718,43.4,670036.5908477746,4674565.9861755585,42,T
1644344007.274386,459,0,0,,42.204772999999996,71.059718,43.4,670036.5908477746,4674565.9861755585,42,T
1644344008.2749245,460,0,0,,42.204772000000006,71.059718,43.5,670036.5935305308,4674565.8751356155,42,T
1644344009.2766623,461,0,0,,42.204772000000006,71.059718,43.5,670036.5935305308,4674565.8751356155,42,T
1644344010.3252323,462,0,0,,42.204771,71.059718,43.6,670036.596213287,4674565.7640956715,42,T
1644344011.285316,463,0,0,,42.204771,71.059719,43.6,670036.6787701489,4674565.766090269,42,T
1644344012.2852454,464,0,0,,42.204771,71.05972,43.7,670036.7613270087,4674565.768084867,42,T
1644344013.2756202,465,0,0,,42.204771,71.05972,43.7,670036.7613270087,4674565.768084867,42,T
1644344014.2740166,466,0,0,,42.204771,71.05972,43.7,670036.7613270087,4674565.768084867,42,T
1644344015.275061,467,0,0,,42.204771,71.05972,43.7,670036.7613270087,4674565.768084867,42,T
1644344016.2729406,468,0,0,,42.204769999999996,71.059721,43.8,670036.8465666327,4674565.659039522,42,T
1644344017.2719908,469,0,0,,42.204769999999996,71.059721,43.9,670036.8465666327,4674565.659039522,42,T
1644344018.273155,470,0,0,,42.204769999999996,71.059721,43.9,670036.8465666327,4674565.659039522,42,T
1644344019.2729485,471,0,0,,42.204769999999996,71.059721,43.9,670036.8465666327,4674565.659039522,42,T
1644344020.2740054,472,0,0,,42.204769999999996,71.05972,43.9,670036.7640097673,4674565.657044922,42,T
1644344021.274348,473,0,0,,42.204769,71.059719,43.9,670036.6841356636,4674565.54401038,42,T
1644344022.2905777,474,0,0,,42.204769,71.059719,43.9,670036.6841356636,4674565.54401038,42,T
1644344023.2981029,475,0,0,,42.204769,71.059718,44.0,670036.601578799,4674565.542015783,42,T
1644344024.2945795,476,0,0,,42.204769,71.059717,44.0,670036.5190219345,4674565.540021187,42,T
1644344025.29304,477,0,0,,42.204769,71.059716,44.0,670036.4364650699,4674565.538026591,42,T
1644344026.282089,478,0,0,,42.204769,71.059715,44.0,670036.3539082054,4674565.536031997,42,T
1644344027.293799,479,0,0,,42.204769,71.059715,44.0,670036.3539082054,4674565.536031997,42,T
1644344028.2951999,480,0,0,,42.204769,71.059713,44.0,670036.1887944785,4674565.532042811,42,T
1644344029.2770836,481,0,0,,42.204769,71.059713,44.0,670036.1887944785,4674565.532042811,42,T
1644344030.2779558,482,0,0,,42.204769,71.059712,43.9,670036.106237614,4674565.5300482195,42,T
1644344031.2767591,483,0,0,,42.204769,71.059712,44.0,670036.106237614,4674565.5300482195,42,T
1644344032.276735,484,0,0,,42.204769,71.059711,44.0,670036.0236807496,4674565.528053628,42,T
1644344033.2916374,485,0,0,,42.204769,71.05971,44.0,670035.941123885,4674565.526059039,42,T
1644344034.2929213,486,0,0,,42.204769,71.059709,44.1,670035.8585670226,4674565.5240644505,42,T
1644344035.2773175,487,0,0,,42.204769,71.059709,44.1,670035.8585670226,4674565.5240644505,42,T
1644344036.2937574,488,0,0,,42.204769,71.059709,44.2,670035.8585670226,4674565.5240644505,42,T
1644344037.2936811,489,0,0,,42.204769,71.059707,44.2,670035.6934532936,4674565.5200752765,42,T
1644344038.2921042,490,0,0,,42.204769,71.059708,44.2,670035.776010156,4674565.522069863,42,T
1644344039.2756352,491,0,0,,42.204769,71.059707,44.3,670035.6934532936,4674565.5200752765,42,T
1644344040.2765038,492,0,0,,42.204769,71.05970599999999,44.4,670035.6108964271,4674565.518080691,42,T
1644344041.312371,493,0,0,,42.204769999999996,71.059713,43.4,670036.186111729,4674565.643082755,42,T
1644344042.2798707,494,0,0,,42.204769999999996,71.05972200000001,42.1,670036.9291234959,4674565.661034122,42,T
1644344043.294363,495,0,0,,42.204769999999996,71.059731,40.9,670037.6721352612,4674565.678985568,42,T
1644344044.2943826,496,0,0,,42.204772000000006,71.059747,38.9,670038.9876794827,4674565.932979332,42,T
1644344045.2958207,497,0,0,,42.204772999999996,71.059756,37.8,670039.7280084199,4674566.061970939,42,T
1644344046.2797046,498,0,0,,42.204772999999996,71.059755,37.9,670039.6454515604,4674566.059976306,42,T
1644344047.2796082,499,0,0,,42.204772999999996,71.059755,37.9,670039.6454515604,4674566.059976306,42,T
1644344048.2960064,500,0,0,,42.204774,71.059762,37.0,670040.2206667614,4674566.184978701,42,T
1644344049.2789004,501,0,0,,42.204774,71.059768,36.3,670040.7160079109,4674566.196946557,42,T
1644344050.297125,502,0,0,,42.204775,71.05977299999999,35.8,670041.1261093722,4674566.31795974,42,T
1644344051.2806182,503,0,0,,42.204776,71.059778,35.2,670041.5362108205,4674566.438972948,42,T
1644344052.2969327,504,0,0,,42.204776,71.059777,35.2,670041.4536539649,4674566.436978294,42,T
1644344053.278085,505,0,0,,42.204776,71.059777,35.2,670041.4536539649,4674566.436978294,42,T
1644344054.2800486,506,0,0,,42.204776,71.059777,35.2,670041.4536539649,4674566.436978294,42,T
1644344055.2779124,507,0,0,,42.204776,71.059778,35.2,670041.5362108205,4674566.438972948,42,T
1644344056.2776058,508,0,0,,42.204776,71.059781,34.7,670041.7838813857,4674566.444956917,42,T
1644344057.2781796,509,0,0,,42.20477700000001,71.059781,34.7,670041.7811985472,4674566.555996862,42,T
1644344058.2778852,510,0,0,,42.20477700000001,71.059786,34.1,670042.1939828172,4674566.565970164,42,T
1644344059.2822833,511,0,0,,42.20477700000001,71.059792,33.2,670042.689323944,4674566.577938158,42,T
1644344060.2785344,512,0,0,,42.20477700000001,71.05979599999999,32.6,670043.0195513577,4674566.5859168405,42,T
1644344061.277783,513,0,0,,42.20477700000001,71.059797,32.3,670043.1021082144,4674566.587911514,42,T
1644344062.2767892,514,0,0,,42.20477700000001,71.059801,31.8,670043.4323356303,4674566.595890216,42,T
1644344063.2784433,515,0,0,,42.20477700000001,71.059801,31.7,670043.4323356303,4674566.595890216,42,T
1644344064.2812645,516,0,0,,42.20477700000001,71.059801,31.7,670043.4323356303,4674566.595890216,42,T
1644344065.2815518,517,0,0,,42.204778,71.059806,31.1,670043.8424370298,4674566.716903556,42,T
1644344066.2807984,518,0,0,,42.204778,71.059806,31.1,670043.8424370298,4674566.716903556,42,T
1644344067.2807682,519,0,0,,42.204778,71.059808,30.9,670044.0075507385,4674566.720892923,42,T
1644344068.2792742,520,0,0,,42.204778,71.05981,30.5,670044.1726644407,4674566.724882293,42,T
1644344069.2785172,521,0,0,,42.204778,71.059811,30.5,670044.2552212961,4674566.72687698,42,T
1644344070.2820346,522,0,0,,42.204778,71.059811,30.5,670044.2552212961,4674566.72687698,42,T
1644344071.2793505,523,0,0,,42.204778,71.05981200000001,30.5,670044.3377781494,4674566.728871667,42,T
1644344072.279529,524,0,0,,42.204779,71.05981200000001,30.5,670044.3350952704,4674566.839911614,42,T
1644344073.2992716,525,0,0,,42.204779,71.05981200000001,30.5,670044.3350952704,4674566.839911614,42,T
1644344074.2950647,526,0,0,,42.204779,71.059813,30.6,670044.4176521224,4674566.841906303,42,T
1644344075.2981665,527,0,0,,42.20478,71.059813,30.6,670044.4149692421,4674566.952946245,42,T
1644344076.2951968,528,0,0,,42.20478,71.059813,30.7,670044.4149692421,4674566.952946245,42,T
1644344077.2974136,529,0,0,,42.20478,71.059813,30.7,670044.4149692421,4674566.952946245,42,T
1644344078.2786129,530,0,0,,42.20478,71.059811,30.9,670044.2498555407,4674566.948956869,42,T
1644344079.2781901,531,0,0,,42.20478,71.059811,30.9,670044.2498555407,4674566.948956869,42,T
1644344080.2850888,532,0,0,,42.20478,71.05981,31.0,670044.167298688,4674566.9469621815,42,T
1644344081.2795434,533,0,0,,42.20478,71.05981,31.2,670044.167298688,4674566.9469621815,42,T
1644344082.2804694,534,0,0,,42.20478,71.059809,31.2,670044.0847418393,4674566.944967496,42,T
1644344083.2821004,535,0,0,,42.20478,71.059809,31.2,670044.0847418393,4674566.944967496,42,T
1644344084.2974737,536,0,0,,42.20478,71.059808,31.3,670044.0021849908,4674566.942972812,42,T
1644344085.2982187,537,0,0,,42.204779,71.05981,31.1,670044.1699815644,4674566.835922239,42,T
1644344086.2981625,538,0,0,,42.204779,71.05981,31.1,670044.1699815644,4674566.835922239,42,T
1644344087.2990425,539,0,0,,42.204779,71.05981,31.1,670044.1699815644,4674566.835922239,42,T
1644344088.2975016,540,0,0,,42.20478,71.059813,30.8,670044.4149692421,4674566.952946245,42,T
1644344089.27943,541,0,0,,42.20478,71.059816,30.6,670044.6626397921,4674566.958930316,42,T
1644344090.280364,542,0,0,,42.20478,71.059815,30.6,670044.5800829413,4674566.956935625,42,T
1644344091.2780442,543,0,0,,42.20478,71.05981700000001,30.4,670044.7451966427,4674566.960925009,42,T
1644344092.2808383,544,0,0,,42.20478,71.05982,30.1,670044.9928671948,4674566.966909091,42,T
1644344093.2839684,545,0,0,,42.20478,71.059819,30.1,670044.910310342,4674566.9649143955,42,T
1644344094.2975466,546,0,0,,42.20478,71.059819,30.1,670044.910310342,4674566.9649143955,42,T
1644344095.299499,547,0,0,,42.20478,71.05982,30.0,670044.9928671948,4674566.966909091,42,T
1644344096.3006284,548,0,0,,42.20478,71.05982,29.9,670044.9928671948,4674566.966909091,42,T
1644344097.3011472,549,0,0,,42.20478,71.05982,29.9,670044.9928671948,4674566.966909091,42,T
1644344098.2772157,550,0,0,,42.20478,71.05982,30.0,670044.9928671948,4674566.966909091,42,T
1644344099.3033326,551,0,0,,42.20478,71.05982,30.0,670044.9928671948,4674566.966909091,42,T
1644344100.2804868,552,0,0,,42.20478,71.059819,30.1,670044.910310342,4674566.9649143955,42,T
1644344101.3009706,553,0,0,,42.20478,71.059819,30.1,670044.910310342,4674566.9649143955,42,T
1644344102.2760274,554,0,0,,42.20478,71.059819,30.1,670044.910310342,4674566.9649143955,42,T
1644344103.296013,555,0,0,,42.20478,71.059819,30.2,670044.910310342,4674566.9649143955,42,T
1644344104.2795773,556,0,0,,42.20478,71.059819,30.2,670044.910310342,4674566.9649143955,42,T
1644344105.2752979,557,0,0,,42.20478,71.05981799999999,30.2,670044.8277534934,4674566.962919702,42,T
1644344106.2780883,558,0,0,,42.20478,71.05981799999999,30.2,670044.8277534934,4674566.962919702,42,T
1644344107.276708,559,0,0,,42.204781000000004,71.05981700000001,30.4,670044.742513757,4674567.071964954,42,T
1644344108.2799563,560,0,0,,42.204781000000004,71.059816,30.5,670044.6599569076,4674567.069970261,42,T
1644344109.2789407,561,0,0,,42.204781000000004,71.05981700000001,30.5,670044.742513757,4674567.071964954,42,T
1644344110.2766855,562,0,0,,42.204781000000004,71.05981700000001,30.5,670044.742513757,4674567.071964954,42,T
1644344111.2768862,563,0,0,,42.204781000000004,71.059816,30.6,670044.6599569076,4674567.069970261,42,T
1644344112.282387,564,0,0,,42.204781000000004,71.059816,30.6,670044.6599569076,4674567.069970261,42,T
1644344113.2806919,565,0,0,,42.204781999999994,71.059815,30.8,670044.5747171752,4674567.1790155135,42,T
1644344114.2774591,566,0,0,,42.204781999999994,71.059814,30.9,670044.4921603272,4674567.177020824,42,T
1644344115.281704,567,0,0,,42.204781999999994,71.059814,31.1,670044.4921603272,4674567.177020824,42,T
1644344116.279554,568,0,0,,42.204781999999994,71.059813,31.1,670044.4096034812,4674567.175026134,42,T
1644344117.2778692,569,0,0,,42.204783,71.05981200000001,31.2,670044.3243637539,4674567.284071391,42,T
1644344118.2796006,570,0,0,,42.204783,71.059811,31.4,670044.2418069071,4674567.282076703,42,T
1644344119.2784572,571,0,0,,42.204784,71.059811,31.5,670044.2391240291,4674567.393116648,42,T
1644344120.280163,572,0,0,,42.204784,71.05981,31.6,670044.1565671816,4674567.391121961,42,T
1644344121.2778828,573,0,0,,42.204784,71.059808,31.9,670043.9914534949,4674567.3871325925,42,T
1644344122.2788455,574,0,0,,42.204785,71.059807,32.2,670043.9062137746,4674567.496177853,42,T
1644344123.2795515,575,0,0,,42.204785,71.059807,32.2,670043.9062137746,4674567.496177853,42,T
1644344124.300515,576,0,0,,42.204785,71.059808,32.2,670043.9887706208,4674567.4981725365,42,T
1644344125.2970111,577,0,0,,42.204785,71.05981,31.9,670044.1538843048,4674567.502161907,42,T
1644344126.2973564,578,0,0,,42.204786000000006,71.05981200000001,31.6,670044.3163151159,4674567.617191226,42,T
1644344127.2985492,579,0,0,,42.204786000000006,71.05981200000001,31.5,670044.3163151159,4674567.617191226,42,T
1644344128.2984467,580,0,0,,42.204786000000006,71.059814,31.3,670044.4814287995,4674567.621180604,42,T
1644344129.2799017,581,0,0,,42.204786000000006,71.059816,30.9,670044.6465424851,4674567.625169986,42,T
1644344130.279901,582,0,0,,42.204786000000006,71.05981700000001,30.7,670044.729099328,4674567.627164679,42,T
1644344131.2788315,583,0,0,,42.204786000000006,71.059816,30.7,670044.6465424851,4674567.625169986,42,T
1644344132.27845,584,0,0,,42.204786000000006,71.05981700000001,30.7,670044.729099328,4674567.627164679,42,T
1644344133.2777174,585,0,0,,42.204786000000006,71.05981700000001,30.7,670044.729099328,4674567.627164679,42,T
1644344134.2952564,586,0,0,,42.204786999999996,71.05981700000001,30.7,670044.7264164421,4674567.738204622,42,T
1644344135.2788467,587,0,0,,42.204788,71.059819,30.6,670044.8888472345,4674567.853233954,42,T
1644344136.2997627,588,0,0,,42.204789,71.059821,30.4,670045.0512780239,4674567.968263292,42,T
1644344137.2982183,589,0,0,,42.204789,71.059821,30.4,670045.0512780239,4674567.968263292,42,T
1644344138.296113,590,0,0,,42.20479,71.059822,30.3,670045.1311519702,4674568.081297934,42,T
1644344139.2982376,591,0,0,,42.20479,71.059822,30.3,670045.1311519702,4674568.081297934,42,T
1644344140.2786388,592,0,0,,42.20479099999999,71.059823,30.3,670045.211025914,4674568.194332575,42,T
1644344141.2784944,593,0,0,,42.204792,71.059822,30.4,670045.1257861848,4674568.303377823,42,T
1644344142.2782881,594,0,0,,42.204793,71.059822,30.4,670045.123103292,4674568.414417768,42,T
1644344143.2807217,595,0,0,,42.204793,71.059821,30.5,670045.0405464582,4674568.4124230705,42,T
1644344144.3021433,596,0,0,,42.204794,71.059821,30.5,670045.0378635668,4674568.523463015,42,T
1644344145.3012633,597,0,0,,42.204794,71.059821,30.4,670045.0378635668,4674568.523463015,42,T
1644344146.2974732,598,0,0,,42.204795000000004,71.05982,30.5,670044.9526238461,4674568.632508264,42,T
1644344147.2989955,599,0,0,,42.204795000000004,71.05981799999999,30.7,670044.7875101839,4674568.628518874,42,T
1644344148.2794032,600,0,0,,42.204794,71.05981700000001,30.8,670044.707636239,4674568.515484235,42,T
1644344149.297891,601,0,0,,42.204794,71.05981700000001,30.8,670044.707636239,4674568.515484235,42,T
1644344150.278838,602,0,0,,42.204794,71.05981799999999,30.5,670044.7901930715,4674568.517478929,42,T
1644344151.3001246,603,0,0,,42.204793,71.05981799999999,30.4,670044.7928759591,4674568.406438985,42,T
1644344152.27984,604,0,0,,42.204793,71.05981700000001,30.5,670044.7103191253,4674568.404444291,42,T
1644344153.2983046,605,0,0,,42.204794,71.059819,30.2,670044.8727499018,4674568.5194736235,42,T
1644344154.279531,606,0,0,,42.204794,71.059819,30.2,670044.8727499018,4674568.5194736235,42,T
1644344155.279351,607,0,0,,42.204794,71.059819,30.2,670044.8727499018,4674568.5194736235,42,T
1644344156.2782516,608,0,0,,42.204794,71.05982,30.0,670044.9553067364,4674568.521468319,42,T
1644344157.2805567,609,0,0,,42.204794,71.059821,30.0,670045.0378635668,4674568.523463015,42,T
1644344158.2794018,610,0,0,,42.204794,71.059821,29.9,670045.0378635668,4674568.523463015,42,T
1644344159.2807677,611,0,0,,42.204795000000004,71.059822,29.7,670045.1177375063,4674568.636497658,42,T
1644344160.2812858,612,0,0,,42.204795000000004,71.05982399999999,29.5,670045.2828511666,4674568.640487055,42,T
1644344161.2834113,613,0,0,,42.204795000000004,71.05982399999999,29.4,670045.2828511666,4674568.640487055,42,T
1644344162.2788117,614,0,0,,42.204795000000004,71.05982399999999,29.4,670045.2828511666,4674568.640487055,42,T
1644344163.2797017,615,0,0,,42.204795000000004,71.05982399999999,29.3,670045.2828511666,4674568.640487055,42,T
1644344164.2799907,616,0,0,,42.204794,71.059821,29.5,670045.0378635668,4674568.523463015,42,T
1644344165.2778685,617,0,0,,42.204794,71.059819,29.7,670044.8727499018,4674568.5194736235,42,T
1644344166.2791212,618,0,0,,42.204794,71.059819,29.7,670044.8727499018,4674568.5194736235,42,T
1644344167.2783363,619,0,0,,42.204794,71.059819,29.7,670044.8727499018,4674568.5194736235,42,T
1644344168.276914,620,0,0,,42.204794,71.059819,29.7,670044.8727499018,4674568.5194736235,42,T
1644344169.277715,621,0,0,,42.204794,71.059819,29.7,670044.8727499018,4674568.5194736235,42,T
1644344170.2774122,622,0,0,,42.204794,71.059819,29.7,670044.8727499018,4674568.5194736235,42,T
1644344171.2779427,623,0,0,,42.204794,71.059819,29.7,670044.8727499018,4674568.5194736235,42,T
1644344172.2778323,624,0,0,,42.204794,71.059819,29.7,670044.8727499018,4674568.5194736235,42,T
1644344173.2766392,625,0,0,,42.204794,71.059819,29.7,670044.8727499018,4674568.5194736235,42,T
1644344174.296595,626,0,0,,42.204794,71.059819,29.7,670044.8727499018,4674568.5194736235,42,T
1644344175.2966416,627,0,0,,42.204794,71.059819,29.7,670044.8727499018,4674568.5194736235,42,T
1644344176.2958086,628,0,0,,42.204794,71.059819,29.7,670044.8727499018,4674568.5194736235,42,T
1644344177.296519,629,0,0,,42.204794,71.059819,29.7,670044.8727499018,4674568.5194736235,42,T
1644344178.2976344,630,0,0,,42.204794,71.059819,29.7,670044.8727499018,4674568.5194736235,42,T
1644344179.2773805,631,0,0,,42.204794,71.059819,29.7,670044.8727499018,4674568.5194736235,42,T
1644344180.2782915,632,0,0,,42.204794,71.059819,29.7,670044.8727499018,4674568.5194736235,42,T
1644344181.280823,633,0,0,,42.204794,71.059819,29.8,670044.8727499018,4674568.5194736235,42,T
1644344182.2784326,634,0,0,,42.204794,71.059819,29.8,670044.8727499018,4674568.5194736235,42,T
1644344183.2793932,635,0,0,,42.204793,71.05982,30.2,670044.9579896266,4674568.410428374,42,T
1644344184.2797272,636,0,0,,42.204793,71.05982,30.2,670044.9579896266,4674568.410428374,42,T
1644344185.298669,637,0,0,,42.204793,71.05982,30.2,670044.9579896266,4674568.410428374,42,T
1644344186.280761,638,0,0,,42.204793,71.05982,30.2,670044.9579896266,4674568.410428374,42,T
1644344187.3003104,639,0,0,,42.204793,71.05982,30.2,670044.9579896266,4674568.410428374,42,T
1644344188.2991648,640,0,0,,42.204793,71.05982,30.2,670044.9579896266,4674568.410428374,42,T
1644344189.2988517,641,0,0,,42.204793,71.05982,30.2,670044.9579896266,4674568.410428374,42,T
1644344190.2963173,642,0,0,,42.204793,71.05982,30.2,670044.9579896266,4674568.410428374,42,T
1644344191.2826731,643,0,0,,42.204794,71.05982,30.4,670044.9553067364,4674568.521468319,42,T
1644344192.280161,644,0,0,,42.204794,71.05982,30.7,670044.9553067364,4674568.521468319,42,T
1644344193.2771444,645,0,0,,42.204793,71.05982,31.0,670044.9579896266,4674568.410428374,42,T
1644344194.2768953,646,0,0,,42.204793,71.059821,31.2,670045.0405464582,4674568.4124230705,42,T
1644344195.29739,647,0,0,,42.204793,71.05982,31.5,670044.9579896266,4674568.410428374,42,T
1644344196.299084,648,0,0,,42.204793,71.059819,31.9,670044.8754327907,4674568.4084336795,42,T
1644344197.2958224,649,0,0,,42.204794,71.05981799999999,32.4,670044.7901930715,4674568.517478929,42,T
1644344198.2964473,650,0,0,,42.204794,71.059816,32.7,670044.6250794067,4674568.5134895425,42,T
1644344199.2806637,651,0,0,,42.204793,71.059814,33.0,670044.4626486241,4674568.398460217,42,T
1644344200.297584,652,0,0,,42.204793,71.059814,32.9,670044.4626486241,4674568.398460217,42,T
1644344201.296341,653,0,0,,42.204793,71.059814,33.0,670044.4626486241,4674568.398460217,42,T
1644344202.2784631,654,0,0,,42.204794,71.059813,33.3,670044.3774089114,4674568.507505472,42,T
1644344203.281193,655,0,0,,42.204795000000004,71.059811,33.7,670044.209612368,4674568.61455604,42,T
1644344204.299665,656,0,0,,42.204795999999995,71.059809,34.0,670044.0418158298,4674568.721606612,42,T
1644344205.2798898,657,0,0,,42.204795999999995,71.059809,33.9,670044.0418158298,4674568.721606612,42,T
1644344206.2774956,658,0,0,,42.204795999999995,71.059809,33.9,670044.0418158298,4674568.721606612,42,T
1644344207.2821677,659,0,0,,42.204795999999995,71.059809,33.9,670044.0418158298,4674568.721606612,42,T
1644344208.2778916,660,0,0,,42.204795999999995,71.059808,34.1,670043.9592590021,4674568.719611927,42,T
1644344209.2783442,661,0,0,,42.204795999999995,71.059808,34.1,670043.9592590021,4674568.719611927,42,T
1644344210.2794304,662,0,0,,42.204795000000004,71.059806,34.2,670043.7968282126,4674568.604582617,42,T
1644344211.2774448,663,0,0,,42.204794,71.059806,34.1,670043.7995110846,4674568.493542671,42,T
1644344212.2773864,664,0,0,,42.204794,71.059806,34.1,670043.7995110846,4674568.493542671,42,T
1644344213.2774596,665,0,0,,42.204793,71.059804,34.3,670043.6370802913,4674568.378513364,42,T
1644344214.2771604,666,0,0,,42.204793,71.059804,34.3,670043.6370802913,4674568.378513364,42,T
1644344215.2781928,667,0,0,,42.204793,71.059804,34.3,670043.6370802913,4674568.378513364,42,T
1644344216.2797313,668,0,0,,42.204793,71.059804,34.4,670043.6370802913,4674568.378513364,42,T
1644344217.2761607,669,0,0,,42.204793,71.059804,34.4,670043.6370802913,4674568.378513364,42,T
1644344218.2774045,670,0,0,,42.204793,71.059804,34.4,670043.6370802913,4674568.378513364,42,T
1644344219.278499,671,0,0,,42.204793,71.059804,34.4,670043.6370802913,4674568.378513364,42,T
1644344220.2786603,672,0,0,,42.204793,71.059803,34.5,670043.5545234575,4674568.376518684,42,T
1644344221.2818403,673,0,0,,42.204793,71.059803,34.5,670043.5545234575,4674568.376518684,42,T
1644344222.2786217,674,0,0,,42.204793,71.059803,34.5,670043.5545234575,4674568.376518684,42,T
1644344223.2789176,675,0,0,,42.204793,71.059802,34.5,670043.4719666239,4674568.374524006,42,T
1644344224.297386,676,0,0,,42.204793,71.059802,34.5,670043.4719666239,4674568.374524006,42,T
1644344225.2778344,677,0,0,,42.204792,71.059802,34.5,670043.4746494906,4674568.263484061,42,T
1644344226.3120403,678,0,0,,42.204792,71.059802,34.5,670043.4746494906,4674568.263484061,42,T
1644344227.300681,679,0,0,,42.204792,71.059802,34.5,670043.4746494906,4674568.263484061,42,T
1644344228.2981226,680,0,0,,42.204792,71.059802,34.5,670043.4746494906,4674568.263484061,42,T
1644344229.2992053,681,0,0,,42.204792,71.059802,34.4,670043.4746494906,4674568.263484061,42,T
1644344230.2787654,682,0,0,,42.204792,71.059802,34.4,670043.4746494906,4674568.263484061,42,T
1644344231.279504,683,0,0,,42.204792,71.059802,34.4,670043.4746494906,4674568.263484061,42,T
1644344232.281393,684,0,0,,42.204792,71.059802,34.4,670043.4746494906,4674568.263484061,42,T
1644344233.2792296,685,0,0,,42.204792,71.059802,34.4,670043.4746494906,4674568.263484061,42,T
1644344234.2789738,686,0,0,,42.204792,71.059802,34.4,670043.4746494906,4674568.263484061,42,T
1644344235.2798605,687,0,0,,42.204792,71.059802,34.4,670043.4746494906,4674568.263484061,42,T
1644344236.2809374,688,0,0,,42.204792,71.059802,34.4,670043.4746494906,4674568.263484061,42,T
1644344237.2982013,689,0,0,,42.204792,71.059802,34.4,670043.4746494906,4674568.263484061,42,T
1644344238.2783222,690,0,0,,42.204792,71.059802,34.4,670043.4746494906,4674568.263484061,42,T
1644344239.3008687,691,0,0,,42.204792,71.059802,34.4,670043.4746494906,4674568.263484061,42,T
1644344240.298383,692,0,0,,42.204792,71.059801,34.4,670043.3920926556,4674568.261489383,42,T
1644344241.2781553,693,0,0,,42.204792,71.059801,34.4,670043.3920926556,4674568.261489383,42,T
1644344242.2780654,694,0,0,,42.20479099999999,71.059801,34.3,670043.394775521,4674568.150449437,42,T
1644344243.297917,695,0,0,,42.20479099999999,71.059801,34.3,670043.394775521,4674568.150449437,42,T
1644344244.2796025,696,0,0,,42.20479099999999,71.059801,34.3,670043.394775521,4674568.150449437,42,T
1644344245.2790942,697,0,0,,42.20479099999999,71.059802,34.2,670043.4773323573,4674568.152444115,42,T
1644344246.2805853,698,0,0,,42.20479,71.059802,34.1,670043.4800152238,4674568.041404173,42,T
1644344247.2787046,699,0,0,,42.20479,71.059802,34.0,670043.4800152238,4674568.041404173,42,T
1644344248.2990284,700,0,0,,42.20479,71.059802,34.0,670043.4800152238,4674568.041404173,42,T
1644344249.298343,701,0,0,,42.20479,71.059802,34.0,670043.4800152238,4674568.041404173,42,T
1644344250.2796302,702,0,0,,42.20479,71.059803,33.9,670043.5625720614,4674568.0433988515,42,T
1644344251.301054,703,0,0,,42.20479,71.059803,33.9,670043.5625720614,4674568.0433988515,42,T
1644344252.2805357,704,0,0,,42.20479,71.059803,33.9,670043.5625720614,4674568.0433988515,42,T
1644344253.2995381,705,0,0,,42.204789,71.059803,33.8,670043.5652549292,4674567.932358906,42,T
1644344254.2983425,706,0,0,,42.204789,71.059803,33.8,670043.5652549292,4674567.932358906,42,T
1644344255.2794785,707,0,0,,42.204789,71.059803,33.8,670043.5652549292,4674567.932358906,42,T
1644344256.3003695,708,0,0,,42.204789,71.059802,33.8,670043.4826980904,4674567.930364227,42,T
1644344257.301285,709,0,0,,42.204789,71.059802,33.8,670043.4826980904,4674567.930364227,42,T
1644344258.2801218,710,0,0,,42.204789,71.059802,33.8,670043.4826980904,4674567.930364227,42,T
1644344259.287681,711,0,0,,42.204789,71.059802,33.8,670043.4826980904,4674567.930364227,42,T
1644344260.2991154,712,0,0,,42.204789,71.059803,33.7,670043.5652549292,4674567.932358906,42,T
1644344261.2800984,713,0,0,,42.204789,71.059804,33.6,670043.6478117681,4674567.934353586,42,T
1644344262.2807784,714,0,0,,42.204789,71.059804,33.7,670043.6478117681,4674567.934353586,42,T
1644344263.2824833,715,0,0,,42.204789,71.059804,33.7,670043.6478117681,4674567.934353586,42,T
1644344264.2799704,716,0,0,,42.204789,71.059804,33.7,670043.6478117681,4674567.934353586,42,T
1644344265.2804406,717,0,0,,42.204789,71.059803,33.7,670043.5652549292,4674567.932358906,42,T
1644344266.2810607,718,0,0,,42.204789,71.059803,33.7,670043.5652549292,4674567.932358906,42,T
1644344267.2789848,719,0,0,,42.204789,71.059803,33.7,670043.5652549292,4674567.932358906,42,T
1644344268.2795246,720,0,0,,42.204789,71.059802,33.8,670043.4826980904,4674567.930364227,42,T
1644344269.280725,721,0,0,,42.204788,71.059802,33.8,670043.4853809569,4674567.819324282,42,T
1644344270.278841,722,0,0,,42.204788,71.059801,33.9,670043.4028241166,4674567.817329604,42,T
1644344271.2787676,723,0,0,,42.204788,71.059801,33.9,670043.4028241166,4674567.817329604,42,T
1644344272.2806606,724,0,0,,42.204788,71.059801,33.9,670043.4028241166,4674567.817329604,42,T
1644344273.2786667,725,0,0,,42.204788,71.0598,34.0,670043.3202672765,4674567.815334927,42,T
1644344274.280477,726,0,0,,42.204788,71.059799,34.1,670043.2377104384,4674567.813340252,42,T
1644344275.2990832,727,0,0,,42.204788,71.059799,34.1,670043.2377104384,4674567.813340252,42,T
1644344276.278542,728,0,0,,42.204788,71.059799,34.2,670043.2377104384,4674567.813340252,42,T
1644344277.2991712,729,0,0,,42.204788,71.059798,34.3,670043.1551535961,4674567.811345576,42,T
1644344278.2971902,730,0,0,,42.204788,71.059798,34.3,670043.1551535961,4674567.811345576,42,T
1644344279.2979043,731,0,0,,42.204788,71.059797,34.4,670043.0725967581,4674567.809350903,42,T
1644344280.299047,732,0,0,,42.204788,71.059797,34.5,670043.0725967581,4674567.809350903,42,T
1644344281.2798314,733,0,0,,42.204788,71.059797,34.5,670043.0725967581,4674567.809350903,42,T
1644344282.279604,734,0,0,,42.204789,71.059798,34.5,670043.1524707349,4674567.922385521,42,T
