Time,header.seq,header.stamp.secs,header.stamp.nsecs,header.frame_id,latitude,longitude,altitude,utm_easting,utm_northing,zone,letter
1644345093.2785046,1545,0,0,,42.20501,71.059663,12.5,670031.4144228573,4674592.192941269,42,T
1644345094.2800703,1546,0,0,,42.205006999999995,71.05966599999999,12.7,670031.6701406094,4674591.865805065,42,T
1644345095.2800715,1547,0,0,,42.205004,71.059672,13.0,670032.173528056,4674591.544652531,42,T
1644345096.2799602,1548,0,0,,42.205,71.059679,13.0,670032.7621548283,4674591.11445464,42,T
1644345097.2810767,1549,0,0,,42.204996,71.059685,13.1,670033.2682251068,4674590.6822622325,42,T
1644345098.3033814,1550,0,0,,42.204993,71.059688,12.1,670033.5239429957,4674590.355126093,42,T
1644345099.2815816,1551,0,0,,42.204989,71.059692,11.5,670033.8649002174,4674589.91894459,42,T
1644345100.3009677,1552,0,0,,42.20498499999999,71.059698,11.5,670034.3709706458,4674589.486752255,42,T
1644345101.2779877,1553,0,0,,42.204981,71.059704,11.4,670034.877041136,4674589.054559957,42,T
1644345102.3041294,1554,0,0,,42.204977,71.059711,11.3,670035.4656682815,4674588.624362285,42,T
1644345103.2828338,1555,0,0,,42.204973,71.059717,11.1,670035.9717389009,4674588.192170063,42,T
1644345104.2811906,1556,0,0,,42.204969,71.059723,11.0,670036.4778095842,4674587.759977876,42,T
1644345105.2796001,1557,0,0,,42.204964,71.059729,10.9,670036.9865631058,4674587.216745774,42,T
1644345106.2803712,1558,0,0,,42.204959,71.05973399999999,10.8,670037.4127600899,4674586.671519097,42,T
1644345107.280412,1559,0,0,,42.204954,71.05974,10.7,670037.9215137633,4674586.128287061,42,T
1644345108.2793088,1560,0,0,,42.20495,71.05974599999999,10.6,670038.4275847079,4674585.696095004,42,T
1644345109.3020658,1561,0,0,,42.204944999999995,71.059752,10.5,670038.936338528,4674585.152863039,42,T
1644345110.3026104,1562,0,0,,42.20493999999999,71.059758,10.4,670039.4450924231,4674584.609631107,42,T
1644345111.2784932,1563,0,0,,42.204936,71.059764,10.5,670039.9511635709,4674584.177439158,42,T
1644345112.3005025,1564,0,0,,42.204930999999995,71.05977,10.5,670040.4599176126,4674583.634207296,42,T
1644345113.2799795,1565,0,0,,42.20492599999999,71.059776,10.5,670040.9686717315,4674583.090975469,42,T
1644345114.2797022,1566,0,0,,42.204921000000006,71.059782,10.7,670041.4774259275,4674582.547743678,42,T
1644345115.3020484,1567,0,0,,42.204916000000004,71.059788,10.7,670041.9861802007,4674582.004511923,42,T
1644345116.302754,1568,0,0,,42.20491200000001,71.059794,10.7,670042.4922516885,4674581.572320147,42,T
1644345117.2803717,1569,0,0,,42.204907000000006,71.0598,10.8,670043.0010061082,4674581.02908846,42,T
1644345118.279618,1570,0,0,,42.204902000000004,71.059806,10.7,670043.5097606052,4674580.485856808,42,T
1644345119.2789452,1571,0,0,,42.204897,71.05981200000001,10.7,670044.0185151814,4674579.94262519,42,T
1644345120.2801704,1572,0,0,,42.204893,71.05981799999999,10.7,670044.5245869397,4674579.510433555,42,T
1644345121.2793763,1573,0,0,,42.204888000000004,71.05982399999999,11.0,670045.0333416583,4674578.967202006,42,T
1644345122.300334,1574,0,0,,42.204883,71.05983,11.0,670045.5420964581,4674578.4239704935,42,T
1644345123.2783368,1575,0,0,,42.204878,71.059837,11.5,670046.1334080561,4674577.882733728,42,T
1644345124.2833633,1576,0,0,,42.204873,71.059842,11.6,670046.5596062851,4674577.337507574,42,T
1644345125.2774787,1577,0,0,,42.204869,71.059848,11.7,670047.0656783836,4674576.905316113,42,T
1644345126.278933,1578,0,0,,42.204864,71.059854,12.0,670047.5744334823,4674576.362084738,42,T
1644345127.3031528,1579,0,0,,42.204858,71.059859,12.5,670048.0033148546,4674575.70581872,42,T
1644345128.2817907,1580,0,0,,42.204853,71.059866,13.0,670048.5946268642,4674575.164582151,42,T
1644345129.3018327,1581,0,0,,42.204848,71.059872,13.5,670049.1033822019,4674574.621350882,42,T
1644345130.2814217,1582,0,0,,42.204844,71.059878,13.8,670049.6094546481,4674574.189159595,42,T
1644345131.2809103,1583,0,0,,42.204839,71.059884,14.0,670050.1182101322,4674573.645928398,42,T
1644345132.5451107,1584,0,0,,42.204834,71.05989,14.2,670050.6269656937,4674573.102697234,42,T
1644345133.3651464,1585,0,0,,42.20483,71.059897,14.3,670051.2155951269,4674572.672500823,42,T
1644345134.2786365,1586,0,0,,42.204825,71.05990200000001,14.1,670051.641794051,4674572.127274957,42,T
1644345135.3007622,1587,0,0,,42.204819,71.059904,13.8,670051.8230056411,4674571.4650248345,42,T
1644345136.2795384,1588,0,0,,42.204814,71.05990700000001,13.4,670052.0840910664,4674570.915809442,42,T
1644345137.3015025,1589,0,0,,42.204809999999995,71.059912,13.0,670052.507607143,4674570.481623571,42,T
1644345138.2805161,1590,0,0,,42.204806,71.059916,12.5,670052.8485664538,4674570.045442936,42,T
1644345139.2795243,1591,0,0,,42.2048,71.059918,12.2,670053.0297781993,4674569.383192843,42,T
1644345140.3018255,1592,0,0,,42.204795000000004,71.059921,12.2,670053.2908637833,4674568.8339774925,42,T
1644345141.2812738,1593,0,0,,42.20479,71.059922,11.9,670053.3868357328,4674568.28077256,42,T
1644345142.2788882,1594,0,0,,42.204786000000006,71.059924,11.9,670053.5626815092,4674567.84060237,42,T
1644345143.300978,1595,0,0,,42.204783,71.059925,12.5,670053.6532874326,4674567.509477329,42,T
1644345144.2802591,1596,0,0,,42.204781999999994,71.059925,13.1,670053.6559704592,4674567.398437382,42,T
1644345145.280167,1597,0,0,,42.204781000000004,71.059923,13.4,670053.4935397857,4674567.283407846,42,T
