<?xml version="1.0" encoding="UTF-8" standalone="no"?>
<!DOCTYPE svg PUBLIC "-//W3C//DTD SVG 1.1//EN"
 "http://www.w3.org/Graphics/SVG/1.1/DTD/svg11.dtd">
<!-- Generated by graphviz version 5.0.0 (20220707.1540)
 -->
<!-- Title: dependencies Pages: 1 -->
<svg width="1539pt" height="247pt"
 viewBox="0.00 0.00 1539.00 246.80" xmlns="http://www.w3.org/2000/svg" xmlns:xlink="http://www.w3.org/1999/xlink">
<g id="graph0" class="graph" transform="scale(1 1) rotate(0) translate(4 242.8)">
<title>dependencies</title>
<polygon fill="white" stroke="transparent" points="-4,4 -4,-242.8 1535,-242.8 1535,4 -4,4"/>
<text text-anchor="middle" x="765.5" y="-8.2" font-family="sans-serif" font-size="14.00">dependencies</text>
<g id="clust1" class="cluster">
<title>cluster_AppModule</title>
<polygon fill="none" stroke="black" stroke-dasharray="1,5" points="8,-32.8 8,-230.8 1523,-230.8 1523,-32.8 8,-32.8"/>
</g>
<g id="clust12" class="cluster">
<title>cluster_AppModule_imports</title>
<polygon fill="none" stroke="black" points="1371,-40.8 1371,-92.8 1515,-92.8 1515,-40.8 1371,-40.8"/>
</g>
<g id="clust14" class="cluster">
<title>cluster_AppModule_bootstrap</title>
<polygon fill="none" stroke="black" points="714,-170.8 714,-222.8 838,-222.8 838,-170.8 714,-170.8"/>
</g>
<g id="clust2" class="cluster">
<title>cluster_AppModule_declarations</title>
<polygon fill="none" stroke="black" points="16,-40.8 16,-92.8 1363,-92.8 1363,-40.8 16,-40.8"/>
</g>
<!-- AppComponent -->
<g id="node1" class="node">
<title>AppComponent</title>
<polygon fill="#ffffb3" stroke="black" points="1354.94,-84.8 1249.06,-84.8 1249.06,-48.8 1354.94,-48.8 1354.94,-84.8"/>
<text text-anchor="middle" x="1302" y="-62.6" font-family="Times,serif" font-size="14.00">AppComponent</text>
</g>
<!-- AppModule -->
<g id="node10" class="node">
<title>AppModule</title>
<polygon fill="#8dd3c7" stroke="black" points="817.66,-149.8 814.66,-153.8 793.66,-153.8 790.66,-149.8 734.34,-149.8 734.34,-113.8 817.66,-113.8 817.66,-149.8"/>
<text text-anchor="middle" x="776" y="-127.6" font-family="Times,serif" font-size="14.00">AppModule</text>
</g>
<!-- AppComponent&#45;&gt;AppModule -->
<g id="edge1" class="edge">
<title>AppComponent&#45;&gt;AppModule</title>
<path fill="none" stroke="black" d="M1302,-84.93C1302,-105.37 1302,-135.8 1302,-135.8 1302,-135.8 827.71,-135.8 827.71,-135.8"/>
<polygon fill="black" stroke="black" points="827.71,-132.3 817.71,-135.8 827.71,-139.3 827.71,-132.3"/>
</g>
<!-- ConnexionComponent -->
<g id="node2" class="node">
<title>ConnexionComponent</title>
<polygon fill="#ffffb3" stroke="black" points="1231.27,-84.8 1088.73,-84.8 1088.73,-48.8 1231.27,-48.8 1231.27,-84.8"/>
<text text-anchor="middle" x="1160" y="-62.6" font-family="Times,serif" font-size="14.00">ConnexionComponent</text>
</g>
<!-- ConnexionComponent&#45;&gt;AppModule -->
<g id="edge2" class="edge">
<title>ConnexionComponent&#45;&gt;AppModule</title>
<path fill="none" stroke="black" d="M1160,-85.07C1160,-103.36 1160,-128.8 1160,-128.8 1160,-128.8 827.83,-128.8 827.83,-128.8"/>
<polygon fill="black" stroke="black" points="827.83,-125.3 817.83,-128.8 827.83,-132.3 827.83,-125.3"/>
</g>
<!-- JeuCreerComponent -->
<g id="node3" class="node">
<title>JeuCreerComponent</title>
<polygon fill="#ffffb3" stroke="black" points="1070.58,-84.8 939.42,-84.8 939.42,-48.8 1070.58,-48.8 1070.58,-84.8"/>
<text text-anchor="middle" x="1005" y="-62.6" font-family="Times,serif" font-size="14.00">JeuCreerComponent</text>
</g>
<!-- JeuCreerComponent&#45;&gt;AppModule -->
<g id="edge3" class="edge">
<title>JeuCreerComponent&#45;&gt;AppModule</title>
<path fill="none" stroke="black" d="M1005,-84.81C1005,-100.85 1005,-121.8 1005,-121.8 1005,-121.8 827.74,-121.8 827.74,-121.8"/>
<polygon fill="black" stroke="black" points="827.74,-118.3 817.74,-121.8 827.74,-125.3 827.74,-118.3"/>
</g>
<!-- JeuDetailsComponent -->
<g id="node4" class="node">
<title>JeuDetailsComponent</title>
<polygon fill="#ffffb3" stroke="black" points="921.65,-84.8 782.35,-84.8 782.35,-48.8 921.65,-48.8 921.65,-84.8"/>
<text text-anchor="middle" x="852" y="-62.6" font-family="Times,serif" font-size="14.00">JeuDetailsComponent</text>
</g>
<!-- JeuDetailsComponent&#45;&gt;AppModule -->
<g id="edge4" class="edge">
<title>JeuDetailsComponent&#45;&gt;AppModule</title>
<path fill="none" stroke="black" d="M800,-84.91C800,-84.91 800,-103.79 800,-103.79"/>
<polygon fill="black" stroke="black" points="796.5,-103.79 800,-113.79 803.5,-103.79 796.5,-103.79"/>
</g>
<!-- JeuItemComponent -->
<g id="node5" class="node">
<title>JeuItemComponent</title>
<polygon fill="#ffffb3" stroke="black" points="763.65,-84.8 638.35,-84.8 638.35,-48.8 763.65,-48.8 763.65,-84.8"/>
<text text-anchor="middle" x="701" y="-62.6" font-family="Times,serif" font-size="14.00">JeuItemComponent</text>
</g>
<!-- JeuItemComponent&#45;&gt;AppModule -->
<g id="edge5" class="edge">
<title>JeuItemComponent&#45;&gt;AppModule</title>
<path fill="none" stroke="black" d="M749,-84.91C749,-84.91 749,-103.79 749,-103.79"/>
<polygon fill="black" stroke="black" points="745.5,-103.79 749,-113.79 752.5,-103.79 745.5,-103.79"/>
</g>
<!-- JeuListeComponent -->
<g id="node6" class="node">
<title>JeuListeComponent</title>
<polygon fill="#ffffb3" stroke="black" points="619.99,-84.8 492.01,-84.8 492.01,-48.8 619.99,-48.8 619.99,-84.8"/>
<text text-anchor="middle" x="556" y="-62.6" font-family="Times,serif" font-size="14.00">JeuListeComponent</text>
</g>
<!-- JeuListeComponent&#45;&gt;AppModule -->
<g id="edge6" class="edge">
<title>JeuListeComponent&#45;&gt;AppModule</title>
<path fill="none" stroke="black" d="M556,-84.81C556,-100.85 556,-121.8 556,-121.8 556,-121.8 724.1,-121.8 724.1,-121.8"/>
<polygon fill="black" stroke="black" points="724.1,-125.3 734.1,-121.8 724.1,-118.3 724.1,-125.3"/>
</g>
<!-- JeuModifierComponent -->
<g id="node7" class="node">
<title>JeuModifierComponent</title>
<polygon fill="#ffffb3" stroke="black" points="473.76,-84.8 324.24,-84.8 324.24,-48.8 473.76,-48.8 473.76,-84.8"/>
<text text-anchor="middle" x="399" y="-62.6" font-family="Times,serif" font-size="14.00">JeuModifierComponent</text>
</g>
<!-- JeuModifierComponent&#45;&gt;AppModule -->
<g id="edge7" class="edge">
<title>JeuModifierComponent&#45;&gt;AppModule</title>
<path fill="none" stroke="black" d="M399,-85.07C399,-103.36 399,-128.8 399,-128.8 399,-128.8 724.21,-128.8 724.21,-128.8"/>
<polygon fill="black" stroke="black" points="724.21,-132.3 734.21,-128.8 724.21,-125.3 724.21,-132.3"/>
</g>
<!-- NavComponent -->
<g id="node8" class="node">
<title>NavComponent</title>
<polygon fill="#ffffb3" stroke="black" points="306.16,-84.8 201.84,-84.8 201.84,-48.8 306.16,-48.8 306.16,-84.8"/>
<text text-anchor="middle" x="254" y="-62.6" font-family="Times,serif" font-size="14.00">NavComponent</text>
</g>
<!-- NavComponent&#45;&gt;AppModule -->
<g id="edge8" class="edge">
<title>NavComponent&#45;&gt;AppModule</title>
<path fill="none" stroke="black" d="M254,-84.93C254,-105.37 254,-135.8 254,-135.8 254,-135.8 724.16,-135.8 724.16,-135.8"/>
<polygon fill="black" stroke="black" points="724.16,-139.3 734.16,-135.8 724.16,-132.3 724.16,-139.3"/>
</g>
<!-- StreamerListeComponent -->
<g id="node9" class="node">
<title>StreamerListeComponent</title>
<polygon fill="#ffffb3" stroke="black" points="183.86,-84.8 24.14,-84.8 24.14,-48.8 183.86,-48.8 183.86,-84.8"/>
<text text-anchor="middle" x="104" y="-62.6" font-family="Times,serif" font-size="14.00">StreamerListeComponent</text>
</g>
<!-- StreamerListeComponent&#45;&gt;AppModule -->
<g id="edge9" class="edge">
<title>StreamerListeComponent&#45;&gt;AppModule</title>
<path fill="none" stroke="black" d="M104,-84.81C104,-107.29 104,-142.8 104,-142.8 104,-142.8 724.22,-142.8 724.22,-142.8"/>
<polygon fill="black" stroke="black" points="724.22,-146.3 734.22,-142.8 724.22,-139.3 724.22,-146.3"/>
</g>
<!-- AppComponent  -->
<g id="node12" class="node">
<title>AppComponent </title>
<polygon fill="#80b1d3" stroke="black" points="830.44,-214.8 721.56,-214.8 721.56,-178.8 830.44,-178.8 830.44,-214.8"/>
<text text-anchor="middle" x="776" y="-192.6" font-family="Times,serif" font-size="14.00">AppComponent </text>
</g>
<!-- AppModule&#45;&gt;AppComponent  -->
<g id="edge11" class="edge">
<title>AppModule&#45;&gt;AppComponent </title>
<path fill="none" stroke="black" stroke-dasharray="1,5" d="M776,-149.91C776,-149.91 776,-168.79 776,-168.79"/>
<polygon fill="black" stroke="black" points="772.5,-168.79 776,-178.79 779.5,-168.79 772.5,-168.79"/>
</g>
<!-- AppRoutingModule -->
<g id="node11" class="node">
<title>AppRoutingModule</title>
<polygon fill="#8dd3c7" stroke="black" points="1507.28,-84.8 1504.28,-88.8 1483.28,-88.8 1480.28,-84.8 1378.72,-84.8 1378.72,-48.8 1507.28,-48.8 1507.28,-84.8"/>
<text text-anchor="middle" x="1443" y="-62.6" font-family="Times,serif" font-size="14.00">AppRoutingModule</text>
</g>
<!-- AppRoutingModule&#45;&gt;AppModule -->
<g id="edge10" class="edge">
<title>AppRoutingModule&#45;&gt;AppModule</title>
<path fill="none" stroke="black" d="M1443,-84.81C1443,-107.29 1443,-142.8 1443,-142.8 1443,-142.8 827.72,-142.8 827.72,-142.8"/>
<polygon fill="black" stroke="black" points="827.72,-139.3 817.72,-142.8 827.72,-146.3 827.72,-139.3"/>
</g>
</g>
</svg>
