<?xml version="1.0" encoding="UTF-8" standalone="no"?>
<!DOCTYPE svg PUBLIC "-//W3C//DTD SVG 1.1//EN"
 "http://www.w3.org/Graphics/SVG/1.1/DTD/svg11.dtd">
<!-- Generated by graphviz version 5.0.0 (20220707.1540)
 -->
<!-- Title: dependencies Pages: 1 -->
<svg width="1539pt" height="247pt"
 viewBox="0.00 0.00 1539.00 246.80" xmlns="http://www.w3.org/2000/svg" xmlns:xlink="http://www.w3.org/1999/xlink">
<g id="graph0" class="graph" transform="scale(1 1) rotate(0) translate(4 242.8)">
<title>dependencies</title>
<polygon fill="white" stroke="transparent" points="-4,4 -4,-242.8 1535,-242.8 1535,4 -4,4"/>
<text text-anchor="middle" x="765.5" y="-8.2" font-family="sans-serif" font-size="14.00">dependencies</text>
<g id="clust1" class="cluster">
<title>cluster_AppModule</title>
<polygon fill="none" stroke="black" stroke-dasharray="1,5" points="8,-32.8 8,-230.8 1523,-230.8 1523,-32.8 8,-32.8"/>
</g>
<g id="clust2" class="cluster">
<title>cluster_AppModule_declarations</title>
<polygon fill="none" stroke="black" points="168,-40.8 168,-92.8 1515,-92.8 1515,-40.8 168,-40.8"/>
</g>
<g id="clust12" class="cluster">
<title>cluster_AppModule_imports</title>
<polygon fill="none" stroke="black" points="16,-40.8 16,-92.8 160,-92.8 160,-40.8 16,-40.8"/>
</g>
<g id="clust14" class="cluster">
<title>cluster_AppModule_bootstrap</title>
<polygon fill="none" stroke="black" points="718,-170.8 718,-222.8 842,-222.8 842,-170.8 718,-170.8"/>
</g>
<!-- AppComponent -->
<g id="node1" class="node">
<title>AppComponent</title>
<polygon fill="#ffffb3" stroke="black" points="1506.94,-84.8 1401.06,-84.8 1401.06,-48.8 1506.94,-48.8 1506.94,-84.8"/>
<text text-anchor="middle" x="1454" y="-62.6" font-family="Times,serif" font-size="14.00">AppComponent</text>
</g>
<!-- AppModule -->
<g id="node10" class="node">
<title>AppModule</title>
<polygon fill="#8dd3c7" stroke="black" points="821.66,-149.8 818.66,-153.8 797.66,-153.8 794.66,-149.8 738.34,-149.8 738.34,-113.8 821.66,-113.8 821.66,-149.8"/>
<text text-anchor="middle" x="780" y="-127.6" font-family="Times,serif" font-size="14.00">AppModule</text>
</g>
<!-- AppComponent&#45;&gt;AppModule -->
<g id="edge1" class="edge">
<title>AppComponent&#45;&gt;AppModule</title>
<path fill="none" stroke="black" d="M1454,-84.81C1454,-107.29 1454,-142.8 1454,-142.8 1454,-142.8 831.91,-142.8 831.91,-142.8"/>
<polygon fill="black" stroke="black" points="831.91,-139.3 821.91,-142.8 831.91,-146.3 831.91,-139.3"/>
</g>
<!-- ConnexionComponent -->
<g id="node2" class="node">
<title>ConnexionComponent</title>
<polygon fill="#ffffb3" stroke="black" points="1383.27,-84.8 1240.73,-84.8 1240.73,-48.8 1383.27,-48.8 1383.27,-84.8"/>
<text text-anchor="middle" x="1312" y="-62.6" font-family="Times,serif" font-size="14.00">ConnexionComponent</text>
</g>
<!-- ConnexionComponent&#45;&gt;AppModule -->
<g id="edge2" class="edge">
<title>ConnexionComponent&#45;&gt;AppModule</title>
<path fill="none" stroke="black" d="M1312,-84.93C1312,-105.37 1312,-135.8 1312,-135.8 1312,-135.8 831.75,-135.8 831.75,-135.8"/>
<polygon fill="black" stroke="black" points="831.75,-132.3 821.75,-135.8 831.75,-139.3 831.75,-132.3"/>
</g>
<!-- JeuCreerComponent -->
<g id="node3" class="node">
<title>JeuCreerComponent</title>
<polygon fill="#ffffb3" stroke="black" points="1222.58,-84.8 1091.42,-84.8 1091.42,-48.8 1222.58,-48.8 1222.58,-84.8"/>
<text text-anchor="middle" x="1157" y="-62.6" font-family="Times,serif" font-size="14.00">JeuCreerComponent</text>
</g>
<!-- JeuCreerComponent&#45;&gt;AppModule -->
<g id="edge3" class="edge">
<title>JeuCreerComponent&#45;&gt;AppModule</title>
<path fill="none" stroke="black" d="M1157,-85.07C1157,-103.36 1157,-128.8 1157,-128.8 1157,-128.8 831.79,-128.8 831.79,-128.8"/>
<polygon fill="black" stroke="black" points="831.79,-125.3 821.79,-128.8 831.79,-132.3 831.79,-125.3"/>
</g>
<!-- JeuDetailsComponent -->
<g id="node4" class="node">
<title>JeuDetailsComponent</title>
<polygon fill="#ffffb3" stroke="black" points="1073.65,-84.8 934.35,-84.8 934.35,-48.8 1073.65,-48.8 1073.65,-84.8"/>
<text text-anchor="middle" x="1004" y="-62.6" font-family="Times,serif" font-size="14.00">JeuDetailsComponent</text>
</g>
<!-- JeuDetailsComponent&#45;&gt;AppModule -->
<g id="edge4" class="edge">
<title>JeuDetailsComponent&#45;&gt;AppModule</title>
<path fill="none" stroke="black" d="M1004,-84.81C1004,-100.85 1004,-121.8 1004,-121.8 1004,-121.8 831.87,-121.8 831.87,-121.8"/>
<polygon fill="black" stroke="black" points="831.87,-118.3 821.87,-121.8 831.87,-125.3 831.87,-118.3"/>
</g>
<!-- JeuItemComponent -->
<g id="node5" class="node">
<title>JeuItemComponent</title>
<polygon fill="#ffffb3" stroke="black" points="915.65,-84.8 790.35,-84.8 790.35,-48.8 915.65,-48.8 915.65,-84.8"/>
<text text-anchor="middle" x="853" y="-62.6" font-family="Times,serif" font-size="14.00">JeuItemComponent</text>
</g>
<!-- JeuItemComponent&#45;&gt;AppModule -->
<g id="edge5" class="edge">
<title>JeuItemComponent&#45;&gt;AppModule</title>
<path fill="none" stroke="black" d="M806,-84.91C806,-84.91 806,-103.79 806,-103.79"/>
<polygon fill="black" stroke="black" points="802.5,-103.79 806,-113.79 809.5,-103.79 802.5,-103.79"/>
</g>
<!-- JeuListeComponent -->
<g id="node6" class="node">
<title>JeuListeComponent</title>
<polygon fill="#ffffb3" stroke="black" points="771.99,-84.8 644.01,-84.8 644.01,-48.8 771.99,-48.8 771.99,-84.8"/>
<text text-anchor="middle" x="708" y="-62.6" font-family="Times,serif" font-size="14.00">JeuListeComponent</text>
</g>
<!-- JeuListeComponent&#45;&gt;AppModule -->
<g id="edge6" class="edge">
<title>JeuListeComponent&#45;&gt;AppModule</title>
<path fill="none" stroke="black" d="M755.08,-84.91C755.08,-84.91 755.08,-103.79 755.08,-103.79"/>
<polygon fill="black" stroke="black" points="751.58,-103.79 755.08,-113.79 758.58,-103.79 751.58,-103.79"/>
</g>
<!-- JeuModifierComponent -->
<g id="node7" class="node">
<title>JeuModifierComponent</title>
<polygon fill="#ffffb3" stroke="black" points="625.76,-84.8 476.24,-84.8 476.24,-48.8 625.76,-48.8 625.76,-84.8"/>
<text text-anchor="middle" x="551" y="-62.6" font-family="Times,serif" font-size="14.00">JeuModifierComponent</text>
</g>
<!-- JeuModifierComponent&#45;&gt;AppModule -->
<g id="edge7" class="edge">
<title>JeuModifierComponent&#45;&gt;AppModule</title>
<path fill="none" stroke="black" d="M551,-84.81C551,-100.85 551,-121.8 551,-121.8 551,-121.8 728.26,-121.8 728.26,-121.8"/>
<polygon fill="black" stroke="black" points="728.26,-125.3 738.26,-121.8 728.26,-118.3 728.26,-125.3"/>
</g>
<!-- NavComponent -->
<g id="node8" class="node">
<title>NavComponent</title>
<polygon fill="#ffffb3" stroke="black" points="458.16,-84.8 353.84,-84.8 353.84,-48.8 458.16,-48.8 458.16,-84.8"/>
<text text-anchor="middle" x="406" y="-62.6" font-family="Times,serif" font-size="14.00">NavComponent</text>
</g>
<!-- NavComponent&#45;&gt;AppModule -->
<g id="edge8" class="edge">
<title>NavComponent&#45;&gt;AppModule</title>
<path fill="none" stroke="black" d="M406,-85.07C406,-103.36 406,-128.8 406,-128.8 406,-128.8 728.19,-128.8 728.19,-128.8"/>
<polygon fill="black" stroke="black" points="728.19,-132.3 738.19,-128.8 728.19,-125.3 728.19,-132.3"/>
</g>
<!-- StreamerListeComponent -->
<g id="node9" class="node">
<title>StreamerListeComponent</title>
<polygon fill="#ffffb3" stroke="black" points="335.86,-84.8 176.14,-84.8 176.14,-48.8 335.86,-48.8 335.86,-84.8"/>
<text text-anchor="middle" x="256" y="-62.6" font-family="Times,serif" font-size="14.00">StreamerListeComponent</text>
</g>
<!-- StreamerListeComponent&#45;&gt;AppModule -->
<g id="edge9" class="edge">
<title>StreamerListeComponent&#45;&gt;AppModule</title>
<path fill="none" stroke="black" d="M256,-84.93C256,-105.37 256,-135.8 256,-135.8 256,-135.8 728,-135.8 728,-135.8"/>
<polygon fill="black" stroke="black" points="728,-139.3 738,-135.8 728,-132.3 728,-139.3"/>
</g>
<!-- AppComponent  -->
<g id="node12" class="node">
<title>AppComponent </title>
<polygon fill="#80b1d3" stroke="black" points="834.44,-214.8 725.56,-214.8 725.56,-178.8 834.44,-178.8 834.44,-214.8"/>
<text text-anchor="middle" x="780" y="-192.6" font-family="Times,serif" font-size="14.00">AppComponent </text>
</g>
<!-- AppModule&#45;&gt;AppComponent  -->
<g id="edge11" class="edge">
<title>AppModule&#45;&gt;AppComponent </title>
<path fill="none" stroke="black" stroke-dasharray="1,5" d="M780,-149.91C780,-149.91 780,-168.79 780,-168.79"/>
<polygon fill="black" stroke="black" points="776.5,-168.79 780,-178.79 783.5,-168.79 776.5,-168.79"/>
</g>
<!-- AppRoutingModule -->
<g id="node11" class="node">
<title>AppRoutingModule</title>
<polygon fill="#8dd3c7" stroke="black" points="152.28,-84.8 149.28,-88.8 128.28,-88.8 125.28,-84.8 23.72,-84.8 23.72,-48.8 152.28,-48.8 152.28,-84.8"/>
<text text-anchor="middle" x="88" y="-62.6" font-family="Times,serif" font-size="14.00">AppRoutingModule</text>
</g>
<!-- AppRoutingModule&#45;&gt;AppModule -->
<g id="edge10" class="edge">
<title>AppRoutingModule&#45;&gt;AppModule</title>
<path fill="none" stroke="black" d="M88,-84.81C88,-107.29 88,-142.8 88,-142.8 88,-142.8 728.27,-142.8 728.27,-142.8"/>
<polygon fill="black" stroke="black" points="728.27,-146.3 738.27,-142.8 728.27,-139.3 728.27,-146.3"/>
</g>
</g>
</svg>
