C:\MOOC\Java-Programming-1\mooc-java-programming-i\part06-Part06_07.HeightOrder\src\main\java\Main.java
C:\MOOC\Java-Programming-1\mooc-java-programming-i\part06-Part06_07.HeightOrder\src\main\java\Person.java
C:\MOOC\Java-Programming-1\mooc-java-programming-i\part06-Part06_07.HeightOrder\src\main\java\Room.java
