C:\MOOC\Java-Programming-1\mooc-java-programming-i\part06-Part06_08.CargoHold\src\main\java\Hold.java
C:\MOOC\Java-Programming-1\mooc-java-programming-i\part06-Part06_08.CargoHold\src\main\java\Suitcase.java
C:\MOOC\Java-Programming-1\mooc-java-programming-i\part06-Part06_08.CargoHold\src\main\java\Item.java
C:\MOOC\Java-Programming-1\mooc-java-programming-i\part06-Part06_08.CargoHold\src\main\java\Main.java
