C:\MOOC\Java-Programming-1\mooc-java-programming-i\part05-Part05_06.OverloadedCounter\src\test\java\MethodSignature.java
C:\MOOC\Java-Programming-1\mooc-java-programming-i\part05-Part05_06.OverloadedCounter\src\test\java\ConstructorSignature.java
C:\MOOC\Java-Programming-1\mooc-java-programming-i\part05-Part05_06.OverloadedCounter\src\test\java\Utils.java
C:\MOOC\Java-Programming-1\mooc-java-programming-i\part05-Part05_06.OverloadedCounter\src\test\java\CounterTest.java
