module hackernews

go 1.15

require (
	github.com/99designs/gqlgen v0.13.0
	github.com/dgrijalva/jwt-go v3.2.0+incompatible
	github.com/go-chi/chi v3.3.2+incompatible
	github.com/go-sql-driver/mysql v1.5.0
	github.com/rs/cors v1.6.0
	github.com/vektah/gqlparser/v2 v2.1.0
	golang.org/x/crypto v0.0.0-20191011191535-87dc89f01550
)
