-------------------------------------------------------------------------------
Test set: com.example.servicestring.ServicestringApplicationTests
-------------------------------------------------------------------------------
Tests run: 1, Failures: 0, Errors: 0, Skipped: 0, Time elapsed: 6.818 s - in com.example.servicestring.ServicestringApplicationTests
