<?xml version="1.0" standalone="no"?>
<!DOCTYPE svg PUBLIC "-//W3C//DTD SVG 20010904//EN"
 "http://www.w3.org/TR/2001/REC-SVG-20010904/DTD/svg10.dtd">
<svg version="1.0" xmlns="http://www.w3.org/2000/svg"
 width="512.000000pt" height="512.000000pt" viewBox="0 0 512.000000 512.000000"
 preserveAspectRatio="xMidYMid meet">

<g transform="translate(0.000000,512.000000) scale(0.100000,-0.100000)"
fill="#000000" stroke="none">
<path d="M1209 5091 l-29 -29 0 -246 0 -246 -270 0 c-305 0 -329 -4 -349 -60
-7 -22 -11 -127 -11 -301 l0 -269 -246 0 -246 0 -29 -29 c-36 -36 -37 -73 -4
-106 l24 -25 251 0 250 0 0 -245 0 -245 -241 0 c-244 0 -269 -3 -296 -39 -20
-26 -15 -70 12 -96 l24 -25 251 0 250 0 0 -245 0 -245 -250 0 -251 0 -24 -25
c-33 -32 -33 -78 0 -110 l24 -25 251 0 250 0 0 -245 0 -245 -250 0 -251 0 -24
-25 c-27 -26 -32 -70 -12 -96 27 -36 52 -39 296 -39 l241 0 0 -245 0 -245
-250 0 -251 0 -24 -25 c-32 -31 -32 -66 -1 -102 l24 -28 251 -3 251 -3 0 -268
c0 -174 4 -279 11 -301 20 -56 44 -60 349 -60 l270 0 0 -246 0 -246 29 -29
c36 -36 73 -37 106 -4 l25 24 0 251 0 250 245 0 245 0 0 -241 c0 -244 3 -269
39 -296 26 -20 70 -15 96 12 l25 24 0 251 0 250 245 0 245 0 0 -250 0 -251 25
-24 c32 -33 78 -33 110 0 l25 24 0 251 0 250 245 0 245 0 0 -250 0 -251 25
-24 c26 -27 70 -32 96 -12 36 27 39 52 39 296 l0 241 245 0 245 0 0 -250 0
-251 25 -24 c31 -32 66 -32 102 -1 l28 24 3 251 3 251 270 0 c304 0 328 4 348
60 7 22 11 127 11 301 l0 268 251 3 251 3 24 28 c31 36 31 71 -1 102 l-24 25
-251 0 -250 0 0 245 0 245 241 0 c244 0 269 3 296 39 20 26 15 70 -12 96 l-24
25 -251 0 -250 0 0 245 0 245 250 0 251 0 24 25 c33 32 33 78 0 110 l-24 25
-251 0 -250 0 0 245 0 245 250 0 251 0 24 25 c27 26 32 70 12 96 -27 36 -52
39 -296 39 l-241 0 0 245 0 245 250 0 251 0 24 25 c33 33 32 70 -4 106 l-29
29 -246 0 -246 0 0 269 c0 174 -4 279 -11 301 -20 56 -44 60 -349 60 l-270 0
0 246 0 246 -29 29 c-36 36 -73 37 -106 4 l-25 -24 0 -251 0 -250 -245 0 -245
0 0 241 c0 244 -3 269 -39 296 -26 20 -70 15 -96 -12 l-25 -24 0 -251 0 -250
-245 0 -245 0 0 250 0 251 -25 24 c-32 33 -78 33 -110 0 l-25 -24 0 -251 0
-250 -245 0 -245 0 0 250 0 251 -25 24 c-26 27 -70 32 -96 12 -36 -27 -39 -52
-39 -296 l0 -241 -245 0 -245 0 0 250 0 251 -25 24 c-33 33 -70 32 -106 -4z
m3196 -2531 l0 -1845 -1845 0 -1845 0 -3 1835 c-1 1009 0 1841 3 1848 3 10
378 12 1847 10 l1843 -3 0 -1845z"/>
<path d="M1052 4067 l-22 -23 0 -1485 0 -1486 23 -21 23 -22 1485 0 1486 0 21
23 22 23 0 1485 0 1486 -23 21 -23 22 -1485 0 -1486 0 -21 -23z m2878 -1507
l0 -1370 -1370 0 -1370 0 0 1370 0 1370 1370 0 1370 0 0 -1370z"/>
<path d="M3027 2998 c-9 -7 -21 -26 -27 -41 -13 -38 -13 -600 0 -665 13 -60
60 -118 114 -143 35 -16 68 -19 239 -19 176 0 202 2 236 19 50 26 97 81 110
128 7 23 11 166 11 359 0 310 -1 322 -21 348 -27 35 -86 36 -117 3 -22 -23
-22 -28 -22 -344 0 -279 -2 -324 -16 -337 -13 -13 -44 -16 -184 -16 -163 0
-169 1 -184 22 -14 19 -16 69 -16 340 0 305 -1 319 -20 338 -23 23 -77 27
-103 8z"/>
<path d="M1550 2979 c-44 -18 -90 -59 -113 -102 -21 -40 -22 -55 -25 -307 -2
-180 0 -278 8 -306 15 -54 61 -109 113 -137 39 -21 55 -22 237 -22 171 0 199
2 230 19 93 49 123 106 124 234 1 91 0 94 -27 118 -34 29 -66 31 -101 3 -24
-19 -26 -26 -26 -94 0 -57 -4 -78 -19 -96 -18 -23 -26 -24 -161 -27 -153 -4
-180 -1 -204 24 -24 23 -24 488 0 522 15 21 21 22 183 22 144 0 171 -2 182
-16 8 -10 15 -48 17 -93 5 -90 25 -121 79 -121 64 0 91 58 79 174 -9 86 -41
144 -101 181 l-48 30 -201 2 c-118 1 -211 -2 -226 -8z"/>
<path d="M2314 2971 c-51 -23 -89 -71 -104 -131 -7 -30 -10 -152 -8 -366 3
-300 4 -323 22 -343 26 -28 88 -29 116 -1 17 17 20 33 20 125 l0 105 188 0
c106 0 204 5 227 11 52 15 119 82 134 134 14 51 14 288 0 340 -15 56 -54 104
-103 126 -36 16 -67 19 -246 19 -179 0 -210 -3 -246 -19z m434 -153 c8 -8 12
-54 12 -139 0 -103 -3 -131 -16 -144 -14 -13 -42 -15 -197 -13 l-182 3 -3 139
c-2 93 1 143 9 152 15 19 359 20 377 2z"/>
</g>
</svg>
