alpine-baselayout-3.2.0-r23
alpine-baselayout-data-3.2.0-r23
alpine-keys-2.4-r1
apk-tools-2.12.9-r3
bash-5.1.16-r2
brotli-libs-1.0.9-r6
busybox-1.35.0-r17
ca-certificates-20220614-r0
ca-certificates-bundle-20220614-r0
coreutils-9.1-r0
curl-7.83.1-r3
expat-2.4.9-r0
gdbm-1.23-r0
glib-2.72.1-r0
gmp-6.2.1-r2
hiredis-1.0.2-r0
ivykis-0.42.4-r0
jq-1.6-r1
json-c-0.16-r0
libacl-2.3.1-r0
libattr-2.5.1-r1
libblkid-2.38-r1
libbz2-1.0.8-r1
libc-utils-0.7.2-r3
libcrypto1.1-1.1.1q-r0
libcurl-7.83.1-r3
libdbi-0.9.0-r0
libffi-3.4.2-r1
libgcc-11.2.1_git20220219-r2
libintl-0.21-r2
libmount-2.38-r1
libproc-3.3.17-r1
libssl1.1-1.1.1q-r0
libstdc++-11.2.1_git20220219-r2
linux-pam-1.5.2-r0
mpdecimal-2.5.1-r1
musl-1.2.3-r0
musl-utils-1.2.3-r0
ncurses-libs-6.3_p20220521-r0
ncurses-terminfo-base-6.3_p20220521-r0
nghttp2-libs-1.47.0-r0
oniguruma-6.9.8-r0
pcre-8.45-r2
procps-3.3.17-r1
py3-syslog-ng-3.36.1-r0
python3-3.10.5-r0
rabbitmq-c-0.11.0-r3
readline-8.1.2-r0
scanelf-1.3.4-r0
shadow-4.10-r3
skalibs-2.11.2.0-r0
sqlite-libs-3.38.5-r0
ssl_client-1.35.0-r17
syslog-ng-3.36.1-r0
syslog-ng-add-contextual-data-3.36.1-r0
syslog-ng-amqp-3.36.1-r0
syslog-ng-graphite-3.36.1-r0
syslog-ng-http-3.36.1-r0
syslog-ng-json-3.36.1-r0
syslog-ng-map-value-pairs-3.36.1-r0
syslog-ng-redis-3.36.1-r0
syslog-ng-scl-3.36.1-r0
syslog-ng-sql-3.36.1-r0
syslog-ng-stardate-3.36.1-r0
syslog-ng-stomp-3.36.1-r0
syslog-ng-tags-parser-3.36.1-r0
syslog-ng-xml-3.36.1-r0
tzdata-2022c-r0
utmps-libs-0.1.2.0-r0
xz-5.2.5-r1
xz-libs-5.2.5-r1
zlib-1.2.12-r3
