<?xml version="1.0" encoding="UTF-8" standalone="no"?>
<svg
   xmlns:dc="http://purl.org/dc/elements/1.1/"
   xmlns:cc="http://creativecommons.org/ns#"
   xmlns:rdf="http://www.w3.org/1999/02/22-rdf-syntax-ns#"
   xmlns:svg="http://www.w3.org/2000/svg"
   xmlns="http://www.w3.org/2000/svg"
   xmlns:sodipodi="http://sodipodi.sourceforge.net/DTD/sodipodi-0.dtd"
   xmlns:inkscape="http://www.inkscape.org/namespaces/inkscape"
   viewBox="0 0 487.19187 162.11724"
   version="1.1"
   id="svg30"
   sodipodi:docname="Logo.svg"
   width="487.19186"
   height="162.11723"
   inkscape:version="1.0.1 (3bc2e813f5, 2020-09-07)">
  <metadata
     id="metadata34">
    <rdf:RDF>
      <cc:Work
         rdf:about="">
        <dc:format>image/svg+xml</dc:format>
        <dc:type
           rdf:resource="http://purl.org/dc/dcmitype/StillImage" />
        <dc:title></dc:title>
      </cc:Work>
    </rdf:RDF>
  </metadata>
  <sodipodi:namedview
     pagecolor="#ffffff"
     bordercolor="#666666"
     borderopacity="1"
     objecttolerance="10"
     gridtolerance="10"
     guidetolerance="10"
     inkscape:pageopacity="0"
     inkscape:pageshadow="2"
     inkscape:window-width="3387"
     inkscape:window-height="1376"
     id="namedview32"
     showgrid="false"
     inkscape:zoom="1.45028"
     inkscape:cx="177.43401"
     inkscape:cy="111.70774"
     inkscape:window-x="1973"
     inkscape:window-y="27"
     inkscape:window-maximized="1"
     inkscape:current-layer="svg30"
     fit-margin-top="0"
     fit-margin-left="0"
     fit-margin-right="0"
     fit-margin-bottom="0" />
  <defs
     id="defs4">
    <style
       id="style2">.cls-1{fill:#1d1d1b;}.cls-2{fill:#67bd9f;}.cls-3{fill:#fff;}.cls-4{fill:none;stroke:#67bd9f;stroke-miterlimit:10;stroke-width:3px;}</style>
  </defs>
  <g
     id="g918"
     transform="matrix(-0.31663523,0,0,0.31663523,162.11724,0)"
     inkscape:label="Paintbrush">
    <path
       d="M 492.23,19.771 C 479.48,7.022 462.53,0 444.5,0 c -18.029,0 -34.981,7.022 -47.73,19.771 -1.616,1.616 -3.165,3.33 -4.604,5.093 l -85.334,104.538 -84.083,0.001 c -20.032,0 -38.866,7.801 -53.031,21.966 L 159.109,161.977 233.354,321.074 492.23,62.198 Z"
       fill="#3ec3ff"
       id="path900" />
    <path
       d="m 190.918,512 c 0,0 116.681,-116.682 116.681,-116.682 C 307.598,395.318 190.918,512 190.918,512 Z"
       id="path902" />
    <path
       d="m 212.141,299.861 137.884,53.031 10.607,-10.607 c 14.166,-14.165 21.967,-32.999 21.967,-53.032 V 205.168 L 487.14,119.832 c 1.766,-1.442 3.479,-2.99 5.09,-4.602 C 504.978,102.481 512,85.53 512,67.5 512,49.471 504.979,32.52 492.23,19.771 Z"
       fill="#09a1e5"
       id="path904" />
    <path
       d="m 116.683,204.403 95.458,180.31 42.426,-127.279 -95.458,-95.458 -42.427,42.426 z"
       fill="#dff5ff"
       id="path906" />
    <path
       d="m 169.714,342.287 137.884,53.031 42.427,-42.426 -95.458,-95.458 z"
       fill="#bfebff"
       id="path908" />
    <path
       d="m 259.869,347.589 -90.16,26.521 -26.52,90.161 47.729,47.729 116.68,-116.682 z"
       fill="#ff7169"
       id="path910" />
    <path
       d="m 212.14,299.86 -90.16,26.521 -26.521,90.161 47.73,47.729 116.68,-116.682 z"
       fill="#ff9259"
       id="path912" />
    <path
       d="m 164.411,252.131 -90.16,26.521 -26.521,90.16 47.73,47.73 116.68,-116.682 z"
       fill="#ffb24a"
       id="path914" />
    <path
       d="m -0.3,252.857 h 165.012 v 67.5 H -0.3 Z"
       fill="#ffd23b"
       transform="matrix(0.707,-0.707,0.707,0.707,-178.585,142.075)"
       id="path916" />
  </g>
  <g
     aria-label="Simple"
     id="text835"
     style="font-style:normal;font-variant:normal;font-weight:normal;font-stretch:normal;font-size:96px;line-height:1.25;font-family:'Ubuntu Condensed';-inkscape-font-specification:'Ubuntu Condensed, Normal';font-variant-ligatures:normal;font-variant-caps:normal;font-variant-numeric:normal;font-variant-east-asian:normal;fill:#0c006c;fill-opacity:1;stroke:none;stroke-width:0.999999"
     inkscape:label="Text">
    <path
       d="m 182.38715,133.57086 q 5.184,0 7.968,-2.88 2.88,-2.88 2.88,-7.776 0,-2.592 -0.864,-4.608 -0.864,-2.016 -2.304,-3.648 -1.344,-1.632 -3.168,-2.976 -1.824,-1.344 -3.744,-2.688 -2.208,-1.536 -4.608,-3.264 -2.4,-1.728 -4.416,-4.032 -1.92,-2.304002 -3.168,-5.376002 -1.248,-3.072 -1.248,-7.2 0,-4.032 1.344,-7.296 1.44,-3.264 3.84,-5.568 2.496,-2.304 5.856,-3.552 3.456,-1.248 7.392,-1.248 3.84,0 7.104,0.96 3.264,0.96 5.472,2.304 l -2.688,6.816 q -2.016,-1.344 -4.416,-2.016 -2.304,-0.768 -4.896,-0.768 -4.704,0 -7.584,2.592 -2.784,2.496 -2.784,7.392 0,2.688 0.864,4.704 0.96,2.016 2.4,3.648 1.536,1.632 3.456,2.976002 2.016,1.344 4.224,2.784 2.208,1.44 4.512,3.168 2.304,1.728 4.128,4.032 1.92,2.208 3.072,5.28 1.248,2.976 1.248,7.104 0,3.744 -1.152,7.104 -1.152,3.36 -3.648,5.952 -2.4,2.496 -6.144,4.032 -3.648,1.44 -8.64,1.44 -4.608,0 -8.064,-1.056 -3.456,-1.056 -6.144,-2.784 l 2.688,-6.912 q 2.496,1.536 5.088,2.496 2.688,0.864 6.144,0.864 z"
       style="font-style:normal;font-variant:normal;font-weight:normal;font-stretch:normal;font-size:96px;font-family:'Ubuntu Condensed';-inkscape-font-specification:'Ubuntu Condensed, Normal';font-variant-ligatures:normal;font-variant-caps:normal;font-variant-numeric:normal;font-variant-east-asian:normal;fill:#0c006c;fill-opacity:1;stroke-width:0.999999"
       id="path927" />
    <path
       d="m 220.21112,139.52286 h -8.256 V 89.122858 h 8.256 z m -4.128,-59.328002 q -2.208,0 -3.84,-1.44 -1.536,-1.536 -1.536,-4.032 0,-2.496 1.536,-3.936 1.632,-1.536 3.84,-1.536 2.208,0 3.744,1.536 1.632,1.44 1.632,3.936 0,2.496 -1.632,4.032 -1.536,1.44 -3.744,1.44 z"
       style="font-style:normal;font-variant:normal;font-weight:normal;font-stretch:normal;font-size:96px;font-family:'Ubuntu Condensed';-inkscape-font-specification:'Ubuntu Condensed, Normal';font-variant-ligatures:normal;font-variant-caps:normal;font-variant-numeric:normal;font-variant-east-asian:normal;fill:#0c006c;fill-opacity:1;stroke-width:0.999999"
       id="path929" />
    <path
       d="m 235.18699,90.562858 q 3.36,-1.056 7.296,-1.728 3.936,-0.768 7.2,-0.768 3.36,0 6.048,0.864 2.784,0.864 4.896,2.88 2.496,-1.632 5.376,-2.688 2.88,-1.056 6.336,-1.056 3.456,0 6.24,1.056 2.88,0.96 4.896,3.36 2.016,2.4 3.168,6.528 1.152,4.032002 1.152,10.080002 v 30.432 h -8.256 v -29.76 q 0,-7.488 -1.728,-10.944002 -1.728,-3.456 -6.528,-3.456 -1.824,0 -3.744,0.672 -1.824,0.672 -3.456,1.824 0.768,2.208002 1.152,4.992002 0.384,2.784 0.384,6.24 v 30.432 h -8.256 v -29.76 q 0,-7.488 -1.728,-10.944002 -1.728,-3.456 -6.528,-3.456 -2.496,0 -5.664,0.96 v 43.200002 h -8.256 z"
       style="font-style:normal;font-variant:normal;font-weight:normal;font-stretch:normal;font-size:96px;font-family:'Ubuntu Condensed';-inkscape-font-specification:'Ubuntu Condensed, Normal';font-variant-ligatures:normal;font-variant-caps:normal;font-variant-numeric:normal;font-variant-east-asian:normal;fill:#0c006c;fill-opacity:1;stroke-width:0.999999"
       id="path931" />
    <path
       d="m 310.35499,131.93886 q 2.784,1.536 5.952,1.536 2.4,0 4.224,-0.96 1.824,-0.96 3.072,-3.168 1.344,-2.208 2.016,-5.856 0.672,-3.648 0.672,-9.024 0,-10.368 -2.688,-14.784002 -2.592,-4.512 -8.352,-4.512 -1.056,0 -2.304,0.192 -1.248,0.096 -2.592,0.48 z m 0,25.344 h -8.256 V 90.466858 q 2.688,-1.152 6.048,-1.824 3.456,-0.768 7.008,-0.768 5.28,0 9.024,1.824 3.84,1.824 6.144,5.28 2.4,3.36 3.456,8.352002 1.152,4.896 1.152,11.232 0,12.768 -4.128,19.488 -4.032,6.72 -13.248,6.72 -2.208,0 -3.936,-0.48 -1.728,-0.384 -3.264,-1.152 z"
       style="font-style:normal;font-variant:normal;font-weight:normal;font-stretch:normal;font-size:96px;font-family:'Ubuntu Condensed';-inkscape-font-specification:'Ubuntu Condensed, Normal';font-variant-ligatures:normal;font-variant-caps:normal;font-variant-numeric:normal;font-variant-east-asian:normal;fill:#0c006c;fill-opacity:1;stroke-width:0.999999"
       id="path933" />
    <path
       d="m 360.08289,140.48286 q -7.104,-0.192 -10.176,-3.456 -3.072,-3.36 -3.072,-10.56 V 66.466858 l 8.256,-1.44 v 61.632002 q 0,3.36 1.344,4.896 1.344,1.44 4.704,2.016 z"
       style="font-style:normal;font-variant:normal;font-weight:normal;font-stretch:normal;font-size:96px;font-family:'Ubuntu Condensed';-inkscape-font-specification:'Ubuntu Condensed, Normal';font-variant-ligatures:normal;font-variant-caps:normal;font-variant-numeric:normal;font-variant-east-asian:normal;fill:#0c006c;fill-opacity:1;stroke-width:0.999999"
       id="path935" />
    <path
       d="m 376.01871,116.77086 q 0.096,3.648 0.672,6.72 0.576,2.976 1.824,5.28 1.344,2.208 3.456,3.456 2.208,1.248 5.568,1.248 2.784,0 5.088,-0.768 2.4,-0.864 3.456,-1.44 l 1.536,6.624 q -1.248,0.864 -4.224,1.824 -2.88,1.056 -6.912,1.056 -5.28,0 -8.928,-1.92 -3.552,-1.92 -5.856,-5.376 -2.208,-3.456 -3.168,-8.256 -0.96,-4.8 -0.96,-10.56 0,-13.92 4.608,-20.352002 4.608,-6.432 12.192,-6.432 8.544,0 12.096,6.432 3.552,6.432002 3.552,18.048002 0,1.056 0,2.208 0,1.056 -0.096,2.208 z m 8.352,-21.888002 q -4.128,0 -6.048,4.128 -1.824,4.128002 -2.208,11.040002 h 15.264 q 0,-7.008 -1.44,-11.040002 -1.44,-4.128 -5.568,-4.128 z"
       style="font-style:normal;font-variant:normal;font-weight:normal;font-stretch:normal;font-size:96px;font-family:'Ubuntu Condensed';-inkscape-font-specification:'Ubuntu Condensed, Normal';font-variant-ligatures:normal;font-variant-caps:normal;font-variant-numeric:normal;font-variant-east-asian:normal;fill:#0c006c;fill-opacity:1;stroke-width:0.999999"
       id="path937" />
  </g>
  <g
     aria-label="FX"
     id="text835-8"
     style="font-style:normal;font-variant:normal;font-weight:normal;font-stretch:normal;font-size:96px;line-height:1.25;font-family:'Ubuntu Condensed';-inkscape-font-specification:'Ubuntu Condensed, Normal';font-variant-ligatures:normal;font-variant-caps:normal;font-variant-numeric:normal;font-variant-east-asian:normal;fill:#dd0b00;fill-opacity:1;stroke:none;stroke-width:1;stroke-miterlimit:4;stroke-dasharray:none"
     inkscape:label="Text">
    <path
       d="M 409.91214,140.90547 V 74.377472 h 29.856 v 7.392 h -21.216 v 20.927998 h 18.816 v 7.2 h -18.816 v 31.008 z"
       style="font-style:normal;font-variant:normal;font-weight:normal;font-stretch:normal;font-size:96px;font-family:'Ubuntu Condensed';-inkscape-font-specification:'Ubuntu Condensed, Normal';font-variant-ligatures:normal;font-variant-caps:normal;font-variant-numeric:normal;font-variant-east-asian:normal;fill:#dd0b00;fill-opacity:1;stroke-width:1;stroke-miterlimit:4;stroke-dasharray:none"
       id="path940" />
    <path
       d="m 466.16786,98.761472 11.424,-24.384 h 8.64 l -15.168,30.911998 q 2.016,4.32 4.224,9.024 2.304,4.608 4.416,9.312 2.208,4.608 4.128,9.024 1.92,4.416 3.36,8.256 h -8.544 q -1.056,-2.88 -2.496,-6.24 -1.344,-3.456 -3.072,-7.008 -1.632,-3.552 -3.456,-7.2 -1.728,-3.744 -3.456,-7.2 -1.728,3.456 -3.552,7.2 -1.824,3.648 -3.456,7.2 -1.632,3.552 -3.072,7.008 -1.344,3.36 -2.304,6.24 h -8.352 q 1.344,-3.744 3.264,-8.064 1.92,-4.32 4.032,-8.832 2.112,-4.608 4.224,-9.216 2.208,-4.608 4.224,-8.832 l -15.36,-31.583998 h 8.832 z"
       style="font-style:normal;font-variant:normal;font-weight:normal;font-stretch:normal;font-size:96px;font-family:'Ubuntu Condensed';-inkscape-font-specification:'Ubuntu Condensed, Normal';font-variant-ligatures:normal;font-variant-caps:normal;font-variant-numeric:normal;font-variant-east-asian:normal;fill:#dd0b00;fill-opacity:1;stroke-width:1;stroke-miterlimit:4;stroke-dasharray:none"
       id="path942" />
  </g>
</svg>
