<svg xmlns="http://www.w3.org/2000/svg" width="50" height="21.739" viewBox="0 0 50 21.739">
  <g id="imdb" transform="translate(0 -138.667)">
    <path id="Path_21" data-name="Path 21" d="M5.435,138.667h39.13A5.435,5.435,0,0,1,50,144.1v10.87a5.435,5.435,0,0,1-5.435,5.435H5.435A5.435,5.435,0,0,1,0,154.971V144.1A5.435,5.435,0,0,1,5.435,138.667Z" fill="#ffc107"/>
    <g id="Group_28" data-name="Group 28" transform="translate(8.696 143.015)">
      <path id="Path_22" data-name="Path 22" d="M86.42,194.377a1.087,1.087,0,0,1-1.087-1.087V182.42a1.087,1.087,0,1,1,2.174,0v10.87A1.087,1.087,0,0,1,86.42,194.377Z" transform="translate(-85.333 -181.333)" fill="#121212"/>
      <path id="Path_23" data-name="Path 23" d="M137.783,194.377a1.087,1.087,0,0,1-1.087-1.087v-9.783h-.2l-2,10a1.087,1.087,0,0,1-2.13,0l-2-10h-.2v9.783a1.087,1.087,0,1,1-2.174,0V182.42a1.087,1.087,0,0,1,1.087-1.087h2.174a1.087,1.087,0,0,1,1.065.87l1.109,5.543,1.109-5.543a1.087,1.087,0,0,1,1.065-.87h2.174a1.087,1.087,0,0,1,1.087,1.087v10.87A1.087,1.087,0,0,1,137.783,194.377Z" transform="translate(-123.652 -181.333)" fill="#121212"/>
      <path id="Path_24" data-name="Path 24" d="M259.261,194.377h-2.174A1.087,1.087,0,0,1,256,193.29V182.42a1.087,1.087,0,0,1,1.087-1.087h2.174a3.261,3.261,0,0,1,3.261,3.261v6.522A3.261,3.261,0,0,1,259.261,194.377Zm-1.087-2.174h1.087a1.087,1.087,0,0,0,1.087-1.087v-6.522a1.087,1.087,0,0,0-1.087-1.087h-1.087Z" transform="translate(-238.609 -181.333)" fill="#121212"/>
      <path id="Path_25" data-name="Path 25" d="M342.42,194.377a1.087,1.087,0,0,1-1.087-1.087V182.42a1.087,1.087,0,1,1,2.174,0v10.87A1.087,1.087,0,0,1,342.42,194.377Z" transform="translate(-315.246 -181.333)" fill="#121212"/>
      <path id="Path_26" data-name="Path 26" d="M344.594,213.536a3.261,3.261,0,0,1-3.261-3.261v-4.348a3.261,3.261,0,0,1,6.522,0v4.348A3.261,3.261,0,0,1,344.594,213.536Zm0-8.7a1.087,1.087,0,0,0-1.087,1.087v4.348a1.087,1.087,0,1,0,2.174,0v-4.348A1.087,1.087,0,0,0,344.594,204.84Z" transform="translate(-315.246 -200.492)" fill="#121212"/>
    </g>
  </g>
</svg>
