{
    "defaultSeverity": "error",
    "extends": [
        "tslint:recommended"
    ],
    "linterOptions": {
        "exclude": [
            "**/*.json"
        ]
    },
    "jsRules": {},
    "rules": {
        "no-console": [true, "log", "debug"],
        "interface-name": [true, "never-prefix"],
        "object-literal-sort-keys": false
    },
    "rulesDirectory": []
}
