EESchema Schematic File Version 4
EELAYER 30 0
EELAYER END
$Descr A4 11693 8268
encoding utf-8
Sheet 1 4
Title "Main"
Date ""
Rev "v0.1"
Comp "Benou"
Comment1 ""
Comment2 ""
Comment3 ""
Comment4 ""
$EndDescr
$Comp
L MCU_ST_STM32L4:STM32L432KCUx U2
U 1 1 618D31FE
P 5000 3500
F 0 "U2" H 5350 4550 50  0000 C CNN
F 1 "STM32L432KCUx" H 5600 4450 50  0000 C CNN
F 2 "Package_DFN_QFN:QFN-32-1EP_5x5mm_P0.5mm_EP3.45x3.45mm" H 4600 2600 50  0001 R CNN
F 3 "http://www.st.com/st-web-ui/static/active/en/resource/technical/document/datasheet/DM00257205.pdf" H 5000 3500 50  0001 C CNN
	1    5000 3500
	1    0    0    -1  
$EndComp
$Comp
L Connector_Generic:Conn_02x03_Odd_Even J1
U 1 1 618F0C2A
P 1600 1400
F 0 "J1" H 1650 1717 50  0000 C CNN
F 1 "Conn_02x03_Odd_Even" H 1650 1626 50  0001 C CNN
F 2 "Connector:Tag-Connect_TC2030-IDC-NL_2x03_P1.27mm_Vertical" H 1600 1400 50  0001 C CNN
F 3 "~" H 1600 1400 50  0001 C CNN
	1    1600 1400
	1    0    0    -1  
$EndComp
$Sheet
S 9500 1500 1000 1000
U 618FB7C9
F0 "RF" 50
F1 "RF.sch" 50
F2 "DIO1" I L 9500 1550 50 
F3 "DIO2" I L 9500 1650 50 
F4 "DIO3" I L 9500 1750 50 
F5 "BUSY" I L 9500 1850 50 
F6 "NRESET" I L 9500 1950 50 
F7 "MISO" I L 9500 2150 50 
F8 "MOSI" I L 9500 2250 50 
F9 "SCLK" I L 9500 2350 50 
F10 "NSS" I L 9500 2450 50 
$EndSheet
$Sheet
S 9500 4500 1000 1000
U 618FB971
F0 "Power" 50
F1 "Power.sch" 50
$EndSheet
$Sheet
S 9500 3000 1000 1000
U 618FBB16
F0 "IMU" 50
F1 "IMU.sch" 50
F2 "MISO" I L 9500 3050 50 
F3 "MOSI" I L 9500 3150 50 
F4 "SCLK" I L 9500 3250 50 
F5 "NSS" I L 9500 3350 50 
F6 "SCL" I L 9500 3750 50 
F7 "SDA" I L 9500 3850 50 
F8 "INT_GYR" I L 9500 3450 50 
F9 "INT_MAG" I L 9500 3950 50 
$EndSheet
$Comp
L Connector_Generic:Conn_01x01 J7
U 1 1 61909AC9
P 1000 7000
F 0 "J7" H 918 6867 50  0000 C CNN
F 1 "Conn_01x01" H 918 6866 50  0001 C CNN
F 2 "Connector_Wire:SolderWirePad_1x01_SMD_1x2mm" H 1000 7000 50  0001 C CNN
F 3 "~" H 1000 7000 50  0001 C CNN
	1    1000 7000
	-1   0    0    1   
$EndComp
$Comp
L Connector_Generic:Conn_01x01 J6
U 1 1 6190B4C9
P 1000 6750
F 0 "J6" H 918 6617 50  0000 C CNN
F 1 "Conn_01x01" H 918 6616 50  0001 C CNN
F 2 "Connector_Wire:SolderWirePad_1x01_SMD_1x2mm" H 1000 6750 50  0001 C CNN
F 3 "~" H 1000 6750 50  0001 C CNN
	1    1000 6750
	-1   0    0    1   
$EndComp
$Comp
L Connector_Generic:Conn_01x01 J5
U 1 1 6190B63A
P 1000 6500
F 0 "J5" H 918 6367 50  0000 C CNN
F 1 "Conn_01x01" H 918 6366 50  0001 C CNN
F 2 "Connector_Wire:SolderWirePad_1x01_SMD_1x2mm" H 1000 6500 50  0001 C CNN
F 3 "~" H 1000 6500 50  0001 C CNN
	1    1000 6500
	-1   0    0    1   
$EndComp
$Comp
L Connector_Generic:Conn_01x01 J4
U 1 1 6190B70D
P 1000 6250
F 0 "J4" H 918 6117 50  0000 C CNN
F 1 "Conn_01x01" H 918 6116 50  0001 C CNN
F 2 "Connector_Wire:SolderWirePad_1x01_SMD_1x2mm" H 1000 6250 50  0001 C CNN
F 3 "~" H 1000 6250 50  0001 C CNN
	1    1000 6250
	-1   0    0    1   
$EndComp
$Comp
L Connector_Generic:Conn_01x01 J3
U 1 1 6190B853
P 1000 6000
F 0 "J3" H 918 5867 50  0000 C CNN
F 1 "Conn_01x01" H 918 5866 50  0001 C CNN
F 2 "Connector_Wire:SolderWirePad_1x01_SMD_1x2mm" H 1000 6000 50  0001 C CNN
F 3 "~" H 1000 6000 50  0001 C CNN
	1    1000 6000
	-1   0    0    1   
$EndComp
$Comp
L Connector_Generic:Conn_01x01 J2
U 1 1 6190B999
P 1000 5750
F 0 "J2" H 918 5617 50  0000 C CNN
F 1 "Conn_01x01" H 918 5616 50  0001 C CNN
F 2 "Connector_Wire:SolderWirePad_1x01_SMD_1x2mm" H 1000 5750 50  0001 C CNN
F 3 "~" H 1000 5750 50  0001 C CNN
	1    1000 5750
	-1   0    0    1   
$EndComp
$Comp
L power:VCC #PWR0101
U 1 1 6190BC7B
P 4900 2600
F 0 "#PWR0101" H 4900 2450 50  0001 C CNN
F 1 "VCC" H 4915 2773 50  0000 C CNN
F 2 "" H 4900 2600 50  0001 C CNN
F 3 "" H 4900 2600 50  0001 C CNN
	1    4900 2600
	1    0    0    -1  
$EndComp
$Comp
L power:+5V #PWR0102
U 1 1 6190C8A1
P 1200 5750
F 0 "#PWR0102" H 1200 5600 50  0001 C CNN
F 1 "+5V" H 1215 5923 50  0000 C CNN
F 2 "" H 1200 5750 50  0001 C CNN
F 3 "" H 1200 5750 50  0001 C CNN
	1    1200 5750
	1    0    0    -1  
$EndComp
$Comp
L power:GND #PWR0103
U 1 1 6190DBBD
P 4900 4500
F 0 "#PWR0103" H 4900 4250 50  0001 C CNN
F 1 "GND" H 4905 4327 50  0000 C CNN
F 2 "" H 4900 4500 50  0001 C CNN
F 3 "" H 4900 4500 50  0001 C CNN
	1    4900 4500
	1    0    0    -1  
$EndComp
Text Label 9000 2150 0    50   ~ 0
MISO_SX
Text Label 9000 2250 0    50   ~ 0
MOSI_SX
Text Label 9000 2350 0    50   ~ 0
SCLK_SX
Text Label 9000 2450 0    50   ~ 0
NSS_SX
Text Label 9000 1550 0    50   ~ 0
DIO1_SX
Text Label 9000 1650 0    50   ~ 0
DIO2_SX
Text Label 9000 1750 0    50   ~ 0
DIO3_SX
Text Label 9000 1850 0    50   ~ 0
BUSY_SX
Text Label 9000 1950 0    50   ~ 0
NRESET_SX
Wire Wire Line
	9000 1550 9500 1550
Wire Wire Line
	9000 1650 9500 1650
Wire Wire Line
	9000 1750 9500 1750
Wire Wire Line
	9000 1850 9500 1850
Wire Wire Line
	9000 1950 9500 1950
Wire Wire Line
	9000 2150 9500 2150
Wire Wire Line
	9000 2250 9500 2250
Wire Wire Line
	9000 2350 9500 2350
Wire Wire Line
	9000 2450 9500 2450
Text Label 9000 3750 0    50   ~ 0
SCL_MMC
Text Label 9000 3850 0    50   ~ 0
SDA_MMC
Text Label 9000 3950 0    50   ~ 0
INT_MMC
Text Label 9000 3050 0    50   ~ 0
MISO_ICM
Text Label 9000 3150 0    50   ~ 0
MOSI_ICM
Text Label 9000 3250 0    50   ~ 0
SCLK_ICM
Text Label 9000 3350 0    50   ~ 0
NSS_ICM
Text Label 9000 3450 0    50   ~ 0
INT_ICM
Wire Wire Line
	9000 3050 9500 3050
Wire Wire Line
	9000 3150 9500 3150
Wire Wire Line
	9000 3250 9500 3250
Wire Wire Line
	9000 3350 9500 3350
Wire Wire Line
	9000 3450 9500 3450
Wire Wire Line
	9000 3750 9500 3750
Wire Wire Line
	9000 3850 9500 3850
Wire Wire Line
	9000 3950 9500 3950
Text Label 5650 2800 0    50   ~ 0
SYS_WKUP
Text Label 5650 2900 0    50   ~ 0
DIO1_SX
Text Label 5650 3000 0    50   ~ 0
DIO2_SX
Text Label 5650 3100 0    50   ~ 0
DIO3_SX
Wire Wire Line
	5500 2900 6000 2900
Wire Wire Line
	5500 3000 6000 3000
Wire Wire Line
	5500 3100 6000 3100
Text Label 5650 3200 0    50   ~ 0
BUSY_SX
Wire Wire Line
	5500 3200 6000 3200
Wire Wire Line
	5500 2800 6000 2800
Text Label 5650 3300 0    50   ~ 0
SCLK_SX
Text Label 5650 3400 0    50   ~ 0
MISO_SX
Text Label 5650 3500 0    50   ~ 0
MOSI_SX
Text Label 4050 3700 0    50   ~ 0
NSS_SX
Text Label 4050 3800 0    50   ~ 0
BATT_MON
Text Label 5650 3600 0    50   ~ 0
PWM1
Text Label 5650 3900 0    50   ~ 0
PWM2
Text Label 5650 3700 0    50   ~ 0
TX
Text Label 5650 3800 0    50   ~ 0
RX
Text Label 5650 4000 0    50   ~ 0
PA12
Text Label 5650 4100 0    50   ~ 0
SWDIO
Text Label 5650 4200 0    50   ~ 0
SWCLK
Text Label 5650 4300 0    50   ~ 0
NSS_ICM
Text Label 4050 3900 0    50   ~ 0
SCLK_ICM
Text Label 4050 4000 0    50   ~ 0
MISO_ICM
Text Label 4050 4100 0    50   ~ 0
MOSI_ICM
Text Label 4050 4200 0    50   ~ 0
SCL_MMC
Text Label 4050 4300 0    50   ~ 0
SDA_MMC
Wire Wire Line
	4050 3700 4500 3700
Wire Wire Line
	4050 3800 4500 3800
Wire Wire Line
	4050 3900 4500 3900
Wire Wire Line
	4050 4000 4500 4000
Wire Wire Line
	4050 4100 4500 4100
Wire Wire Line
	4050 4200 4500 4200
Wire Wire Line
	4050 4300 4500 4300
Wire Wire Line
	5500 3400 6000 3400
Wire Wire Line
	5500 3500 6000 3500
Wire Wire Line
	5500 3600 6000 3600
Wire Wire Line
	5500 3700 6000 3700
Wire Wire Line
	5500 3300 6000 3300
Wire Wire Line
	5500 3900 6000 3900
Wire Wire Line
	5500 4000 6000 4000
Wire Wire Line
	5500 4100 6000 4100
Wire Wire Line
	5500 4200 6000 4200
Wire Wire Line
	5500 3800 6000 3800
Wire Wire Line
	5500 4300 6000 4300
Text Label 4050 3200 0    50   ~ 0
BOOT0
Text Label 4050 3400 0    50   ~ 0
PC14
Text Label 4050 3500 0    50   ~ 0
PC15
Wire Wire Line
	4050 3500 4500 3500
Wire Wire Line
	4050 3400 4500 3400
Wire Wire Line
	4050 3200 4500 3200
Text Label 4050 2800 0    50   ~ 0
NRST
Wire Wire Line
	4050 2800 4500 2800
Text Label 1350 6500 0    50   ~ 0
TX
Text Label 1350 6750 0    50   ~ 0
RX
Text Label 1350 6250 0    50   ~ 0
BOOT0
Text Label 1350 6000 0    50   ~ 0
NRST
Wire Wire Line
	1200 6750 1600 6750
Wire Wire Line
	1200 6500 1600 6500
Wire Wire Line
	1200 6250 1600 6250
Wire Wire Line
	1200 6000 1600 6000
Text Label 1900 1300 0    50   ~ 0
SWDIO
Text Label 1900 1400 0    50   ~ 0
SWCLK
Text Label 1900 1500 0    50   ~ 0
NRST
$Comp
L power:VCC #PWR0104
U 1 1 6193F763
P 1400 1300
F 0 "#PWR0104" H 1400 1150 50  0001 C CNN
F 1 "VCC" H 1415 1473 50  0000 C CNN
F 2 "" H 1400 1300 50  0001 C CNN
F 3 "" H 1400 1300 50  0001 C CNN
	1    1400 1300
	1    0    0    -1  
$EndComp
$Comp
L power:GND #PWR0105
U 1 1 6193FCDC
P 1400 1500
F 0 "#PWR0105" H 1400 1250 50  0001 C CNN
F 1 "GND" H 1405 1327 50  0000 C CNN
F 2 "" H 1400 1500 50  0001 C CNN
F 3 "" H 1400 1500 50  0001 C CNN
	1    1400 1500
	1    0    0    -1  
$EndComp
Wire Wire Line
	4900 4500 5000 4500
Connection ~ 4900 4500
Connection ~ 5000 4500
Wire Wire Line
	5000 4500 5100 4500
Wire Wire Line
	4900 2600 5000 2600
Connection ~ 4900 2600
Connection ~ 5000 2600
Wire Wire Line
	5000 2600 5100 2600
$Comp
L Device:C_Small C1
U 1 1 619499CE
P 5200 1900
F 0 "C1" H 5292 1946 50  0000 L CNN
F 1 "1uF" H 5292 1855 50  0000 L CNN
F 2 "Capacitor_SMD:C_0603_1608Metric" H 5200 1900 50  0001 C CNN
F 3 "~" H 5200 1900 50  0001 C CNN
	1    5200 1900
	1    0    0    -1  
$EndComp
$Comp
L Device:C_Small C2
U 1 1 6194A220
P 5550 1900
F 0 "C2" H 5642 1946 50  0000 L CNN
F 1 "100nF" H 5642 1855 50  0000 L CNN
F 2 "Capacitor_SMD:C_0402_1005Metric" H 5550 1900 50  0001 C CNN
F 3 "~" H 5550 1900 50  0001 C CNN
	1    5550 1900
	1    0    0    -1  
$EndComp
$Comp
L Device:C_Small C3
U 1 1 6194C103
P 5950 1900
F 0 "C3" H 6042 1946 50  0000 L CNN
F 1 "100nF" H 6042 1855 50  0000 L CNN
F 2 "Capacitor_SMD:C_0402_1005Metric" H 5950 1900 50  0001 C CNN
F 3 "~" H 5950 1900 50  0001 C CNN
	1    5950 1900
	1    0    0    -1  
$EndComp
$Comp
L Device:C_Small C4
U 1 1 6194DD99
P 6350 1900
F 0 "C4" H 6442 1946 50  0000 L CNN
F 1 "100nF" H 6442 1855 50  0000 L CNN
F 2 "Capacitor_SMD:C_0402_1005Metric" H 6350 1900 50  0001 C CNN
F 3 "~" H 6350 1900 50  0001 C CNN
	1    6350 1900
	1    0    0    -1  
$EndComp
$Comp
L power:VCC #PWR0106
U 1 1 619547A1
P 5200 1800
F 0 "#PWR0106" H 5200 1650 50  0001 C CNN
F 1 "VCC" H 5215 1973 50  0000 C CNN
F 2 "" H 5200 1800 50  0001 C CNN
F 3 "" H 5200 1800 50  0001 C CNN
	1    5200 1800
	1    0    0    -1  
$EndComp
$Comp
L power:GND #PWR0107
U 1 1 61954AD9
P 5200 2000
F 0 "#PWR0107" H 5200 1750 50  0001 C CNN
F 1 "GND" H 5205 1827 50  0000 C CNN
F 2 "" H 5200 2000 50  0001 C CNN
F 3 "" H 5200 2000 50  0001 C CNN
	1    5200 2000
	1    0    0    -1  
$EndComp
Wire Wire Line
	5200 1800 5550 1800
Connection ~ 5200 1800
Wire Wire Line
	5200 2000 5550 2000
Connection ~ 5200 2000
$Comp
L power:GND #PWR0108
U 1 1 61958C83
P 1200 7000
F 0 "#PWR0108" H 1200 6750 50  0001 C CNN
F 1 "GND" H 1205 6827 50  0000 C CNN
F 2 "" H 1200 7000 50  0001 C CNN
F 3 "" H 1200 7000 50  0001 C CNN
	1    1200 7000
	1    0    0    -1  
$EndComp
Wire Wire Line
	5950 1800 6350 1800
Connection ~ 5950 1800
Wire Wire Line
	5950 2000 6350 2000
Connection ~ 5950 2000
Wire Wire Line
	5550 2000 5950 2000
Connection ~ 5550 2000
Wire Wire Line
	5550 1800 5950 1800
Connection ~ 5550 1800
$EndSCHEMATC
