EESchema Schematic File Version 4
EELAYER 30 0
EELAYER END
$Descr A4 11693 8268
encoding utf-8
Sheet 4 4
Title "IMU"
Date ""
Rev "v0.1"
Comp "Benou"
Comment1 ""
Comment2 ""
Comment3 ""
Comment4 ""
$EndDescr
$Comp
L Sensor_Magnetic:MMC5883MA U7
U 1 1 618FDD67
P 7900 2850
F 0 "U7" H 8450 3250 50  0000 L CNN
F 1 "MMC5883MA" H 8450 3150 50  0000 L CNN
F 2 "Package_LGA:LGA-16_3x3mm_P0.5mm" H 7900 2150 50  0001 C CNN
F 3 "http://www.memsic.com/userfiles/files/DataSheets/Magnetic-Sensors-Datasheets/MMC5883MA-RevC.pdf" H 7800 2850 50  0001 C CNN
	1    7900 2850
	1    0    0    -1  
$EndComp
$Comp
L benou-sensors:ICM-20601 U?
U 1 1 618FDD6D
P 3600 2750
AR Path="/618FDD6D" Ref="U?"  Part="1" 
AR Path="/618FBB16/618FDD6D" Ref="U8"  Part="1" 
F 0 "U8" H 4200 3300 50  0000 C CNN
F 1 "ICM-20601" H 4350 3200 50  0000 C CNN
F 2 "Package_LGA:LGA-16_3x3mm_P0.5mm_LayoutBorder3x5y" H 3600 3000 50  0001 C CNN
F 3 "https://3cfeqx1hf82y3xcoull08ihx-wpengine.netdna-ssl.com/wp-content/uploads/2021/10/DS-000191-ICM-20601-TYP-v1.3.pdf" H 3650 3700 50  0001 C CNN
	1    3600 2750
	1    0    0    -1  
$EndComp
Text Label 2700 2650 0    50   ~ 0
MISO_ICM
Text Label 2700 2750 0    50   ~ 0
MOSI_ICM
Text Label 2700 2850 0    50   ~ 0
SCLK_ICM
Text Label 2700 2950 0    50   ~ 0
NSS_ICM
Text Label 4200 2650 0    50   ~ 0
INT_ICM
Text Label 7100 2750 0    50   ~ 0
SCL_MMC
Text Label 7100 2850 0    50   ~ 0
SDA_MMC
Text Label 7100 2950 0    50   ~ 0
INT_MMC
Text Label 2000 6550 0    50   ~ 0
SCL_MMC
Text Label 2000 6650 0    50   ~ 0
SDA_MMC
Text Label 2000 6750 0    50   ~ 0
INT_MMC
Text Label 2000 5550 0    50   ~ 0
MISO_ICM
Text Label 2000 5650 0    50   ~ 0
MOSI_ICM
Text Label 2000 5750 0    50   ~ 0
SCLK_ICM
Text Label 2000 5850 0    50   ~ 0
NSS_ICM
Text Label 2000 5950 0    50   ~ 0
INT_ICM
Text HLabel 1800 5550 0    50   Input ~ 0
MISO
Text HLabel 1800 5650 0    50   Input ~ 0
MOSI
Text HLabel 1800 5750 0    50   Input ~ 0
SCLK
Text HLabel 1800 5850 0    50   Input ~ 0
NSS
Text HLabel 1800 5950 0    50   Input ~ 0
INT_GYR
Text HLabel 1800 6550 0    50   Input ~ 0
SCL
Text HLabel 1800 6650 0    50   Input ~ 0
SDA
Text HLabel 1800 6750 0    50   Input ~ 0
INT_MAG
Wire Wire Line
	1800 5550 2350 5550
Wire Wire Line
	1800 5650 2350 5650
Wire Wire Line
	1800 5750 2350 5750
Wire Wire Line
	1800 5850 2350 5850
Wire Wire Line
	1800 5950 2350 5950
Wire Wire Line
	1800 6550 2350 6550
Wire Wire Line
	1800 6650 2350 6650
Wire Wire Line
	1800 6750 2350 6750
Wire Wire Line
	2700 2650 3100 2650
Wire Wire Line
	2700 2750 3100 2750
Wire Wire Line
	2700 2850 3100 2850
Wire Wire Line
	2700 2950 3100 2950
Wire Wire Line
	4100 2650 4500 2650
Wire Wire Line
	7100 2950 7500 2950
$Comp
L Device:C_Small C?
U 1 1 6195FD6F
P 3900 1650
AR Path="/6195FD6F" Ref="C?"  Part="1" 
AR Path="/618FBB16/6195FD6F" Ref="C16"  Part="1" 
F 0 "C16" H 3992 1696 50  0000 L CNN
F 1 "2.2uF" H 3992 1605 50  0000 L CNN
F 2 "Capacitor_SMD:C_0603_1608Metric" H 3900 1650 50  0001 C CNN
F 3 "~" H 3900 1650 50  0001 C CNN
	1    3900 1650
	1    0    0    -1  
$EndComp
$Comp
L Device:C_Small C?
U 1 1 6195FD75
P 4300 1650
AR Path="/6195FD75" Ref="C?"  Part="1" 
AR Path="/618FBB16/6195FD75" Ref="C18"  Part="1" 
F 0 "C18" H 4392 1696 50  0000 L CNN
F 1 "100nF" H 4392 1605 50  0000 L CNN
F 2 "Capacitor_SMD:C_0402_1005Metric" H 4300 1650 50  0001 C CNN
F 3 "~" H 4300 1650 50  0001 C CNN
	1    4300 1650
	1    0    0    -1  
$EndComp
$Comp
L Device:C_Small C?
U 1 1 6195FD7B
P 4700 1650
AR Path="/6195FD7B" Ref="C?"  Part="1" 
AR Path="/618FBB16/6195FD7B" Ref="C19"  Part="1" 
F 0 "C19" H 4792 1696 50  0000 L CNN
F 1 "10nF" H 4792 1605 50  0000 L CNN
F 2 "Capacitor_SMD:C_0402_1005Metric" H 4700 1650 50  0001 C CNN
F 3 "~" H 4700 1650 50  0001 C CNN
	1    4700 1650
	1    0    0    -1  
$EndComp
$Comp
L power:VCC #PWR?
U 1 1 6195FD87
P 3900 1550
AR Path="/6195FD87" Ref="#PWR?"  Part="1" 
AR Path="/618FBB16/6195FD87" Ref="#PWR0139"  Part="1" 
F 0 "#PWR0139" H 3900 1400 50  0001 C CNN
F 1 "VCC" H 3915 1723 50  0000 C CNN
F 2 "" H 3900 1550 50  0001 C CNN
F 3 "" H 3900 1550 50  0001 C CNN
	1    3900 1550
	1    0    0    -1  
$EndComp
$Comp
L power:GND #PWR?
U 1 1 6195FD8D
P 3900 1750
AR Path="/6195FD8D" Ref="#PWR?"  Part="1" 
AR Path="/618FBB16/6195FD8D" Ref="#PWR0140"  Part="1" 
F 0 "#PWR0140" H 3900 1500 50  0001 C CNN
F 1 "GND" H 3905 1577 50  0000 C CNN
F 2 "" H 3900 1750 50  0001 C CNN
F 3 "" H 3900 1750 50  0001 C CNN
	1    3900 1750
	1    0    0    -1  
$EndComp
$Comp
L Device:C_Small C?
U 1 1 619615B0
P 7900 1650
AR Path="/619615B0" Ref="C?"  Part="1" 
AR Path="/618FBB16/619615B0" Ref="C20"  Part="1" 
F 0 "C20" H 7992 1696 50  0000 L CNN
F 1 "1uF" H 7992 1605 50  0000 L CNN
F 2 "Capacitor_SMD:C_0603_1608Metric" H 7900 1650 50  0001 C CNN
F 3 "~" H 7900 1650 50  0001 C CNN
	1    7900 1650
	1    0    0    -1  
$EndComp
$Comp
L Device:C_Small C?
U 1 1 619615B6
P 8250 1650
AR Path="/619615B6" Ref="C?"  Part="1" 
AR Path="/618FBB16/619615B6" Ref="C21"  Part="1" 
F 0 "C21" H 8342 1696 50  0000 L CNN
F 1 "100nF" H 8342 1605 50  0000 L CNN
F 2 "Capacitor_SMD:C_0402_1005Metric" H 8250 1650 50  0001 C CNN
F 3 "~" H 8250 1650 50  0001 C CNN
	1    8250 1650
	1    0    0    -1  
$EndComp
$Comp
L Device:C_Small C?
U 1 1 619615BC
P 8650 1650
AR Path="/619615BC" Ref="C?"  Part="1" 
AR Path="/618FBB16/619615BC" Ref="C23"  Part="1" 
F 0 "C23" H 8742 1696 50  0000 L CNN
F 1 "100nF" H 8742 1605 50  0000 L CNN
F 2 "Capacitor_SMD:C_0402_1005Metric" H 8650 1650 50  0001 C CNN
F 3 "~" H 8650 1650 50  0001 C CNN
	1    8650 1650
	1    0    0    -1  
$EndComp
$Comp
L power:VCC #PWR?
U 1 1 619615C2
P 7900 1550
AR Path="/619615C2" Ref="#PWR?"  Part="1" 
AR Path="/618FBB16/619615C2" Ref="#PWR0141"  Part="1" 
F 0 "#PWR0141" H 7900 1400 50  0001 C CNN
F 1 "VCC" H 7915 1723 50  0000 C CNN
F 2 "" H 7900 1550 50  0001 C CNN
F 3 "" H 7900 1550 50  0001 C CNN
	1    7900 1550
	1    0    0    -1  
$EndComp
$Comp
L power:GND #PWR?
U 1 1 619615C8
P 7900 1750
AR Path="/619615C8" Ref="#PWR?"  Part="1" 
AR Path="/618FBB16/619615C8" Ref="#PWR0142"  Part="1" 
F 0 "#PWR0142" H 7900 1500 50  0001 C CNN
F 1 "GND" H 7905 1577 50  0000 C CNN
F 2 "" H 7900 1750 50  0001 C CNN
F 3 "" H 7900 1750 50  0001 C CNN
	1    7900 1750
	1    0    0    -1  
$EndComp
Wire Wire Line
	7900 1550 8250 1550
Connection ~ 7900 1550
Wire Wire Line
	7900 1750 8250 1750
Connection ~ 7900 1750
$Comp
L Device:C_Small C?
U 1 1 61961F55
P 8450 2950
AR Path="/61961F55" Ref="C?"  Part="1" 
AR Path="/618FBB16/61961F55" Ref="C22"  Part="1" 
F 0 "C22" H 8542 2996 50  0000 L CNN
F 1 "10uF" H 8542 2905 50  0000 L CNN
F 2 "Capacitor_SMD:C_0805_2012Metric" H 8450 2950 50  0001 C CNN
F 3 "~" H 8450 2950 50  0001 C CNN
	1    8450 2950
	1    0    0    -1  
$EndComp
$Comp
L Device:R_Small R3
U 1 1 61962C4B
P 6500 2550
F 0 "R3" H 6559 2596 50  0000 L CNN
F 1 "2.7K" H 6559 2505 50  0000 L CNN
F 2 "Resistor_SMD:R_0402_1005Metric" H 6500 2550 50  0001 C CNN
F 3 "~" H 6500 2550 50  0001 C CNN
	1    6500 2550
	1    0    0    -1  
$EndComp
$Comp
L Device:R_Small R4
U 1 1 61963005
P 6850 2550
F 0 "R4" H 6909 2596 50  0000 L CNN
F 1 "2.7kK" H 6909 2505 50  0000 L CNN
F 2 "Resistor_SMD:R_0402_1005Metric" H 6850 2550 50  0001 C CNN
F 3 "~" H 6850 2550 50  0001 C CNN
	1    6850 2550
	1    0    0    -1  
$EndComp
$Comp
L power:VCC #PWR?
U 1 1 61964116
P 6500 2450
AR Path="/61964116" Ref="#PWR?"  Part="1" 
AR Path="/618FBB16/61964116" Ref="#PWR0143"  Part="1" 
F 0 "#PWR0143" H 6500 2300 50  0001 C CNN
F 1 "VCC" H 6515 2623 50  0000 C CNN
F 2 "" H 6500 2450 50  0001 C CNN
F 3 "" H 6500 2450 50  0001 C CNN
	1    6500 2450
	1    0    0    -1  
$EndComp
Wire Wire Line
	6500 2450 6850 2450
Connection ~ 6500 2450
Wire Wire Line
	6500 2650 6500 2850
Wire Wire Line
	6500 2850 7500 2850
Wire Wire Line
	6850 2650 6850 2750
Wire Wire Line
	6850 2750 7500 2750
Wire Wire Line
	8300 2850 8450 2850
$Comp
L power:GND #PWR?
U 1 1 61965C8D
P 8450 3050
AR Path="/61965C8D" Ref="#PWR?"  Part="1" 
AR Path="/618FBB16/61965C8D" Ref="#PWR0144"  Part="1" 
F 0 "#PWR0144" H 8450 2800 50  0001 C CNN
F 1 "GND" H 8455 2877 50  0000 C CNN
F 2 "" H 8450 3050 50  0001 C CNN
F 3 "" H 8450 3050 50  0001 C CNN
	1    8450 3050
	1    0    0    -1  
$EndComp
$Comp
L power:GND #PWR?
U 1 1 61966093
P 7900 3150
AR Path="/61966093" Ref="#PWR?"  Part="1" 
AR Path="/618FBB16/61966093" Ref="#PWR0145"  Part="1" 
F 0 "#PWR0145" H 7900 2900 50  0001 C CNN
F 1 "GND" H 7905 2977 50  0000 C CNN
F 2 "" H 7900 3150 50  0001 C CNN
F 3 "" H 7900 3150 50  0001 C CNN
	1    7900 3150
	1    0    0    -1  
$EndComp
$Comp
L power:VCC #PWR?
U 1 1 61966303
P 7900 2550
AR Path="/61966303" Ref="#PWR?"  Part="1" 
AR Path="/618FBB16/61966303" Ref="#PWR0146"  Part="1" 
F 0 "#PWR0146" H 7900 2400 50  0001 C CNN
F 1 "VCC" H 7915 2723 50  0000 C CNN
F 2 "" H 7900 2550 50  0001 C CNN
F 3 "" H 7900 2550 50  0001 C CNN
	1    7900 2550
	1    0    0    -1  
$EndComp
Wire Wire Line
	7900 2550 8000 2550
Connection ~ 7900 2550
$Comp
L Device:C_Small C?
U 1 1 61966ED5
P 4100 2950
AR Path="/61966ED5" Ref="C?"  Part="1" 
AR Path="/618FBB16/61966ED5" Ref="C17"  Part="1" 
F 0 "C17" H 4192 2996 50  0000 L CNN
F 1 "470nF" H 4192 2905 50  0000 L CNN
F 2 "Capacitor_SMD:C_0603_1608Metric" H 4100 2950 50  0001 C CNN
F 3 "~" H 4100 2950 50  0001 C CNN
	1    4100 2950
	1    0    0    -1  
$EndComp
$Comp
L power:GND #PWR?
U 1 1 6196778A
P 4100 3050
AR Path="/6196778A" Ref="#PWR?"  Part="1" 
AR Path="/618FBB16/6196778A" Ref="#PWR0147"  Part="1" 
F 0 "#PWR0147" H 4100 2800 50  0001 C CNN
F 1 "GND" H 4105 2877 50  0000 C CNN
F 2 "" H 4100 3050 50  0001 C CNN
F 3 "" H 4100 3050 50  0001 C CNN
	1    4100 3050
	1    0    0    -1  
$EndComp
$Comp
L power:GND #PWR?
U 1 1 61967B36
P 4100 2750
AR Path="/61967B36" Ref="#PWR?"  Part="1" 
AR Path="/618FBB16/61967B36" Ref="#PWR0148"  Part="1" 
F 0 "#PWR0148" H 4100 2500 50  0001 C CNN
F 1 "GND" V 4105 2622 50  0000 R CNN
F 2 "" H 4100 2750 50  0001 C CNN
F 3 "" H 4100 2750 50  0001 C CNN
	1    4100 2750
	0    -1   -1   0   
$EndComp
$Comp
L power:VCC #PWR?
U 1 1 61968459
P 3600 2250
AR Path="/61968459" Ref="#PWR?"  Part="1" 
AR Path="/618FBB16/61968459" Ref="#PWR0149"  Part="1" 
F 0 "#PWR0149" H 3600 2100 50  0001 C CNN
F 1 "VCC" H 3615 2423 50  0000 C CNN
F 2 "" H 3600 2250 50  0001 C CNN
F 3 "" H 3600 2250 50  0001 C CNN
	1    3600 2250
	1    0    0    -1  
$EndComp
Wire Wire Line
	3600 2250 3700 2250
Connection ~ 3600 2250
$Comp
L power:GND #PWR?
U 1 1 6196904B
P 3600 3250
AR Path="/6196904B" Ref="#PWR?"  Part="1" 
AR Path="/618FBB16/6196904B" Ref="#PWR0150"  Part="1" 
F 0 "#PWR0150" H 3600 3000 50  0001 C CNN
F 1 "GND" H 3605 3077 50  0000 C CNN
F 2 "" H 3600 3250 50  0001 C CNN
F 3 "" H 3600 3250 50  0001 C CNN
	1    3600 3250
	1    0    0    -1  
$EndComp
Wire Wire Line
	4300 1550 4700 1550
Connection ~ 4300 1550
Wire Wire Line
	4300 1750 4700 1750
Connection ~ 4300 1750
Wire Wire Line
	3900 1750 4300 1750
Connection ~ 3900 1750
Wire Wire Line
	3900 1550 4300 1550
Connection ~ 3900 1550
Wire Wire Line
	8250 1550 8650 1550
Connection ~ 8250 1550
Wire Wire Line
	8250 1750 8650 1750
Connection ~ 8250 1750
$EndSCHEMATC
