EESchema Schematic File Version 4
EELAYER 30 0
EELAYER END
$Descr A4 11693 8268
encoding utf-8
Sheet 2 4
Title "RF"
Date ""
Rev "V0.1"
Comp "Benou"
Comment1 ""
Comment2 ""
Comment3 ""
Comment4 ""
$EndDescr
$Comp
L benou-rf:2450FM07D0034T U?
U 1 1 618FF20A
P 6850 3100
AR Path="/618FF20A" Ref="U?"  Part="1" 
AR Path="/618FB7C9/618FF20A" Ref="U1"  Part="1" 
F 0 "U1" H 6750 3500 50  0000 L CNN
F 1 "2450FM07D0034T" H 6750 3400 50  0000 L CNN
F 2 "benou-footprints:2450FM07D0034T" H 6850 3100 50  0001 C CNN
F 3 "" H 6850 3100 50  0001 C CNN
	1    6850 3100
	1    0    0    -1  
$EndComp
$Comp
L benou-rf:ECS-520-8-47-CKM-TR Y?
U 1 1 618FF216
P 1100 3250
AR Path="/618FF216" Ref="Y?"  Part="1" 
AR Path="/618FB7C9/618FF216" Ref="Y1"  Part="1" 
F 0 "Y1" H 1750 3515 50  0000 C CNN
F 1 "ECS-520-8-47-CKM-TR" H 1750 3424 50  0000 C CNN
F 2 "benou-footprints:ECS520847CKMTR" H 2250 3350 50  0001 L CNN
F 3 "https://componentsearchengine.com/Datasheets/1/ECS-520-8-47-CKM-TR.pdf" H 2250 3250 50  0001 L CNN
F 4 "Crystals 52MHz 10ppm 8pF -20C +70C" H 2250 3150 50  0001 L CNN "Description"
F 5 "0.35" H 2250 3050 50  0001 L CNN "Height"
F 6 "520-520-8-47-CKMT" H 2250 2950 50  0001 L CNN "Mouser Part Number"
F 7 "https://www.mouser.com/Search/Refine.aspx?Keyword=520-520-8-47-CKMT" H 2250 2850 50  0001 L CNN "Mouser Price/Stock"
F 8 "ECS" H 2250 2750 50  0001 L CNN "Manufacturer_Name"
F 9 "ECS-520-8-47-CKM-TR" H 2250 2650 50  0001 L CNN "Manufacturer_Part_Number"
	1    1100 3250
	1    0    0    -1  
$EndComp
$Comp
L benou-rf:SX1280 U?
U 1 1 618FF21C
P 5000 3400
AR Path="/618FF21C" Ref="U?"  Part="1" 
AR Path="/618FB7C9/618FF21C" Ref="U3"  Part="1" 
F 0 "U3" H 5000 4215 50  0000 C CNN
F 1 "SX1280" H 5000 4124 50  0000 C CNN
F 2 "Package_DFN_QFN:QFN-24-1EP_4x4mm_P0.5mm_EP2.7x2.7mm_ThermalVias" H 4900 3350 50  0001 C CNN
F 3 "" H 4900 3350 50  0001 C CNN
	1    5000 3400
	1    0    0    -1  
$EndComp
Text HLabel 1250 4800 0    50   Input ~ 0
DIO1
Text HLabel 1250 4900 0    50   Input ~ 0
DIO2
Text HLabel 1250 5000 0    50   Input ~ 0
DIO3
Text Label 3800 3600 0    50   ~ 0
DIO1_SX
Text Label 3800 3700 0    50   ~ 0
DIO2_SX
Text Label 3800 3800 0    50   ~ 0
DIO3_SX
Text Label 3800 3500 0    50   ~ 0
BUSY_SX
Text Label 3800 3100 0    50   ~ 0
NRESET_SX
Wire Wire Line
	3800 3500 4250 3500
Wire Wire Line
	3800 3600 4250 3600
Wire Wire Line
	3800 3700 4250 3700
Wire Wire Line
	3800 3800 4250 3800
Wire Wire Line
	3800 3100 4250 3100
Text Label 5900 3700 0    50   ~ 0
MISO_SX
Wire Wire Line
	5750 3700 6200 3700
Text Label 5900 3600 0    50   ~ 0
MOSI_SX
Wire Wire Line
	5750 3600 6200 3600
Text Label 5900 3500 0    50   ~ 0
SCLK_SX
Wire Wire Line
	5750 3500 6200 3500
Text Label 5900 3400 0    50   ~ 0
NSS_SX
Wire Wire Line
	5750 3400 6200 3400
Text HLabel 1250 5100 0    50   Input ~ 0
BUSY
Text HLabel 1250 5200 0    50   Input ~ 0
NRESET
Text HLabel 1250 5500 0    50   Input ~ 0
MISO
Text HLabel 1250 5600 0    50   Input ~ 0
MOSI
Text HLabel 1250 5700 0    50   Input ~ 0
SCLK
Text HLabel 1250 5800 0    50   Input ~ 0
NSS
Text Label 1350 5500 0    50   ~ 0
MISO_SX
Text Label 1350 5600 0    50   ~ 0
MOSI_SX
Text Label 1350 5700 0    50   ~ 0
SCLK_SX
Text Label 1350 5800 0    50   ~ 0
NSS_SX
Text Label 1350 4800 0    50   ~ 0
DIO1_SX
Text Label 1350 4900 0    50   ~ 0
DIO2_SX
Text Label 1350 5000 0    50   ~ 0
DIO3_SX
Text Label 1350 5100 0    50   ~ 0
BUSY_SX
Text Label 1350 5200 0    50   ~ 0
NRESET_SX
Wire Wire Line
	1250 4800 1750 4800
Wire Wire Line
	1250 4900 1750 4900
Wire Wire Line
	1250 5000 1750 5000
Wire Wire Line
	1250 5100 1750 5100
Wire Wire Line
	1250 5200 1750 5200
Wire Wire Line
	1250 5500 1750 5500
Wire Wire Line
	1250 5600 1750 5600
Wire Wire Line
	1250 5700 1750 5700
Wire Wire Line
	1250 5800 1750 5800
Text Label 3500 3200 0    50   ~ 0
XTA
Text Label 3500 3400 0    50   ~ 0
XTB
Text Label 2400 3250 0    50   ~ 0
XTA
Text Label 1100 3350 2    50   ~ 0
XTB
Wire Wire Line
	3500 3200 4250 3200
Wire Wire Line
	3500 3400 4250 3400
$Comp
L power:GND #PWR?
U 1 1 6196F0CA
P 5000 4350
AR Path="/6196F0CA" Ref="#PWR?"  Part="1" 
AR Path="/618FB7C9/6196F0CA" Ref="#PWR0109"  Part="1" 
F 0 "#PWR0109" H 5000 4100 50  0001 C CNN
F 1 "GND" H 5005 4177 50  0000 C CNN
F 2 "" H 5000 4350 50  0001 C CNN
F 3 "" H 5000 4350 50  0001 C CNN
	1    5000 4350
	1    0    0    -1  
$EndComp
$Comp
L power:GND #PWR?
U 1 1 6196FB4A
P 4250 3300
AR Path="/6196FB4A" Ref="#PWR?"  Part="1" 
AR Path="/618FB7C9/6196FB4A" Ref="#PWR0110"  Part="1" 
F 0 "#PWR0110" H 4250 3050 50  0001 C CNN
F 1 "GND" V 4255 3127 50  0000 C CNN
F 2 "" H 4250 3300 50  0001 C CNN
F 3 "" H 4250 3300 50  0001 C CNN
	1    4250 3300
	0    1    1    0   
$EndComp
$Comp
L power:GND #PWR?
U 1 1 619703D7
P 6750 3550
AR Path="/619703D7" Ref="#PWR?"  Part="1" 
AR Path="/618FB7C9/619703D7" Ref="#PWR0111"  Part="1" 
F 0 "#PWR0111" H 6750 3300 50  0001 C CNN
F 1 "GND" H 6755 3377 50  0000 C CNN
F 2 "" H 6750 3550 50  0001 C CNN
F 3 "" H 6750 3550 50  0001 C CNN
	1    6750 3550
	1    0    0    -1  
$EndComp
$Comp
L power:GND #PWR?
U 1 1 619707CC
P 6950 3550
AR Path="/619707CC" Ref="#PWR?"  Part="1" 
AR Path="/618FB7C9/619707CC" Ref="#PWR0112"  Part="1" 
F 0 "#PWR0112" H 6950 3300 50  0001 C CNN
F 1 "GND" H 6955 3377 50  0000 C CNN
F 2 "" H 6950 3550 50  0001 C CNN
F 3 "" H 6950 3550 50  0001 C CNN
	1    6950 3550
	1    0    0    -1  
$EndComp
$Comp
L power:GND #PWR?
U 1 1 61972CB2
P 5750 3200
AR Path="/61972CB2" Ref="#PWR?"  Part="1" 
AR Path="/618FB7C9/61972CB2" Ref="#PWR0113"  Part="1" 
F 0 "#PWR0113" H 5750 2950 50  0001 C CNN
F 1 "GND" V 5755 3072 50  0000 R CNN
F 2 "" H 5750 3200 50  0001 C CNN
F 3 "" H 5750 3200 50  0001 C CNN
	1    5750 3200
	0    -1   -1   0   
$EndComp
$Comp
L power:GND #PWR?
U 1 1 61973425
P 5750 3000
AR Path="/61973425" Ref="#PWR?"  Part="1" 
AR Path="/618FB7C9/61973425" Ref="#PWR0114"  Part="1" 
F 0 "#PWR0114" H 5750 2750 50  0001 C CNN
F 1 "GND" V 5755 2872 50  0000 R CNN
F 2 "" H 5750 3000 50  0001 C CNN
F 3 "" H 5750 3000 50  0001 C CNN
	1    5750 3000
	0    -1   -1   0   
$EndComp
Wire Wire Line
	5750 3000 5750 2900
Connection ~ 5750 3000
Wire Wire Line
	5750 3200 5750 3300
Connection ~ 5750 3200
Wire Wire Line
	5750 3100 6300 3100
$Comp
L Connector:Conn_Coaxial J8
U 1 1 61974B39
P 7600 3100
F 0 "J8" H 7700 3075 50  0000 L CNN
F 1 "Conn_Coaxial" H 7700 2984 50  0000 L CNN
F 2 "Connector_Coaxial:U.FL_Molex_MCRF_73412-0110_Vertical" H 7600 3100 50  0001 C CNN
F 3 " ~" H 7600 3100 50  0001 C CNN
	1    7600 3100
	1    0    0    -1  
$EndComp
$Comp
L power:GND #PWR?
U 1 1 619757F4
P 7600 3300
AR Path="/619757F4" Ref="#PWR?"  Part="1" 
AR Path="/618FB7C9/619757F4" Ref="#PWR0115"  Part="1" 
F 0 "#PWR0115" H 7600 3050 50  0001 C CNN
F 1 "GND" H 7605 3127 50  0000 C CNN
F 2 "" H 7600 3300 50  0001 C CNN
F 3 "" H 7600 3300 50  0001 C CNN
	1    7600 3300
	1    0    0    -1  
$EndComp
$Comp
L power:VCC #PWR?
U 1 1 6197B48D
P 6300 3950
AR Path="/6197B48D" Ref="#PWR?"  Part="1" 
AR Path="/618FB7C9/6197B48D" Ref="#PWR0116"  Part="1" 
F 0 "#PWR0116" H 6300 3800 50  0001 C CNN
F 1 "VCC" H 6315 4123 50  0000 C CNN
F 2 "" H 6300 3950 50  0001 C CNN
F 3 "" H 6300 3950 50  0001 C CNN
	1    6300 3950
	1    0    0    -1  
$EndComp
$Comp
L Device:C_Small C?
U 1 1 6197EC89
P 4300 5600
AR Path="/6197EC89" Ref="C?"  Part="1" 
AR Path="/618FB7C9/6197EC89" Ref="C8"  Part="1" 
F 0 "C8" H 4392 5646 50  0000 L CNN
F 1 "1uF" H 4392 5555 50  0000 L CNN
F 2 "Capacitor_SMD:C_0603_1608Metric" H 4300 5600 50  0001 C CNN
F 3 "~" H 4300 5600 50  0001 C CNN
	1    4300 5600
	1    0    0    -1  
$EndComp
$Comp
L Device:C_Small C?
U 1 1 6197EC8F
P 4650 5600
AR Path="/6197EC8F" Ref="C?"  Part="1" 
AR Path="/618FB7C9/6197EC8F" Ref="C9"  Part="1" 
F 0 "C9" H 4742 5646 50  0000 L CNN
F 1 "100nF" H 4742 5555 50  0000 L CNN
F 2 "Capacitor_SMD:C_0402_1005Metric" H 4650 5600 50  0001 C CNN
F 3 "~" H 4650 5600 50  0001 C CNN
	1    4650 5600
	1    0    0    -1  
$EndComp
$Comp
L Device:C_Small C?
U 1 1 6197EC95
P 6300 4050
AR Path="/6197EC95" Ref="C?"  Part="1" 
AR Path="/618FB7C9/6197EC95" Ref="C11"  Part="1" 
F 0 "C11" H 6392 4096 50  0000 L CNN
F 1 "100nF" H 6392 4005 50  0000 L CNN
F 2 "Capacitor_SMD:C_0402_1005Metric" H 6300 4050 50  0001 C CNN
F 3 "~" H 6300 4050 50  0001 C CNN
	1    6300 4050
	1    0    0    -1  
$EndComp
$Comp
L Device:C_Small C?
U 1 1 6197EC9B
P 3800 2650
AR Path="/6197EC9B" Ref="C?"  Part="1" 
AR Path="/618FB7C9/6197EC9B" Ref="C10"  Part="1" 
F 0 "C10" H 3892 2696 50  0000 L CNN
F 1 "10nF" H 3892 2605 50  0000 L CNN
F 2 "Capacitor_SMD:C_0402_1005Metric" H 3800 2650 50  0001 C CNN
F 3 "~" H 3800 2650 50  0001 C CNN
	1    3800 2650
	1    0    0    -1  
$EndComp
$Comp
L power:VCC #PWR?
U 1 1 6197ECA1
P 4300 5500
AR Path="/6197ECA1" Ref="#PWR?"  Part="1" 
AR Path="/618FB7C9/6197ECA1" Ref="#PWR0117"  Part="1" 
F 0 "#PWR0117" H 4300 5350 50  0001 C CNN
F 1 "VCC" H 4315 5673 50  0000 C CNN
F 2 "" H 4300 5500 50  0001 C CNN
F 3 "" H 4300 5500 50  0001 C CNN
	1    4300 5500
	1    0    0    -1  
$EndComp
$Comp
L power:GND #PWR?
U 1 1 6197ECA7
P 4300 5700
AR Path="/6197ECA7" Ref="#PWR?"  Part="1" 
AR Path="/618FB7C9/6197ECA7" Ref="#PWR0118"  Part="1" 
F 0 "#PWR0118" H 4300 5450 50  0001 C CNN
F 1 "GND" H 4305 5527 50  0000 C CNN
F 2 "" H 4300 5700 50  0001 C CNN
F 3 "" H 4300 5700 50  0001 C CNN
	1    4300 5700
	1    0    0    -1  
$EndComp
Wire Wire Line
	4300 5500 4650 5500
Connection ~ 4300 5500
Wire Wire Line
	4300 5700 4650 5700
Connection ~ 4300 5700
$Comp
L Device:C_Small C?
U 1 1 61982181
P 4000 4800
AR Path="/61982181" Ref="C?"  Part="1" 
AR Path="/618FBB16/61982181" Ref="C?"  Part="1" 
AR Path="/618FB7C9/61982181" Ref="C7"  Part="1" 
F 0 "C7" H 4092 4846 50  0000 L CNN
F 1 "470nF" H 4092 4755 50  0000 L CNN
F 2 "Capacitor_SMD:C_0603_1608Metric" H 4000 4800 50  0001 C CNN
F 3 "~" H 4000 4800 50  0001 C CNN
	1    4000 4800
	1    0    0    -1  
$EndComp
Wire Wire Line
	5750 3800 6050 3800
Wire Wire Line
	6050 3800 6050 3950
Wire Wire Line
	6050 3950 6300 3950
Connection ~ 6300 3950
$Comp
L power:GND #PWR?
U 1 1 61983D96
P 5750 4000
AR Path="/61983D96" Ref="#PWR?"  Part="1" 
AR Path="/618FB7C9/61983D96" Ref="#PWR0119"  Part="1" 
F 0 "#PWR0119" H 5750 3750 50  0001 C CNN
F 1 "GND" H 5755 3827 50  0000 C CNN
F 2 "" H 5750 4000 50  0001 C CNN
F 3 "" H 5750 4000 50  0001 C CNN
	1    5750 4000
	1    0    0    -1  
$EndComp
$Comp
L Device:L L1
U 1 1 61984A5D
P 4550 4700
F 0 "L1" V 4740 4700 50  0000 C CNN
F 1 "15uH" V 4649 4700 50  0000 C CNN
F 2 "Inductor_SMD:L_0805_2012Metric" H 4550 4700 50  0001 C CNN
F 3 "~" H 4550 4700 50  0001 C CNN
	1    4550 4700
	0    -1   -1   0   
$EndComp
Wire Wire Line
	4000 4000 4000 4700
Connection ~ 4000 4700
Wire Wire Line
	4700 4700 5900 4700
Wire Wire Line
	5900 4700 5900 3900
Wire Wire Line
	5900 3900 5750 3900
Wire Wire Line
	3100 3000 4250 3000
$Comp
L Device:C_Small C?
U 1 1 61988EAF
P 3100 3100
AR Path="/61988EAF" Ref="C?"  Part="1" 
AR Path="/618FB7C9/61988EAF" Ref="C5"  Part="1" 
F 0 "C5" H 3192 3146 50  0000 L CNN
F 1 "10nF" H 3192 3055 50  0000 L CNN
F 2 "Capacitor_SMD:C_0402_1005Metric" H 3100 3100 50  0001 C CNN
F 3 "~" H 3100 3100 50  0001 C CNN
	1    3100 3100
	1    0    0    -1  
$EndComp
Text Label 3350 3000 0    50   ~ 0
VDD_IN
Text Label 4000 4000 0    50   ~ 0
VDD_IN
Wire Wire Line
	4000 4000 4250 4000
Wire Wire Line
	4000 4700 4400 4700
$Comp
L power:GND #PWR?
U 1 1 6198C22C
P 4000 4900
AR Path="/6198C22C" Ref="#PWR?"  Part="1" 
AR Path="/618FB7C9/6198C22C" Ref="#PWR0120"  Part="1" 
F 0 "#PWR0120" H 4000 4650 50  0001 C CNN
F 1 "GND" H 4005 4727 50  0000 C CNN
F 2 "" H 4000 4900 50  0001 C CNN
F 3 "" H 4000 4900 50  0001 C CNN
	1    4000 4900
	1    0    0    -1  
$EndComp
$Comp
L power:GND #PWR?
U 1 1 6198C5CD
P 6300 4150
AR Path="/6198C5CD" Ref="#PWR?"  Part="1" 
AR Path="/618FB7C9/6198C5CD" Ref="#PWR0121"  Part="1" 
F 0 "#PWR0121" H 6300 3900 50  0001 C CNN
F 1 "GND" H 6305 3977 50  0000 C CNN
F 2 "" H 6300 4150 50  0001 C CNN
F 3 "" H 6300 4150 50  0001 C CNN
	1    6300 4150
	1    0    0    -1  
$EndComp
$Comp
L power:VCC #PWR?
U 1 1 6198D8E4
P 3500 3900
AR Path="/6198D8E4" Ref="#PWR?"  Part="1" 
AR Path="/618FB7C9/6198D8E4" Ref="#PWR0122"  Part="1" 
F 0 "#PWR0122" H 3500 3750 50  0001 C CNN
F 1 "VCC" H 3515 4073 50  0000 C CNN
F 2 "" H 3500 3900 50  0001 C CNN
F 3 "" H 3500 3900 50  0001 C CNN
	1    3500 3900
	1    0    0    -1  
$EndComp
$Comp
L Device:C_Small C?
U 1 1 6198D8EA
P 3500 4000
AR Path="/6198D8EA" Ref="C?"  Part="1" 
AR Path="/618FB7C9/6198D8EA" Ref="C6"  Part="1" 
F 0 "C6" H 3592 4046 50  0000 L CNN
F 1 "100nF" H 3592 3955 50  0000 L CNN
F 2 "Capacitor_SMD:C_0402_1005Metric" H 3500 4000 50  0001 C CNN
F 3 "~" H 3500 4000 50  0001 C CNN
	1    3500 4000
	1    0    0    -1  
$EndComp
$Comp
L power:GND #PWR?
U 1 1 6198D8F2
P 3500 4100
AR Path="/6198D8F2" Ref="#PWR?"  Part="1" 
AR Path="/618FB7C9/6198D8F2" Ref="#PWR0123"  Part="1" 
F 0 "#PWR0123" H 3500 3850 50  0001 C CNN
F 1 "GND" H 3505 3927 50  0000 C CNN
F 2 "" H 3500 4100 50  0001 C CNN
F 3 "" H 3500 4100 50  0001 C CNN
	1    3500 4100
	1    0    0    -1  
$EndComp
Wire Wire Line
	3500 3900 4250 3900
Connection ~ 3500 3900
$Comp
L power:GND #PWR?
U 1 1 6198EDD6
P 3100 3200
AR Path="/6198EDD6" Ref="#PWR?"  Part="1" 
AR Path="/618FB7C9/6198EDD6" Ref="#PWR0124"  Part="1" 
F 0 "#PWR0124" H 3100 2950 50  0001 C CNN
F 1 "GND" H 3105 3027 50  0000 C CNN
F 2 "" H 3100 3200 50  0001 C CNN
F 3 "" H 3100 3200 50  0001 C CNN
	1    3100 3200
	1    0    0    -1  
$EndComp
$Comp
L power:GND #PWR?
U 1 1 619E1791
P 3800 2750
AR Path="/619E1791" Ref="#PWR?"  Part="1" 
AR Path="/618FB7C9/619E1791" Ref="#PWR0151"  Part="1" 
F 0 "#PWR0151" H 3800 2500 50  0001 C CNN
F 1 "GND" H 3805 2577 50  0000 C CNN
F 2 "" H 3800 2750 50  0001 C CNN
F 3 "" H 3800 2750 50  0001 C CNN
	1    3800 2750
	1    0    0    -1  
$EndComp
Wire Wire Line
	4250 2900 4250 2550
Wire Wire Line
	4250 2550 3800 2550
$Comp
L power:GND #PWR?
U 1 1 619E3E33
P 2400 3350
AR Path="/619E3E33" Ref="#PWR?"  Part="1" 
AR Path="/618FB7C9/619E3E33" Ref="#PWR0152"  Part="1" 
F 0 "#PWR0152" H 2400 3100 50  0001 C CNN
F 1 "GND" H 2405 3177 50  0000 C CNN
F 2 "" H 2400 3350 50  0001 C CNN
F 3 "" H 2400 3350 50  0001 C CNN
	1    2400 3350
	1    0    0    -1  
$EndComp
$Comp
L power:GND #PWR?
U 1 1 619E428D
P 1100 3250
AR Path="/619E428D" Ref="#PWR?"  Part="1" 
AR Path="/618FB7C9/619E428D" Ref="#PWR0153"  Part="1" 
F 0 "#PWR0153" H 1100 3000 50  0001 C CNN
F 1 "GND" H 1105 3077 50  0000 C CNN
F 2 "" H 1100 3250 50  0001 C CNN
F 3 "" H 1100 3250 50  0001 C CNN
	1    1100 3250
	-1   0    0    1   
$EndComp
Wire Wire Line
	2400 3250 2550 3250
Wire Wire Line
	950  3350 1100 3350
$EndSCHEMATC
