(kicad_pcb (version 20171130) (host pcbnew "(5.1.10)-1")

  (general
    (thickness 1.6)
    (drawings 4)
    (tracks 0)
    (zones 0)
    (modules 10)
    (nets 109)
  )

  (page A4)
  (layers
    (0 F.Cu signal)
    (31 B.Cu signal)
    (32 B.Adhes user)
    (33 F.Adhes user)
    (34 B.Paste user)
    (35 F.Paste user)
    (36 B.SilkS user)
    (37 F.SilkS user)
    (38 B.Mask user)
    (39 F.Mask user)
    (40 Dwgs.User user)
    (41 Cmts.User user)
    (42 Eco1.User user)
    (43 Eco2.User user)
    (44 Edge.Cuts user)
    (45 Margin user)
    (46 B.CrtYd user)
    (47 F.CrtYd user)
    (48 B.Fab user)
    (49 F.Fab user)
  )

  (setup
    (last_trace_width 0.25)
    (trace_clearance 0.2)
    (zone_clearance 0.508)
    (zone_45_only no)
    (trace_min 0.2)
    (via_size 0.8)
    (via_drill 0.4)
    (via_min_size 0.4)
    (via_min_drill 0.3)
    (uvia_size 0.3)
    (uvia_drill 0.1)
    (uvias_allowed no)
    (uvia_min_size 0.2)
    (uvia_min_drill 0.1)
    (edge_width 0.05)
    (segment_width 0.2)
    (pcb_text_width 0.3)
    (pcb_text_size 1.5 1.5)
    (mod_edge_width 0.12)
    (mod_text_size 1 1)
    (mod_text_width 0.15)
    (pad_size 1.524 1.524)
    (pad_drill 0.762)
    (pad_to_mask_clearance 0)
    (aux_axis_origin 113.03 123.19)
    (grid_origin 113.03 123.19)
    (visible_elements FFFFFF7F)
    (pcbplotparams
      (layerselection 0x010fc_ffffffff)
      (usegerberextensions false)
      (usegerberattributes true)
      (usegerberadvancedattributes true)
      (creategerberjobfile true)
      (excludeedgelayer true)
      (linewidth 0.100000)
      (plotframeref false)
      (viasonmask false)
      (mode 1)
      (useauxorigin false)
      (hpglpennumber 1)
      (hpglpenspeed 20)
      (hpglpendiameter 15.000000)
      (psnegative false)
      (psa4output false)
      (plotreference true)
      (plotvalue true)
      (plotinvisibletext false)
      (padsonsilk false)
      (subtractmaskfromsilk false)
      (outputformat 1)
      (mirror false)
      (drillshape 1)
      (scaleselection 1)
      (outputdirectory ""))
  )

  (net 0 "")
  (net 1 "Net-(U1-Pad4)")
  (net 2 "Net-(U1-Pad3)")
  (net 3 "Net-(U1-Pad2)")
  (net 4 "Net-(U1-Pad1)")
  (net 5 "Net-(U2-Pad33)")
  (net 6 "Net-(U2-Pad32)")
  (net 7 "Net-(U2-Pad31)")
  (net 8 "Net-(U2-Pad30)")
  (net 9 "Net-(U2-Pad29)")
  (net 10 "Net-(U2-Pad28)")
  (net 11 "Net-(U2-Pad27)")
  (net 12 "Net-(U2-Pad26)")
  (net 13 "Net-(U2-Pad25)")
  (net 14 "Net-(U2-Pad24)")
  (net 15 "Net-(U2-Pad23)")
  (net 16 "Net-(U2-Pad22)")
  (net 17 "Net-(U2-Pad21)")
  (net 18 "Net-(U2-Pad20)")
  (net 19 "Net-(U2-Pad19)")
  (net 20 "Net-(U2-Pad18)")
  (net 21 "Net-(U2-Pad17)")
  (net 22 "Net-(U2-Pad16)")
  (net 23 "Net-(U2-Pad15)")
  (net 24 "Net-(U2-Pad14)")
  (net 25 "Net-(U2-Pad13)")
  (net 26 "Net-(U2-Pad12)")
  (net 27 "Net-(U2-Pad11)")
  (net 28 "Net-(U2-Pad10)")
  (net 29 "Net-(U2-Pad9)")
  (net 30 "Net-(U2-Pad8)")
  (net 31 "Net-(U2-Pad7)")
  (net 32 "Net-(U2-Pad6)")
  (net 33 "Net-(U2-Pad5)")
  (net 34 "Net-(U2-Pad4)")
  (net 35 "Net-(U2-Pad3)")
  (net 36 "Net-(U2-Pad2)")
  (net 37 "Net-(U2-Pad1)")
  (net 38 "Net-(U3-Pad4)")
  (net 39 "Net-(U3-Pad3)")
  (net 40 "Net-(U3-Pad2)")
  (net 41 "Net-(U3-Pad1)")
  (net 42 "Net-(U4-Pad5)")
  (net 43 "Net-(U4-Pad4)")
  (net 44 "Net-(U4-Pad3)")
  (net 45 "Net-(U4-Pad2)")
  (net 46 "Net-(U4-Pad1)")
  (net 47 "Net-(U5-Pad5)")
  (net 48 "Net-(U5-Pad4)")
  (net 49 "Net-(U5-Pad3)")
  (net 50 "Net-(U5-Pad2)")
  (net 51 "Net-(U5-Pad1)")
  (net 52 "Net-(Y1-Pad4)")
  (net 53 "Net-(Y1-Pad3)")
  (net 54 "Net-(Y1-Pad2)")
  (net 55 "Net-(Y1-Pad1)")
  (net 56 "Net-(J1-Pad6)")
  (net 57 "Net-(J1-Pad5)")
  (net 58 "Net-(J1-Pad4)")
  (net 59 "Net-(J1-Pad3)")
  (net 60 "Net-(J1-Pad2)")
  (net 61 "Net-(J1-Pad1)")
  (net 62 "Net-(U3-Pad25)")
  (net 63 "Net-(U3-Pad24)")
  (net 64 "Net-(U3-Pad23)")
  (net 65 "Net-(U3-Pad22)")
  (net 66 "Net-(U3-Pad21)")
  (net 67 "Net-(U3-Pad20)")
  (net 68 "Net-(U3-Pad19)")
  (net 69 "Net-(U3-Pad18)")
  (net 70 "Net-(U3-Pad17)")
  (net 71 "Net-(U3-Pad16)")
  (net 72 "Net-(U3-Pad15)")
  (net 73 "Net-(U3-Pad14)")
  (net 74 "Net-(U3-Pad13)")
  (net 75 "Net-(U3-Pad12)")
  (net 76 "Net-(U3-Pad11)")
  (net 77 "Net-(U3-Pad10)")
  (net 78 "Net-(U3-Pad9)")
  (net 79 "Net-(U3-Pad8)")
  (net 80 "Net-(U3-Pad7)")
  (net 81 "Net-(U3-Pad6)")
  (net 82 "Net-(U3-Pad5)")
  (net 83 "Net-(U7-Pad10)")
  (net 84 "Net-(U7-Pad11)")
  (net 85 "Net-(U7-Pad12)")
  (net 86 "Net-(U7-Pad5)")
  (net 87 "Net-(U7-Pad7)")
  (net 88 "Net-(U7-Pad6)")
  (net 89 "Net-(U7-Pad8)")
  (net 90 "Net-(U7-Pad4)")
  (net 91 "Net-(U7-Pad3)")
  (net 92 "Net-(U7-Pad2)")
  (net 93 "Net-(U7-Pad1)")
  (net 94 "Net-(U7-Pad14)")
  (net 95 "Net-(U7-Pad15)")
  (net 96 "Net-(U7-Pad16)")
  (net 97 "Net-(U7-Pad13)")
  (net 98 "Net-(U8-Pad16)")
  (net 99 "Net-(U8-Pad10)")
  (net 100 "Net-(U8-Pad14)")
  (net 101 "Net-(U8-Pad8)")
  (net 102 "Net-(U8-Pad7)")
  (net 103 "Net-(U8-Pad6)")
  (net 104 "Net-(U8-Pad5)")
  (net 105 "Net-(U8-Pad4)")
  (net 106 "Net-(U8-Pad3)")
  (net 107 "Net-(U8-Pad2)")
  (net 108 "Net-(U8-Pad1)")

  (net_class Default "This is the default net class."
    (clearance 0.2)
    (trace_width 0.25)
    (via_dia 0.8)
    (via_drill 0.4)
    (uvia_dia 0.3)
    (uvia_drill 0.1)
    (add_net "Net-(J1-Pad1)")
    (add_net "Net-(J1-Pad2)")
    (add_net "Net-(J1-Pad3)")
    (add_net "Net-(J1-Pad4)")
    (add_net "Net-(J1-Pad5)")
    (add_net "Net-(J1-Pad6)")
    (add_net "Net-(U1-Pad1)")
    (add_net "Net-(U1-Pad2)")
    (add_net "Net-(U1-Pad3)")
    (add_net "Net-(U1-Pad4)")
    (add_net "Net-(U2-Pad1)")
    (add_net "Net-(U2-Pad10)")
    (add_net "Net-(U2-Pad11)")
    (add_net "Net-(U2-Pad12)")
    (add_net "Net-(U2-Pad13)")
    (add_net "Net-(U2-Pad14)")
    (add_net "Net-(U2-Pad15)")
    (add_net "Net-(U2-Pad16)")
    (add_net "Net-(U2-Pad17)")
    (add_net "Net-(U2-Pad18)")
    (add_net "Net-(U2-Pad19)")
    (add_net "Net-(U2-Pad2)")
    (add_net "Net-(U2-Pad20)")
    (add_net "Net-(U2-Pad21)")
    (add_net "Net-(U2-Pad22)")
    (add_net "Net-(U2-Pad23)")
    (add_net "Net-(U2-Pad24)")
    (add_net "Net-(U2-Pad25)")
    (add_net "Net-(U2-Pad26)")
    (add_net "Net-(U2-Pad27)")
    (add_net "Net-(U2-Pad28)")
    (add_net "Net-(U2-Pad29)")
    (add_net "Net-(U2-Pad3)")
    (add_net "Net-(U2-Pad30)")
    (add_net "Net-(U2-Pad31)")
    (add_net "Net-(U2-Pad32)")
    (add_net "Net-(U2-Pad33)")
    (add_net "Net-(U2-Pad4)")
    (add_net "Net-(U2-Pad5)")
    (add_net "Net-(U2-Pad6)")
    (add_net "Net-(U2-Pad7)")
    (add_net "Net-(U2-Pad8)")
    (add_net "Net-(U2-Pad9)")
    (add_net "Net-(U3-Pad1)")
    (add_net "Net-(U3-Pad10)")
    (add_net "Net-(U3-Pad11)")
    (add_net "Net-(U3-Pad12)")
    (add_net "Net-(U3-Pad13)")
    (add_net "Net-(U3-Pad14)")
    (add_net "Net-(U3-Pad15)")
    (add_net "Net-(U3-Pad16)")
    (add_net "Net-(U3-Pad17)")
    (add_net "Net-(U3-Pad18)")
    (add_net "Net-(U3-Pad19)")
    (add_net "Net-(U3-Pad2)")
    (add_net "Net-(U3-Pad20)")
    (add_net "Net-(U3-Pad21)")
    (add_net "Net-(U3-Pad22)")
    (add_net "Net-(U3-Pad23)")
    (add_net "Net-(U3-Pad24)")
    (add_net "Net-(U3-Pad25)")
    (add_net "Net-(U3-Pad3)")
    (add_net "Net-(U3-Pad4)")
    (add_net "Net-(U3-Pad5)")
    (add_net "Net-(U3-Pad6)")
    (add_net "Net-(U3-Pad7)")
    (add_net "Net-(U3-Pad8)")
    (add_net "Net-(U3-Pad9)")
    (add_net "Net-(U4-Pad1)")
    (add_net "Net-(U4-Pad2)")
    (add_net "Net-(U4-Pad3)")
    (add_net "Net-(U4-Pad4)")
    (add_net "Net-(U4-Pad5)")
    (add_net "Net-(U5-Pad1)")
    (add_net "Net-(U5-Pad2)")
    (add_net "Net-(U5-Pad3)")
    (add_net "Net-(U5-Pad4)")
    (add_net "Net-(U5-Pad5)")
    (add_net "Net-(U7-Pad1)")
    (add_net "Net-(U7-Pad10)")
    (add_net "Net-(U7-Pad11)")
    (add_net "Net-(U7-Pad12)")
    (add_net "Net-(U7-Pad13)")
    (add_net "Net-(U7-Pad14)")
    (add_net "Net-(U7-Pad15)")
    (add_net "Net-(U7-Pad16)")
    (add_net "Net-(U7-Pad2)")
    (add_net "Net-(U7-Pad3)")
    (add_net "Net-(U7-Pad4)")
    (add_net "Net-(U7-Pad5)")
    (add_net "Net-(U7-Pad6)")
    (add_net "Net-(U7-Pad7)")
    (add_net "Net-(U7-Pad8)")
    (add_net "Net-(U8-Pad1)")
    (add_net "Net-(U8-Pad10)")
    (add_net "Net-(U8-Pad14)")
    (add_net "Net-(U8-Pad16)")
    (add_net "Net-(U8-Pad2)")
    (add_net "Net-(U8-Pad3)")
    (add_net "Net-(U8-Pad4)")
    (add_net "Net-(U8-Pad5)")
    (add_net "Net-(U8-Pad6)")
    (add_net "Net-(U8-Pad7)")
    (add_net "Net-(U8-Pad8)")
    (add_net "Net-(Y1-Pad1)")
    (add_net "Net-(Y1-Pad2)")
    (add_net "Net-(Y1-Pad3)")
    (add_net "Net-(Y1-Pad4)")
  )

  (module Connector:Tag-Connect_TC2030-IDC-NL_2x03_P1.27mm_Vertical (layer F.Cu) (tedit 5A29CEA9) (tstamp 618EC575)
    (at 116.03 110.19 90)
    (descr "Tag-Connect programming header; http://www.tag-connect.com/Materials/TC2030-IDC-NL.pdf")
    (tags "tag connect programming header pogo pins")
    (path /618F0C2A)
    (attr virtual)
    (fp_text reference J1 (at 0 2.7 90) (layer F.SilkS)
      (effects (font (size 1 1) (thickness 0.15)))
    )
    (fp_text value Conn_02x03_Odd_Even (at 0 -2.3 90) (layer F.Fab)
      (effects (font (size 1 1) (thickness 0.15)))
    )
    (fp_text user KEEPOUT (at 0 0 90) (layer Cmts.User)
      (effects (font (size 0.4 0.4) (thickness 0.07)))
    )
    (fp_text user %R (at 0 0 90) (layer F.Fab)
      (effects (font (size 1 1) (thickness 0.15)))
    )
    (fp_line (start -1.905 1.27) (end -1.905 0.635) (layer F.SilkS) (width 0.12))
    (fp_line (start -1.27 1.27) (end -1.905 1.27) (layer F.SilkS) (width 0.12))
    (fp_line (start -3.5 2) (end -3.5 -2) (layer F.CrtYd) (width 0.05))
    (fp_line (start 3.5 2) (end -3.5 2) (layer F.CrtYd) (width 0.05))
    (fp_line (start 3.5 -2) (end 3.5 2) (layer F.CrtYd) (width 0.05))
    (fp_line (start -3.5 -2) (end 3.5 -2) (layer F.CrtYd) (width 0.05))
    (fp_line (start -1.27 0.635) (end -1.27 -0.635) (layer Dwgs.User) (width 0.1))
    (fp_line (start 1.27 0.635) (end -1.27 0.635) (layer Dwgs.User) (width 0.1))
    (fp_line (start 1.27 -0.635) (end 1.27 0.635) (layer Dwgs.User) (width 0.1))
    (fp_line (start -1.27 -0.635) (end 1.27 -0.635) (layer Dwgs.User) (width 0.1))
    (fp_line (start -1.27 0.635) (end 0 -0.635) (layer Dwgs.User) (width 0.1))
    (fp_line (start -1.27 0) (end -0.635 -0.635) (layer Dwgs.User) (width 0.1))
    (fp_line (start -0.635 0.635) (end 0.635 -0.635) (layer Dwgs.User) (width 0.1))
    (fp_line (start 0 0.635) (end 1.27 -0.635) (layer Dwgs.User) (width 0.1))
    (fp_line (start 0.635 0.635) (end 1.27 0) (layer Dwgs.User) (width 0.1))
    (pad 6 connect circle (at 1.27 -0.635 90) (size 0.7874 0.7874) (layers F.Cu F.Mask)
      (net 56 "Net-(J1-Pad6)"))
    (pad 5 connect circle (at 1.27 0.635 90) (size 0.7874 0.7874) (layers F.Cu F.Mask)
      (net 57 "Net-(J1-Pad5)"))
    (pad 4 connect circle (at 0 -0.635 90) (size 0.7874 0.7874) (layers F.Cu F.Mask)
      (net 58 "Net-(J1-Pad4)"))
    (pad 3 connect circle (at 0 0.635 90) (size 0.7874 0.7874) (layers F.Cu F.Mask)
      (net 59 "Net-(J1-Pad3)"))
    (pad 2 connect circle (at -1.27 -0.635 90) (size 0.7874 0.7874) (layers F.Cu F.Mask)
      (net 60 "Net-(J1-Pad2)"))
    (pad 1 connect circle (at -1.27 0.635 90) (size 0.7874 0.7874) (layers F.Cu F.Mask)
      (net 61 "Net-(J1-Pad1)"))
    (pad "" np_thru_hole circle (at -2.54 0 90) (size 0.9906 0.9906) (drill 0.9906) (layers *.Cu *.Mask))
    (pad "" np_thru_hole circle (at 2.54 1.016 90) (size 0.9906 0.9906) (drill 0.9906) (layers *.Cu *.Mask))
    (pad "" np_thru_hole circle (at 2.54 -1.016 90) (size 0.9906 0.9906) (drill 0.9906) (layers *.Cu *.Mask))
  )

  (module benou-footprints:ECS520847CKMTR (layer F.Cu) (tedit 0) (tstamp 618EC6D0)
    (at 130.465 96.665)
    (descr ECS-520-8-47-CKM-TR-3)
    (tags "Crystal or Oscillator")
    (path /618FB7C9/618FF216)
    (attr smd)
    (fp_text reference Y1 (at -0.15 0) (layer F.SilkS)
      (effects (font (size 1.27 1.27) (thickness 0.254)))
    )
    (fp_text value ECS-520-8-47-CKM-TR (at -0.15 0) (layer F.SilkS) hide
      (effects (font (size 1.27 1.27) (thickness 0.254)))
    )
    (fp_arc (start -1.15 0.4) (end -1.1 0.4) (angle -180) (layer F.SilkS) (width 0.1))
    (fp_arc (start -1.15 0.4) (end -1.2 0.4) (angle -180) (layer F.SilkS) (width 0.1))
    (fp_text user %R (at -0.15 0) (layer F.Fab)
      (effects (font (size 1.27 1.27) (thickness 0.254)))
    )
    (fp_line (start -0.8 -0.6) (end 0.8 -0.6) (layer F.Fab) (width 0.2))
    (fp_line (start 0.8 -0.6) (end 0.8 0.6) (layer F.Fab) (width 0.2))
    (fp_line (start 0.8 0.6) (end -0.8 0.6) (layer F.Fab) (width 0.2))
    (fp_line (start -0.8 0.6) (end -0.8 -0.6) (layer F.Fab) (width 0.2))
    (fp_line (start -2.2 -1.7) (end 1.9 -1.7) (layer F.CrtYd) (width 0.1))
    (fp_line (start 1.9 -1.7) (end 1.9 1.7) (layer F.CrtYd) (width 0.1))
    (fp_line (start 1.9 1.7) (end -2.2 1.7) (layer F.CrtYd) (width 0.1))
    (fp_line (start -2.2 1.7) (end -2.2 -1.7) (layer F.CrtYd) (width 0.1))
    (fp_line (start -1.2 0.4) (end -1.2 0.4) (layer F.SilkS) (width 0.1))
    (fp_line (start -1.1 0.4) (end -1.1 0.4) (layer F.SilkS) (width 0.1))
    (pad 4 smd rect (at -0.525 -0.375 90) (size 0.65 0.75) (layers F.Cu F.Paste F.Mask)
      (net 52 "Net-(Y1-Pad4)"))
    (pad 3 smd rect (at 0.525 -0.375 90) (size 0.65 0.75) (layers F.Cu F.Paste F.Mask)
      (net 53 "Net-(Y1-Pad3)"))
    (pad 2 smd rect (at 0.525 0.375 90) (size 0.65 0.75) (layers F.Cu F.Paste F.Mask)
      (net 54 "Net-(Y1-Pad2)"))
    (pad 1 smd rect (at -0.525 0.375 90) (size 0.65 0.75) (layers F.Cu F.Paste F.Mask)
      (net 55 "Net-(Y1-Pad1)"))
    (model ECS-520-8-47-CKM-TR.stp
      (at (xyz 0 0 0))
      (scale (xyz 1 1 1))
      (rotate (xyz 0 0 0))
    )
  )

  (module Package_LGA:LGA-16_3x3mm_P0.5mm_LayoutBorder3x5y (layer F.Cu) (tedit 5D9F7937) (tstamp 618EC6BB)
    (at 118.03 98.19)
    (descr "LGA, 16 Pin (http://www.st.com/resource/en/datasheet/lis331hh.pdf), generated with kicad-footprint-generator ipc_noLead_generator.py")
    (tags "LGA NoLead")
    (path /618FBB16/618FDD6D)
    (attr smd)
    (fp_text reference U8 (at 0 -2.45) (layer F.SilkS)
      (effects (font (size 1 1) (thickness 0.15)))
    )
    (fp_text value ICM-20601 (at 0 2.45) (layer F.Fab)
      (effects (font (size 1 1) (thickness 0.15)))
    )
    (fp_text user %R (at 0 0 90) (layer F.Fab)
      (effects (font (size 0.75 0.75) (thickness 0.11)))
    )
    (fp_line (start 0.935 -1.61) (end 1.61 -1.61) (layer F.SilkS) (width 0.12))
    (fp_line (start 1.61 -1.61) (end 1.61 -1.435) (layer F.SilkS) (width 0.12))
    (fp_line (start -0.935 1.61) (end -1.61 1.61) (layer F.SilkS) (width 0.12))
    (fp_line (start -1.61 1.61) (end -1.61 1.435) (layer F.SilkS) (width 0.12))
    (fp_line (start 0.935 1.61) (end 1.61 1.61) (layer F.SilkS) (width 0.12))
    (fp_line (start 1.61 1.61) (end 1.61 1.435) (layer F.SilkS) (width 0.12))
    (fp_line (start -0.935 -1.61) (end -1.61 -1.61) (layer F.SilkS) (width 0.12))
    (fp_line (start -0.75 -1.5) (end 1.5 -1.5) (layer F.Fab) (width 0.1))
    (fp_line (start 1.5 -1.5) (end 1.5 1.5) (layer F.Fab) (width 0.1))
    (fp_line (start 1.5 1.5) (end -1.5 1.5) (layer F.Fab) (width 0.1))
    (fp_line (start -1.5 1.5) (end -1.5 -0.75) (layer F.Fab) (width 0.1))
    (fp_line (start -1.5 -0.75) (end -0.75 -1.5) (layer F.Fab) (width 0.1))
    (fp_line (start -1.75 -1.75) (end -1.75 1.75) (layer F.CrtYd) (width 0.05))
    (fp_line (start -1.75 1.75) (end 1.75 1.75) (layer F.CrtYd) (width 0.05))
    (fp_line (start 1.75 1.75) (end 1.75 -1.75) (layer F.CrtYd) (width 0.05))
    (fp_line (start 1.75 -1.75) (end -1.75 -1.75) (layer F.CrtYd) (width 0.05))
    (pad 16 smd roundrect (at -0.5 -1.225) (size 0.35 0.55) (layers F.Cu F.Paste F.Mask) (roundrect_rratio 0.25)
      (net 98 "Net-(U8-Pad16)"))
    (pad 15 smd roundrect (at 0 -1.225) (size 0.35 0.55) (layers F.Cu F.Paste F.Mask) (roundrect_rratio 0.25)
      (net 99 "Net-(U8-Pad10)"))
    (pad 14 smd roundrect (at 0.5 -1.225) (size 0.35 0.55) (layers F.Cu F.Paste F.Mask) (roundrect_rratio 0.25)
      (net 100 "Net-(U8-Pad14)"))
    (pad 13 smd roundrect (at 1.225 -1) (size 0.55 0.35) (layers F.Cu F.Paste F.Mask) (roundrect_rratio 0.25)
      (net 99 "Net-(U8-Pad10)"))
    (pad 12 smd roundrect (at 1.225 -0.5) (size 0.55 0.35) (layers F.Cu F.Paste F.Mask) (roundrect_rratio 0.25)
      (net 99 "Net-(U8-Pad10)"))
    (pad 11 smd roundrect (at 1.225 0) (size 0.55 0.35) (layers F.Cu F.Paste F.Mask) (roundrect_rratio 0.25)
      (net 99 "Net-(U8-Pad10)"))
    (pad 10 smd roundrect (at 1.225 0.5) (size 0.55 0.35) (layers F.Cu F.Paste F.Mask) (roundrect_rratio 0.25)
      (net 99 "Net-(U8-Pad10)"))
    (pad 9 smd roundrect (at 1.225 1) (size 0.55 0.35) (layers F.Cu F.Paste F.Mask) (roundrect_rratio 0.25)
      (net 99 "Net-(U8-Pad10)"))
    (pad 8 smd roundrect (at 0.5 1.225) (size 0.35 0.55) (layers F.Cu F.Paste F.Mask) (roundrect_rratio 0.25)
      (net 101 "Net-(U8-Pad8)"))
    (pad 7 smd roundrect (at 0 1.225) (size 0.35 0.55) (layers F.Cu F.Paste F.Mask) (roundrect_rratio 0.25)
      (net 102 "Net-(U8-Pad7)"))
    (pad 6 smd roundrect (at -0.5 1.225) (size 0.35 0.55) (layers F.Cu F.Paste F.Mask) (roundrect_rratio 0.25)
      (net 103 "Net-(U8-Pad6)"))
    (pad 5 smd roundrect (at -1.225 1) (size 0.55 0.35) (layers F.Cu F.Paste F.Mask) (roundrect_rratio 0.25)
      (net 104 "Net-(U8-Pad5)"))
    (pad 4 smd roundrect (at -1.225 0.5) (size 0.55 0.35) (layers F.Cu F.Paste F.Mask) (roundrect_rratio 0.25)
      (net 105 "Net-(U8-Pad4)"))
    (pad 3 smd roundrect (at -1.225 0) (size 0.55 0.35) (layers F.Cu F.Paste F.Mask) (roundrect_rratio 0.25)
      (net 106 "Net-(U8-Pad3)"))
    (pad 2 smd roundrect (at -1.225 -0.5) (size 0.55 0.35) (layers F.Cu F.Paste F.Mask) (roundrect_rratio 0.25)
      (net 107 "Net-(U8-Pad2)"))
    (pad 1 smd roundrect (at -1.225 -1) (size 0.55 0.35) (layers F.Cu F.Paste F.Mask) (roundrect_rratio 0.25)
      (net 108 "Net-(U8-Pad1)"))
    (model ${KISYS3DMOD}/Package_LGA.3dshapes/LGA-16_3x3mm_P0.5mm_LayoutBorder3x5y.wrl
      (at (xyz 0 0 0))
      (scale (xyz 1 1 1))
      (rotate (xyz 0 0 0))
    )
  )

  (module Package_LGA:LGA-16_3x3mm_P0.5mm (layer F.Cu) (tedit 5AD5B76F) (tstamp 618EC696)
    (at 120.03 103.19)
    (descr http://www.memsic.com/userfiles/files/DataSheets/Magnetic-Sensors-Datasheets/MMC5883MA-RevC.pdf)
    (tags "lga land grid array")
    (path /618FBB16/618FDD67)
    (attr smd)
    (fp_text reference U7 (at 0 -2.7) (layer F.SilkS)
      (effects (font (size 1 1) (thickness 0.15)))
    )
    (fp_text value MMC5883MA (at 0 2.75) (layer F.Fab)
      (effects (font (size 1 1) (thickness 0.15)))
    )
    (fp_text user %R (at 0 0 180) (layer F.Fab)
      (effects (font (size 0.4 0.4) (thickness 0.06)))
    )
    (fp_line (start -1 -1.5) (end 1.5 -1.5) (layer F.Fab) (width 0.1))
    (fp_line (start 1.5 -1.5) (end 1.5 1.5) (layer F.Fab) (width 0.1))
    (fp_line (start 1.5 1.5) (end -1.5 1.5) (layer F.Fab) (width 0.1))
    (fp_line (start -1.5 1.5) (end -1.5 -1) (layer F.Fab) (width 0.1))
    (fp_line (start -1.5 -1) (end -1 -1.5) (layer F.Fab) (width 0.1))
    (fp_line (start 1.1 -1.6) (end 1.6 -1.6) (layer F.SilkS) (width 0.1))
    (fp_line (start 1.6 -1.6) (end 1.6 -1.1) (layer F.SilkS) (width 0.1))
    (fp_line (start 1.6 1.6) (end 1.6 1.1) (layer F.SilkS) (width 0.1))
    (fp_line (start 1.6 1.1) (end 1.6 1.6) (layer F.SilkS) (width 0.1))
    (fp_line (start 1.6 1.6) (end 1.1 1.6) (layer F.SilkS) (width 0.1))
    (fp_line (start -1.6 1.6) (end -1.1 1.6) (layer F.SilkS) (width 0.1))
    (fp_line (start -1.6 1.6) (end -1.6 1.1) (layer F.SilkS) (width 0.1))
    (fp_line (start -1.6 -1.6) (end -1.6 -1.1) (layer F.SilkS) (width 0.1))
    (fp_line (start -1.75 -1.75) (end 1.75 -1.75) (layer F.CrtYd) (width 0.05))
    (fp_line (start 1.75 -1.75) (end 1.75 1.75) (layer F.CrtYd) (width 0.05))
    (fp_line (start 1.75 1.75) (end -1.75 1.75) (layer F.CrtYd) (width 0.05))
    (fp_line (start -1.75 1.75) (end -1.75 -1.75) (layer F.CrtYd) (width 0.05))
    (pad 10 smd rect (at 1.275 0.25 90) (size 0.3 0.45) (layers F.Cu F.Paste F.Mask)
      (net 83 "Net-(U7-Pad10)"))
    (pad 11 smd rect (at 1.275 -0.25 90) (size 0.3 0.45) (layers F.Cu F.Paste F.Mask)
      (net 84 "Net-(U7-Pad11)"))
    (pad 12 smd rect (at 1.275 -0.75 90) (size 0.3 0.45) (layers F.Cu F.Paste F.Mask)
      (net 85 "Net-(U7-Pad12)"))
    (pad 9 smd rect (at 1.275 0.75 90) (size 0.3 0.45) (layers F.Cu F.Paste F.Mask)
      (net 84 "Net-(U7-Pad11)"))
    (pad 5 smd rect (at -0.75 1.275) (size 0.3 0.45) (layers F.Cu F.Paste F.Mask)
      (net 86 "Net-(U7-Pad5)"))
    (pad 7 smd rect (at 0.25 1.275) (size 0.3 0.45) (layers F.Cu F.Paste F.Mask)
      (net 87 "Net-(U7-Pad7)"))
    (pad 6 smd rect (at -0.25 1.275) (size 0.3 0.45) (layers F.Cu F.Paste F.Mask)
      (net 88 "Net-(U7-Pad6)"))
    (pad 8 smd rect (at 0.75 1.275) (size 0.3 0.45) (layers F.Cu F.Paste F.Mask)
      (net 89 "Net-(U7-Pad8)"))
    (pad 4 smd rect (at -1.275 0.75 90) (size 0.3 0.45) (layers F.Cu F.Paste F.Mask)
      (net 90 "Net-(U7-Pad4)"))
    (pad 3 smd rect (at -1.275 0.25 90) (size 0.3 0.45) (layers F.Cu F.Paste F.Mask)
      (net 91 "Net-(U7-Pad3)"))
    (pad 2 smd rect (at -1.275 -0.25 90) (size 0.3 0.45) (layers F.Cu F.Paste F.Mask)
      (net 92 "Net-(U7-Pad2)"))
    (pad 1 smd rect (at -1.275 -0.75 90) (size 0.3 0.45) (layers F.Cu F.Paste F.Mask)
      (net 93 "Net-(U7-Pad1)"))
    (pad 14 smd rect (at 0.25 -1.275) (size 0.3 0.45) (layers F.Cu F.Paste F.Mask)
      (net 94 "Net-(U7-Pad14)"))
    (pad 15 smd rect (at -0.25 -1.275) (size 0.3 0.45) (layers F.Cu F.Paste F.Mask)
      (net 95 "Net-(U7-Pad15)"))
    (pad 16 smd rect (at -0.75 -1.275) (size 0.3 0.45) (layers F.Cu F.Paste F.Mask)
      (net 96 "Net-(U7-Pad16)"))
    (pad 13 smd rect (at 0.75 -1.275) (size 0.3 0.45) (layers F.Cu F.Paste F.Mask)
      (net 97 "Net-(U7-Pad13)"))
    (model ${KISYS3DMOD}/Package_LGA.3dshapes/LGA-16_3x3mm_P0.5mm.wrl
      (at (xyz 0 0 0))
      (scale (xyz 1 1 1))
      (rotate (xyz 0 0 0))
    )
  )

  (module benou-footprints:LiPo_20x30x4 (layer B.Cu) (tedit 618E7BAF) (tstamp 618EE59E)
    (at 115.03 93.19)
    (path /618FB971/61904DCE)
    (fp_text reference U6 (at 0 -0.5) (layer B.SilkS)
      (effects (font (size 1 1) (thickness 0.15)) (justify mirror))
    )
    (fp_text value LiPo_20*30*4 (at 0 0.5) (layer B.Fab)
      (effects (font (size 1 1) (thickness 0.15)) (justify mirror))
    )
    (model ${KIPRJMOD}/3d/200mah20x30-Body.step
      (offset (xyz 0 0 2.5))
      (scale (xyz 1 1 1))
      (rotate (xyz 90 0 0))
    )
  )

  (module Package_TO_SOT_SMD:TSOT-23-5 (layer F.Cu) (tedit 5A02FF57) (tstamp 618EC66C)
    (at 125.34 117.86)
    (descr "5-pin TSOT23 package, http://cds.linear.com/docs/en/packaging/SOT_5_05-08-1635.pdf")
    (tags TSOT-23-5)
    (path /618FB971/61902DEA)
    (attr smd)
    (fp_text reference U5 (at 0 -2.45) (layer F.SilkS)
      (effects (font (size 1 1) (thickness 0.15)))
    )
    (fp_text value LD3985G33R_TSOT23 (at 0 2.5) (layer F.Fab)
      (effects (font (size 1 1) (thickness 0.15)))
    )
    (fp_text user %R (at 0 0 90) (layer F.Fab)
      (effects (font (size 0.5 0.5) (thickness 0.075)))
    )
    (fp_line (start -0.88 1.56) (end 0.88 1.56) (layer F.SilkS) (width 0.12))
    (fp_line (start 0.88 -1.51) (end -1.55 -1.51) (layer F.SilkS) (width 0.12))
    (fp_line (start -0.88 -1) (end -0.43 -1.45) (layer F.Fab) (width 0.1))
    (fp_line (start 0.88 -1.45) (end -0.43 -1.45) (layer F.Fab) (width 0.1))
    (fp_line (start -0.88 -1) (end -0.88 1.45) (layer F.Fab) (width 0.1))
    (fp_line (start 0.88 1.45) (end -0.88 1.45) (layer F.Fab) (width 0.1))
    (fp_line (start 0.88 -1.45) (end 0.88 1.45) (layer F.Fab) (width 0.1))
    (fp_line (start -2.17 -1.7) (end 2.17 -1.7) (layer F.CrtYd) (width 0.05))
    (fp_line (start -2.17 -1.7) (end -2.17 1.7) (layer F.CrtYd) (width 0.05))
    (fp_line (start 2.17 1.7) (end 2.17 -1.7) (layer F.CrtYd) (width 0.05))
    (fp_line (start 2.17 1.7) (end -2.17 1.7) (layer F.CrtYd) (width 0.05))
    (pad 5 smd rect (at 1.31 -0.95) (size 1.22 0.65) (layers F.Cu F.Paste F.Mask)
      (net 47 "Net-(U5-Pad5)"))
    (pad 4 smd rect (at 1.31 0.95) (size 1.22 0.65) (layers F.Cu F.Paste F.Mask)
      (net 48 "Net-(U5-Pad4)"))
    (pad 3 smd rect (at -1.31 0.95) (size 1.22 0.65) (layers F.Cu F.Paste F.Mask)
      (net 49 "Net-(U5-Pad3)"))
    (pad 2 smd rect (at -1.31 0) (size 1.22 0.65) (layers F.Cu F.Paste F.Mask)
      (net 50 "Net-(U5-Pad2)"))
    (pad 1 smd rect (at -1.31 -0.95) (size 1.22 0.65) (layers F.Cu F.Paste F.Mask)
      (net 51 "Net-(U5-Pad1)"))
    (model ${KISYS3DMOD}/Package_TO_SOT_SMD.3dshapes/TSOT-23-5.wrl
      (at (xyz 0 0 0))
      (scale (xyz 1 1 1))
      (rotate (xyz 0 0 0))
    )
  )

  (module Package_TO_SOT_SMD:TSOT-23-5 (layer F.Cu) (tedit 5A02FF57) (tstamp 618EC657)
    (at 119.95 117.86)
    (descr "5-pin TSOT23 package, http://cds.linear.com/docs/en/packaging/SOT_5_05-08-1635.pdf")
    (tags TSOT-23-5)
    (path /618FB971/6190180B)
    (attr smd)
    (fp_text reference U4 (at 0 -2.45) (layer F.SilkS)
      (effects (font (size 1 1) (thickness 0.15)))
    )
    (fp_text value LTC4054XES5-4.2 (at 0 2.5) (layer F.Fab)
      (effects (font (size 1 1) (thickness 0.15)))
    )
    (fp_text user %R (at 0 0 90) (layer F.Fab)
      (effects (font (size 0.5 0.5) (thickness 0.075)))
    )
    (fp_line (start -0.88 1.56) (end 0.88 1.56) (layer F.SilkS) (width 0.12))
    (fp_line (start 0.88 -1.51) (end -1.55 -1.51) (layer F.SilkS) (width 0.12))
    (fp_line (start -0.88 -1) (end -0.43 -1.45) (layer F.Fab) (width 0.1))
    (fp_line (start 0.88 -1.45) (end -0.43 -1.45) (layer F.Fab) (width 0.1))
    (fp_line (start -0.88 -1) (end -0.88 1.45) (layer F.Fab) (width 0.1))
    (fp_line (start 0.88 1.45) (end -0.88 1.45) (layer F.Fab) (width 0.1))
    (fp_line (start 0.88 -1.45) (end 0.88 1.45) (layer F.Fab) (width 0.1))
    (fp_line (start -2.17 -1.7) (end 2.17 -1.7) (layer F.CrtYd) (width 0.05))
    (fp_line (start -2.17 -1.7) (end -2.17 1.7) (layer F.CrtYd) (width 0.05))
    (fp_line (start 2.17 1.7) (end 2.17 -1.7) (layer F.CrtYd) (width 0.05))
    (fp_line (start 2.17 1.7) (end -2.17 1.7) (layer F.CrtYd) (width 0.05))
    (pad 5 smd rect (at 1.31 -0.95) (size 1.22 0.65) (layers F.Cu F.Paste F.Mask)
      (net 42 "Net-(U4-Pad5)"))
    (pad 4 smd rect (at 1.31 0.95) (size 1.22 0.65) (layers F.Cu F.Paste F.Mask)
      (net 43 "Net-(U4-Pad4)"))
    (pad 3 smd rect (at -1.31 0.95) (size 1.22 0.65) (layers F.Cu F.Paste F.Mask)
      (net 44 "Net-(U4-Pad3)"))
    (pad 2 smd rect (at -1.31 0) (size 1.22 0.65) (layers F.Cu F.Paste F.Mask)
      (net 45 "Net-(U4-Pad2)"))
    (pad 1 smd rect (at -1.31 -0.95) (size 1.22 0.65) (layers F.Cu F.Paste F.Mask)
      (net 46 "Net-(U4-Pad1)"))
    (model ${KISYS3DMOD}/Package_TO_SOT_SMD.3dshapes/TSOT-23-5.wrl
      (at (xyz 0 0 0))
      (scale (xyz 1 1 1))
      (rotate (xyz 0 0 0))
    )
  )

  (module Package_DFN_QFN:QFN-24-1EP_4x4mm_P0.5mm_EP2.7x2.7mm_ThermalVias (layer F.Cu) (tedit 5DC5F6A3) (tstamp 618EC642)
    (at 124.57 97.56)
    (descr "QFN, 24 Pin (http://www.alfarzpp.lv/eng/sc/AS3330.pdf), generated with kicad-footprint-generator ipc_noLead_generator.py")
    (tags "QFN NoLead")
    (path /618FB7C9/618FF21C)
    (attr smd)
    (fp_text reference U3 (at 0 -3.32) (layer F.SilkS)
      (effects (font (size 1 1) (thickness 0.15)))
    )
    (fp_text value SX1280 (at 0 3.32) (layer F.Fab)
      (effects (font (size 1 1) (thickness 0.15)))
    )
    (fp_text user %R (at 0 0) (layer F.Fab)
      (effects (font (size 1 1) (thickness 0.15)))
    )
    (fp_line (start 1.635 -2.11) (end 2.11 -2.11) (layer F.SilkS) (width 0.12))
    (fp_line (start 2.11 -2.11) (end 2.11 -1.635) (layer F.SilkS) (width 0.12))
    (fp_line (start -1.635 2.11) (end -2.11 2.11) (layer F.SilkS) (width 0.12))
    (fp_line (start -2.11 2.11) (end -2.11 1.635) (layer F.SilkS) (width 0.12))
    (fp_line (start 1.635 2.11) (end 2.11 2.11) (layer F.SilkS) (width 0.12))
    (fp_line (start 2.11 2.11) (end 2.11 1.635) (layer F.SilkS) (width 0.12))
    (fp_line (start -1.635 -2.11) (end -2.11 -2.11) (layer F.SilkS) (width 0.12))
    (fp_line (start -1 -2) (end 2 -2) (layer F.Fab) (width 0.1))
    (fp_line (start 2 -2) (end 2 2) (layer F.Fab) (width 0.1))
    (fp_line (start 2 2) (end -2 2) (layer F.Fab) (width 0.1))
    (fp_line (start -2 2) (end -2 -1) (layer F.Fab) (width 0.1))
    (fp_line (start -2 -1) (end -1 -2) (layer F.Fab) (width 0.1))
    (fp_line (start -2.62 -2.62) (end -2.62 2.62) (layer F.CrtYd) (width 0.05))
    (fp_line (start -2.62 2.62) (end 2.62 2.62) (layer F.CrtYd) (width 0.05))
    (fp_line (start 2.62 2.62) (end 2.62 -2.62) (layer F.CrtYd) (width 0.05))
    (fp_line (start 2.62 -2.62) (end -2.62 -2.62) (layer F.CrtYd) (width 0.05))
    (pad "" smd roundrect (at 0.675 0.675) (size 1.17 1.17) (layers F.Paste) (roundrect_rratio 0.213675))
    (pad "" smd roundrect (at 0.675 -0.675) (size 1.17 1.17) (layers F.Paste) (roundrect_rratio 0.213675))
    (pad "" smd roundrect (at -0.675 0.675) (size 1.17 1.17) (layers F.Paste) (roundrect_rratio 0.213675))
    (pad "" smd roundrect (at -0.675 -0.675) (size 1.17 1.17) (layers F.Paste) (roundrect_rratio 0.213675))
    (pad 25 smd rect (at 0 0) (size 2.7 2.7) (layers B.Cu)
      (net 62 "Net-(U3-Pad25)"))
    (pad 25 thru_hole circle (at 1.1 1.1) (size 0.5 0.5) (drill 0.2) (layers *.Cu)
      (net 62 "Net-(U3-Pad25)"))
    (pad 25 thru_hole circle (at 0 1.1) (size 0.5 0.5) (drill 0.2) (layers *.Cu)
      (net 62 "Net-(U3-Pad25)"))
    (pad 25 thru_hole circle (at -1.1 1.1) (size 0.5 0.5) (drill 0.2) (layers *.Cu)
      (net 62 "Net-(U3-Pad25)"))
    (pad 25 thru_hole circle (at 1.1 0) (size 0.5 0.5) (drill 0.2) (layers *.Cu)
      (net 62 "Net-(U3-Pad25)"))
    (pad 25 thru_hole circle (at 0 0) (size 0.5 0.5) (drill 0.2) (layers *.Cu)
      (net 62 "Net-(U3-Pad25)"))
    (pad 25 thru_hole circle (at -1.1 0) (size 0.5 0.5) (drill 0.2) (layers *.Cu)
      (net 62 "Net-(U3-Pad25)"))
    (pad 25 thru_hole circle (at 1.1 -1.1) (size 0.5 0.5) (drill 0.2) (layers *.Cu)
      (net 62 "Net-(U3-Pad25)"))
    (pad 25 thru_hole circle (at 0 -1.1) (size 0.5 0.5) (drill 0.2) (layers *.Cu)
      (net 62 "Net-(U3-Pad25)"))
    (pad 25 thru_hole circle (at -1.1 -1.1) (size 0.5 0.5) (drill 0.2) (layers *.Cu)
      (net 62 "Net-(U3-Pad25)"))
    (pad 25 smd rect (at 0 0) (size 2.7 2.7) (layers F.Cu F.Mask)
      (net 62 "Net-(U3-Pad25)"))
    (pad 24 smd roundrect (at -1.25 -1.9625) (size 0.25 0.825) (layers F.Cu F.Paste F.Mask) (roundrect_rratio 0.25)
      (net 63 "Net-(U3-Pad24)"))
    (pad 23 smd roundrect (at -0.75 -1.9625) (size 0.25 0.825) (layers F.Cu F.Paste F.Mask) (roundrect_rratio 0.25)
      (net 64 "Net-(U3-Pad23)"))
    (pad 22 smd roundrect (at -0.25 -1.9625) (size 0.25 0.825) (layers F.Cu F.Paste F.Mask) (roundrect_rratio 0.25)
      (net 65 "Net-(U3-Pad22)"))
    (pad 21 smd roundrect (at 0.25 -1.9625) (size 0.25 0.825) (layers F.Cu F.Paste F.Mask) (roundrect_rratio 0.25)
      (net 66 "Net-(U3-Pad21)"))
    (pad 20 smd roundrect (at 0.75 -1.9625) (size 0.25 0.825) (layers F.Cu F.Paste F.Mask) (roundrect_rratio 0.25)
      (net 67 "Net-(U3-Pad20)"))
    (pad 19 smd roundrect (at 1.25 -1.9625) (size 0.25 0.825) (layers F.Cu F.Paste F.Mask) (roundrect_rratio 0.25)
      (net 68 "Net-(U3-Pad19)"))
    (pad 18 smd roundrect (at 1.9625 -1.25) (size 0.825 0.25) (layers F.Cu F.Paste F.Mask) (roundrect_rratio 0.25)
      (net 69 "Net-(U3-Pad18)"))
    (pad 17 smd roundrect (at 1.9625 -0.75) (size 0.825 0.25) (layers F.Cu F.Paste F.Mask) (roundrect_rratio 0.25)
      (net 70 "Net-(U3-Pad17)"))
    (pad 16 smd roundrect (at 1.9625 -0.25) (size 0.825 0.25) (layers F.Cu F.Paste F.Mask) (roundrect_rratio 0.25)
      (net 71 "Net-(U3-Pad16)"))
    (pad 15 smd roundrect (at 1.9625 0.25) (size 0.825 0.25) (layers F.Cu F.Paste F.Mask) (roundrect_rratio 0.25)
      (net 72 "Net-(U3-Pad15)"))
    (pad 14 smd roundrect (at 1.9625 0.75) (size 0.825 0.25) (layers F.Cu F.Paste F.Mask) (roundrect_rratio 0.25)
      (net 73 "Net-(U3-Pad14)"))
    (pad 13 smd roundrect (at 1.9625 1.25) (size 0.825 0.25) (layers F.Cu F.Paste F.Mask) (roundrect_rratio 0.25)
      (net 74 "Net-(U3-Pad13)"))
    (pad 12 smd roundrect (at 1.25 1.9625) (size 0.25 0.825) (layers F.Cu F.Paste F.Mask) (roundrect_rratio 0.25)
      (net 75 "Net-(U3-Pad12)"))
    (pad 11 smd roundrect (at 0.75 1.9625) (size 0.25 0.825) (layers F.Cu F.Paste F.Mask) (roundrect_rratio 0.25)
      (net 76 "Net-(U3-Pad11)"))
    (pad 10 smd roundrect (at 0.25 1.9625) (size 0.25 0.825) (layers F.Cu F.Paste F.Mask) (roundrect_rratio 0.25)
      (net 77 "Net-(U3-Pad10)"))
    (pad 9 smd roundrect (at -0.25 1.9625) (size 0.25 0.825) (layers F.Cu F.Paste F.Mask) (roundrect_rratio 0.25)
      (net 78 "Net-(U3-Pad9)"))
    (pad 8 smd roundrect (at -0.75 1.9625) (size 0.25 0.825) (layers F.Cu F.Paste F.Mask) (roundrect_rratio 0.25)
      (net 79 "Net-(U3-Pad8)"))
    (pad 7 smd roundrect (at -1.25 1.9625) (size 0.25 0.825) (layers F.Cu F.Paste F.Mask) (roundrect_rratio 0.25)
      (net 80 "Net-(U3-Pad7)"))
    (pad 6 smd roundrect (at -1.9625 1.25) (size 0.825 0.25) (layers F.Cu F.Paste F.Mask) (roundrect_rratio 0.25)
      (net 81 "Net-(U3-Pad6)"))
    (pad 5 smd roundrect (at -1.9625 0.75) (size 0.825 0.25) (layers F.Cu F.Paste F.Mask) (roundrect_rratio 0.25)
      (net 82 "Net-(U3-Pad5)"))
    (pad 4 smd roundrect (at -1.9625 0.25) (size 0.825 0.25) (layers F.Cu F.Paste F.Mask) (roundrect_rratio 0.25)
      (net 38 "Net-(U3-Pad4)"))
    (pad 3 smd roundrect (at -1.9625 -0.25) (size 0.825 0.25) (layers F.Cu F.Paste F.Mask) (roundrect_rratio 0.25)
      (net 39 "Net-(U3-Pad3)"))
    (pad 2 smd roundrect (at -1.9625 -0.75) (size 0.825 0.25) (layers F.Cu F.Paste F.Mask) (roundrect_rratio 0.25)
      (net 40 "Net-(U3-Pad2)"))
    (pad 1 smd roundrect (at -1.9625 -1.25) (size 0.825 0.25) (layers F.Cu F.Paste F.Mask) (roundrect_rratio 0.25)
      (net 41 "Net-(U3-Pad1)"))
    (model ${KISYS3DMOD}/Package_DFN_QFN.3dshapes/QFN-24-1EP_4x4mm_P0.5mm_EP2.7x2.7mm.wrl
      (at (xyz 0 0 0))
      (scale (xyz 1 1 1))
      (rotate (xyz 0 0 0))
    )
  )

  (module benou-footprints:2450FM07D0034T (layer F.Cu) (tedit 0) (tstamp 618EC58A)
    (at 130.14 101.065)
    (descr 2450FM07D0034T-3)
    (tags Filter)
    (path /618FB7C9/618FF20A)
    (attr smd)
    (fp_text reference U1 (at 0 0) (layer F.SilkS)
      (effects (font (size 1.27 1.27) (thickness 0.254)))
    )
    (fp_text value 2450FM07D0034T (at 0 0) (layer F.SilkS) hide
      (effects (font (size 1.27 1.27) (thickness 0.254)))
    )
    (fp_arc (start -1.3 0) (end -1.3 0.1) (angle -180) (layer F.SilkS) (width 0.2))
    (fp_arc (start -1.3 0) (end -1.3 -0.1) (angle -180) (layer F.SilkS) (width 0.2))
    (fp_text user %R (at 0 0) (layer F.Fab)
      (effects (font (size 1.27 1.27) (thickness 0.254)))
    )
    (fp_line (start -0.5 -0.25) (end 0.5 -0.25) (layer F.Fab) (width 0.2))
    (fp_line (start 0.5 -0.25) (end 0.5 0.25) (layer F.Fab) (width 0.2))
    (fp_line (start 0.5 0.25) (end -0.5 0.25) (layer F.Fab) (width 0.2))
    (fp_line (start -0.5 0.25) (end -0.5 -0.25) (layer F.Fab) (width 0.2))
    (fp_line (start -1.875 -1.6) (end 1.875 -1.6) (layer F.CrtYd) (width 0.1))
    (fp_line (start 1.875 -1.6) (end 1.875 1.6) (layer F.CrtYd) (width 0.1))
    (fp_line (start 1.875 1.6) (end -1.875 1.6) (layer F.CrtYd) (width 0.1))
    (fp_line (start -1.875 1.6) (end -1.875 -1.6) (layer F.CrtYd) (width 0.1))
    (fp_line (start -1.3 -0.1) (end -1.3 -0.1) (layer F.SilkS) (width 0.2))
    (fp_line (start -1.3 0.1) (end -1.3 0.1) (layer F.SilkS) (width 0.2))
    (pad 4 smd rect (at 0 -0.35) (size 0.3 0.5) (layers F.Cu F.Paste F.Mask)
      (net 1 "Net-(U1-Pad4)"))
    (pad 3 smd rect (at 0.6 0 90) (size 0.55 0.55) (layers F.Cu F.Paste F.Mask)
      (net 2 "Net-(U1-Pad3)"))
    (pad 2 smd rect (at 0 0.35) (size 0.3 0.5) (layers F.Cu F.Paste F.Mask)
      (net 3 "Net-(U1-Pad2)"))
    (pad 1 smd rect (at -0.6 0 90) (size 0.55 0.55) (layers F.Cu F.Paste F.Mask)
      (net 4 "Net-(U1-Pad1)"))
  )

  (module Package_DFN_QFN:QFN-32-1EP_5x5mm_P0.5mm_EP3.45x3.45mm (layer F.Cu) (tedit 5DC5F6A4) (tstamp 618EAEC6)
    (at 126.88 109.19)
    (descr "QFN, 32 Pin (http://www.analog.com/media/en/package-pcb-resources/package/pkg_pdf/ltc-legacy-qfn/QFN_32_05-08-1693.pdf), generated with kicad-footprint-generator ipc_noLead_generator.py")
    (tags "QFN NoLead")
    (path /618D31FE)
    (attr smd)
    (fp_text reference U2 (at 0 -3.82) (layer F.SilkS)
      (effects (font (size 1 1) (thickness 0.15)))
    )
    (fp_text value STM32L432KCUx (at 0 3.82) (layer F.Fab)
      (effects (font (size 1 1) (thickness 0.15)))
    )
    (fp_text user %R (at 0 0) (layer F.Fab)
      (effects (font (size 1 1) (thickness 0.15)))
    )
    (fp_line (start 2.135 -2.61) (end 2.61 -2.61) (layer F.SilkS) (width 0.12))
    (fp_line (start 2.61 -2.61) (end 2.61 -2.135) (layer F.SilkS) (width 0.12))
    (fp_line (start -2.135 2.61) (end -2.61 2.61) (layer F.SilkS) (width 0.12))
    (fp_line (start -2.61 2.61) (end -2.61 2.135) (layer F.SilkS) (width 0.12))
    (fp_line (start 2.135 2.61) (end 2.61 2.61) (layer F.SilkS) (width 0.12))
    (fp_line (start 2.61 2.61) (end 2.61 2.135) (layer F.SilkS) (width 0.12))
    (fp_line (start -2.135 -2.61) (end -2.61 -2.61) (layer F.SilkS) (width 0.12))
    (fp_line (start -1.5 -2.5) (end 2.5 -2.5) (layer F.Fab) (width 0.1))
    (fp_line (start 2.5 -2.5) (end 2.5 2.5) (layer F.Fab) (width 0.1))
    (fp_line (start 2.5 2.5) (end -2.5 2.5) (layer F.Fab) (width 0.1))
    (fp_line (start -2.5 2.5) (end -2.5 -1.5) (layer F.Fab) (width 0.1))
    (fp_line (start -2.5 -1.5) (end -1.5 -2.5) (layer F.Fab) (width 0.1))
    (fp_line (start -3.12 -3.12) (end -3.12 3.12) (layer F.CrtYd) (width 0.05))
    (fp_line (start -3.12 3.12) (end 3.12 3.12) (layer F.CrtYd) (width 0.05))
    (fp_line (start 3.12 3.12) (end 3.12 -3.12) (layer F.CrtYd) (width 0.05))
    (fp_line (start 3.12 -3.12) (end -3.12 -3.12) (layer F.CrtYd) (width 0.05))
    (pad "" smd roundrect (at 1.15 1.15) (size 0.93 0.93) (layers F.Paste) (roundrect_rratio 0.25))
    (pad "" smd roundrect (at 1.15 0) (size 0.93 0.93) (layers F.Paste) (roundrect_rratio 0.25))
    (pad "" smd roundrect (at 1.15 -1.15) (size 0.93 0.93) (layers F.Paste) (roundrect_rratio 0.25))
    (pad "" smd roundrect (at 0 1.15) (size 0.93 0.93) (layers F.Paste) (roundrect_rratio 0.25))
    (pad "" smd roundrect (at 0 0) (size 0.93 0.93) (layers F.Paste) (roundrect_rratio 0.25))
    (pad "" smd roundrect (at 0 -1.15) (size 0.93 0.93) (layers F.Paste) (roundrect_rratio 0.25))
    (pad "" smd roundrect (at -1.15 1.15) (size 0.93 0.93) (layers F.Paste) (roundrect_rratio 0.25))
    (pad "" smd roundrect (at -1.15 0) (size 0.93 0.93) (layers F.Paste) (roundrect_rratio 0.25))
    (pad "" smd roundrect (at -1.15 -1.15) (size 0.93 0.93) (layers F.Paste) (roundrect_rratio 0.25))
    (pad 33 smd rect (at 0 0) (size 3.45 3.45) (layers F.Cu F.Mask)
      (net 5 "Net-(U2-Pad33)"))
    (pad 32 smd roundrect (at -1.75 -2.4375) (size 0.25 0.875) (layers F.Cu F.Paste F.Mask) (roundrect_rratio 0.25)
      (net 6 "Net-(U2-Pad32)"))
    (pad 31 smd roundrect (at -1.25 -2.4375) (size 0.25 0.875) (layers F.Cu F.Paste F.Mask) (roundrect_rratio 0.25)
      (net 7 "Net-(U2-Pad31)"))
    (pad 30 smd roundrect (at -0.75 -2.4375) (size 0.25 0.875) (layers F.Cu F.Paste F.Mask) (roundrect_rratio 0.25)
      (net 8 "Net-(U2-Pad30)"))
    (pad 29 smd roundrect (at -0.25 -2.4375) (size 0.25 0.875) (layers F.Cu F.Paste F.Mask) (roundrect_rratio 0.25)
      (net 9 "Net-(U2-Pad29)"))
    (pad 28 smd roundrect (at 0.25 -2.4375) (size 0.25 0.875) (layers F.Cu F.Paste F.Mask) (roundrect_rratio 0.25)
      (net 10 "Net-(U2-Pad28)"))
    (pad 27 smd roundrect (at 0.75 -2.4375) (size 0.25 0.875) (layers F.Cu F.Paste F.Mask) (roundrect_rratio 0.25)
      (net 11 "Net-(U2-Pad27)"))
    (pad 26 smd roundrect (at 1.25 -2.4375) (size 0.25 0.875) (layers F.Cu F.Paste F.Mask) (roundrect_rratio 0.25)
      (net 12 "Net-(U2-Pad26)"))
    (pad 25 smd roundrect (at 1.75 -2.4375) (size 0.25 0.875) (layers F.Cu F.Paste F.Mask) (roundrect_rratio 0.25)
      (net 13 "Net-(U2-Pad25)"))
    (pad 24 smd roundrect (at 2.4375 -1.75) (size 0.875 0.25) (layers F.Cu F.Paste F.Mask) (roundrect_rratio 0.25)
      (net 14 "Net-(U2-Pad24)"))
    (pad 23 smd roundrect (at 2.4375 -1.25) (size 0.875 0.25) (layers F.Cu F.Paste F.Mask) (roundrect_rratio 0.25)
      (net 15 "Net-(U2-Pad23)"))
    (pad 22 smd roundrect (at 2.4375 -0.75) (size 0.875 0.25) (layers F.Cu F.Paste F.Mask) (roundrect_rratio 0.25)
      (net 16 "Net-(U2-Pad22)"))
    (pad 21 smd roundrect (at 2.4375 -0.25) (size 0.875 0.25) (layers F.Cu F.Paste F.Mask) (roundrect_rratio 0.25)
      (net 17 "Net-(U2-Pad21)"))
    (pad 20 smd roundrect (at 2.4375 0.25) (size 0.875 0.25) (layers F.Cu F.Paste F.Mask) (roundrect_rratio 0.25)
      (net 18 "Net-(U2-Pad20)"))
    (pad 19 smd roundrect (at 2.4375 0.75) (size 0.875 0.25) (layers F.Cu F.Paste F.Mask) (roundrect_rratio 0.25)
      (net 19 "Net-(U2-Pad19)"))
    (pad 18 smd roundrect (at 2.4375 1.25) (size 0.875 0.25) (layers F.Cu F.Paste F.Mask) (roundrect_rratio 0.25)
      (net 20 "Net-(U2-Pad18)"))
    (pad 17 smd roundrect (at 2.4375 1.75) (size 0.875 0.25) (layers F.Cu F.Paste F.Mask) (roundrect_rratio 0.25)
      (net 21 "Net-(U2-Pad17)"))
    (pad 16 smd roundrect (at 1.75 2.4375) (size 0.25 0.875) (layers F.Cu F.Paste F.Mask) (roundrect_rratio 0.25)
      (net 22 "Net-(U2-Pad16)"))
    (pad 15 smd roundrect (at 1.25 2.4375) (size 0.25 0.875) (layers F.Cu F.Paste F.Mask) (roundrect_rratio 0.25)
      (net 23 "Net-(U2-Pad15)"))
    (pad 14 smd roundrect (at 0.75 2.4375) (size 0.25 0.875) (layers F.Cu F.Paste F.Mask) (roundrect_rratio 0.25)
      (net 24 "Net-(U2-Pad14)"))
    (pad 13 smd roundrect (at 0.25 2.4375) (size 0.25 0.875) (layers F.Cu F.Paste F.Mask) (roundrect_rratio 0.25)
      (net 25 "Net-(U2-Pad13)"))
    (pad 12 smd roundrect (at -0.25 2.4375) (size 0.25 0.875) (layers F.Cu F.Paste F.Mask) (roundrect_rratio 0.25)
      (net 26 "Net-(U2-Pad12)"))
    (pad 11 smd roundrect (at -0.75 2.4375) (size 0.25 0.875) (layers F.Cu F.Paste F.Mask) (roundrect_rratio 0.25)
      (net 27 "Net-(U2-Pad11)"))
    (pad 10 smd roundrect (at -1.25 2.4375) (size 0.25 0.875) (layers F.Cu F.Paste F.Mask) (roundrect_rratio 0.25)
      (net 28 "Net-(U2-Pad10)"))
    (pad 9 smd roundrect (at -1.75 2.4375) (size 0.25 0.875) (layers F.Cu F.Paste F.Mask) (roundrect_rratio 0.25)
      (net 29 "Net-(U2-Pad9)"))
    (pad 8 smd roundrect (at -2.4375 1.75) (size 0.875 0.25) (layers F.Cu F.Paste F.Mask) (roundrect_rratio 0.25)
      (net 30 "Net-(U2-Pad8)"))
    (pad 7 smd roundrect (at -2.4375 1.25) (size 0.875 0.25) (layers F.Cu F.Paste F.Mask) (roundrect_rratio 0.25)
      (net 31 "Net-(U2-Pad7)"))
    (pad 6 smd roundrect (at -2.4375 0.75) (size 0.875 0.25) (layers F.Cu F.Paste F.Mask) (roundrect_rratio 0.25)
      (net 32 "Net-(U2-Pad6)"))
    (pad 5 smd roundrect (at -2.4375 0.25) (size 0.875 0.25) (layers F.Cu F.Paste F.Mask) (roundrect_rratio 0.25)
      (net 33 "Net-(U2-Pad5)"))
    (pad 4 smd roundrect (at -2.4375 -0.25) (size 0.875 0.25) (layers F.Cu F.Paste F.Mask) (roundrect_rratio 0.25)
      (net 34 "Net-(U2-Pad4)"))
    (pad 3 smd roundrect (at -2.4375 -0.75) (size 0.875 0.25) (layers F.Cu F.Paste F.Mask) (roundrect_rratio 0.25)
      (net 35 "Net-(U2-Pad3)"))
    (pad 2 smd roundrect (at -2.4375 -1.25) (size 0.875 0.25) (layers F.Cu F.Paste F.Mask) (roundrect_rratio 0.25)
      (net 36 "Net-(U2-Pad2)"))
    (pad 1 smd roundrect (at -2.4375 -1.75) (size 0.875 0.25) (layers F.Cu F.Paste F.Mask) (roundrect_rratio 0.25)
      (net 37 "Net-(U2-Pad1)"))
    (model ${KISYS3DMOD}/Package_DFN_QFN.3dshapes/QFN-32-1EP_5x5mm_P0.5mm_EP3.45x3.45mm.wrl
      (at (xyz 0 0 0))
      (scale (xyz 1 1 1))
      (rotate (xyz 0 0 0))
    )
  )

  (gr_line (start 113.03 93.19) (end 113.03 123.19) (layer Edge.Cuts) (width 0.05) (tstamp 618E4FCA))
  (gr_line (start 133.03 93.19) (end 113.03 93.19) (layer Edge.Cuts) (width 0.05))
  (gr_line (start 133.03 123.19) (end 133.03 93.19) (layer Edge.Cuts) (width 0.05))
  (gr_line (start 113.03 123.19) (end 133.03 123.19) (layer Edge.Cuts) (width 0.05))

)
