M48
METRIC,TZ
T1C0.650
T2C1.000
%
G90
G05
T1
X176100Y-91560
X176100Y-92830
X176100Y-94100
X176100Y-95370
X176100Y-96640
T2
X164190Y-86150
X164190Y-91230
X164190Y-98850
X171810Y-86150
X171810Y-88690
X171810Y-91230
X171810Y-93770
X171810Y-96310
X171810Y-98850
T0
M30
