EESchema Schematic File Version 4
EELAYER 30 0
EELAYER END
$Descr A4 11693 8268
encoding utf-8
Sheet 2 4
Title "Input CV attenuverter and offset control"
Date ""
Rev ""
Comp ""
Comment1 ""
Comment2 ""
Comment3 ""
Comment4 ""
$EndDescr
Text HLabel 1650 1400 0    50   Input ~ 0
in0
Text HLabel 1650 2600 0    50   Input ~ 0
in1
Text HLabel 1650 3850 0    50   Input ~ 0
in2
Text HLabel 1650 5100 0    50   Input ~ 0
in3
Text HLabel 8500 1600 2    50   Input ~ 0
out0
Text HLabel 8500 2800 2    50   Input ~ 0
out1
Text HLabel 8500 4050 2    50   Input ~ 0
out2
Text HLabel 8500 5300 2    50   Input ~ 0
out3
$Comp
L Device:R_POT RV?
U 1 1 5FBC780E
P 2200 1700
AR Path="/5FBC780E" Ref="RV?"  Part="1" 
AR Path="/5FB8B9E0/5FBC780E" Ref="RV1"  Part="1" 
F 0 "RV1" H 2131 1746 50  0000 R CNN
F 1 "20K" H 2131 1655 50  0000 R CNN
F 2 "benou-footprints:Potentiometer_Alpha_RD901F-40-00D_Single_Vertical_CircularHoles" H 2200 1700 50  0001 C CNN
F 3 "~" H 2200 1700 50  0001 C CNN
	1    2200 1700
	1    0    0    -1  
$EndComp
$Comp
L Device:R R2
U 1 1 5FBEDA46
P 2550 1550
F 0 "R2" H 2620 1596 50  0000 L CNN
F 1 "10K" H 2620 1505 50  0000 L CNN
F 2 "Resistor_SMD:R_0603_1608Metric" V 2480 1550 50  0001 C CNN
F 3 "~" H 2550 1550 50  0001 C CNN
	1    2550 1550
	1    0    0    -1  
$EndComp
$Comp
L Device:R R3
U 1 1 5FBEE63B
P 2550 1850
F 0 "R3" H 2620 1896 50  0000 L CNN
F 1 "10K" H 2620 1805 50  0000 L CNN
F 2 "Resistor_SMD:R_0603_1608Metric" V 2480 1850 50  0001 C CNN
F 3 "~" H 2550 1850 50  0001 C CNN
	1    2550 1850
	1    0    0    -1  
$EndComp
$Comp
L Device:R R10
U 1 1 5FBF1C0B
P 3050 1400
F 0 "R10" V 2843 1400 50  0000 C CNN
F 1 "20K" V 2934 1400 50  0000 C CNN
F 2 "Resistor_SMD:R_0603_1608Metric" V 2980 1400 50  0001 C CNN
F 3 "~" H 3050 1400 50  0001 C CNN
	1    3050 1400
	0    1    1    0   
$EndComp
$Comp
L Device:R R14
U 1 1 5FBF2043
P 3700 1050
F 0 "R14" V 3493 1050 50  0000 C CNN
F 1 "20K" V 3584 1050 50  0000 C CNN
F 2 "Resistor_SMD:R_0603_1608Metric" V 3630 1050 50  0001 C CNN
F 3 "~" H 3700 1050 50  0001 C CNN
	1    3700 1050
	0    1    1    0   
$EndComp
Wire Wire Line
	1650 1400 2200 1400
Connection ~ 2550 1400
Wire Wire Line
	2550 1400 2900 1400
Wire Wire Line
	3200 1400 3300 1400
Wire Wire Line
	3300 1400 3300 1050
Wire Wire Line
	3300 1050 3550 1050
Connection ~ 3300 1400
Wire Wire Line
	3300 1400 3400 1400
Wire Wire Line
	3850 1050 4150 1050
Wire Wire Line
	4150 1050 4150 1500
Wire Wire Line
	4000 1500 4150 1500
Wire Wire Line
	2200 1550 2200 1400
Connection ~ 2200 1400
Wire Wire Line
	2200 1400 2550 1400
Wire Wire Line
	2350 1700 2550 1700
Connection ~ 2550 1700
Wire Wire Line
	2550 1700 3100 1700
Wire Wire Line
	3100 1700 3100 1600
Wire Wire Line
	3100 1600 3400 1600
Wire Wire Line
	2200 1850 2200 2000
Wire Wire Line
	2200 2000 2350 2000
$Comp
L power:GND #PWR?
U 1 1 5FBF96BD
P 2350 2000
AR Path="/5FBF96BD" Ref="#PWR?"  Part="1" 
AR Path="/5FB8B9E0/5FBF96BD" Ref="#PWR013"  Part="1" 
F 0 "#PWR013" H 2350 1750 50  0001 C CNN
F 1 "GND" V 2355 1872 50  0000 R CNN
F 2 "" H 2350 2000 50  0001 C CNN
F 3 "" H 2350 2000 50  0001 C CNN
	1    2350 2000
	1    0    0    -1  
$EndComp
$Comp
L Device:R_POT RV?
U 1 1 5FC04421
P 2200 2900
AR Path="/5FC04421" Ref="RV?"  Part="1" 
AR Path="/5FB8B9E0/5FC04421" Ref="RV2"  Part="1" 
F 0 "RV2" H 2131 2946 50  0000 R CNN
F 1 "20K" H 2131 2855 50  0000 R CNN
F 2 "benou-footprints:Potentiometer_Alpha_RD901F-40-00D_Single_Vertical_CircularHoles" H 2200 2900 50  0001 C CNN
F 3 "~" H 2200 2900 50  0001 C CNN
	1    2200 2900
	1    0    0    -1  
$EndComp
$Comp
L Device:R R4
U 1 1 5FC0442D
P 2550 2750
F 0 "R4" H 2620 2796 50  0000 L CNN
F 1 "10K" H 2620 2705 50  0000 L CNN
F 2 "Resistor_SMD:R_0603_1608Metric" V 2480 2750 50  0001 C CNN
F 3 "~" H 2550 2750 50  0001 C CNN
	1    2550 2750
	1    0    0    -1  
$EndComp
$Comp
L Device:R R5
U 1 1 5FC04433
P 2550 3050
F 0 "R5" H 2620 3096 50  0000 L CNN
F 1 "10K" H 2620 3005 50  0000 L CNN
F 2 "Resistor_SMD:R_0603_1608Metric" V 2480 3050 50  0001 C CNN
F 3 "~" H 2550 3050 50  0001 C CNN
	1    2550 3050
	1    0    0    -1  
$EndComp
$Comp
L Device:R R11
U 1 1 5FC04439
P 3050 2600
F 0 "R11" V 2843 2600 50  0000 C CNN
F 1 "20K" V 2934 2600 50  0000 C CNN
F 2 "Resistor_SMD:R_0603_1608Metric" V 2980 2600 50  0001 C CNN
F 3 "~" H 3050 2600 50  0001 C CNN
	1    3050 2600
	0    1    1    0   
$EndComp
$Comp
L Device:R R15
U 1 1 5FC0443F
P 3700 2250
F 0 "R15" V 3493 2250 50  0000 C CNN
F 1 "20K" V 3584 2250 50  0000 C CNN
F 2 "Resistor_SMD:R_0603_1608Metric" V 3630 2250 50  0001 C CNN
F 3 "~" H 3700 2250 50  0001 C CNN
	1    3700 2250
	0    1    1    0   
$EndComp
Wire Wire Line
	1650 2600 2200 2600
Connection ~ 2550 2600
Wire Wire Line
	2550 2600 2900 2600
Wire Wire Line
	3200 2600 3300 2600
Wire Wire Line
	3300 2600 3300 2250
Wire Wire Line
	3300 2250 3550 2250
Connection ~ 3300 2600
Wire Wire Line
	3300 2600 3400 2600
Wire Wire Line
	2200 2750 2200 2600
Connection ~ 2200 2600
Wire Wire Line
	2200 2600 2550 2600
Wire Wire Line
	2350 2900 2550 2900
Connection ~ 2550 2900
Wire Wire Line
	2550 2900 3100 2900
Wire Wire Line
	3100 2900 3100 2800
Wire Wire Line
	3100 2800 3400 2800
Wire Wire Line
	2200 3050 2200 3200
Wire Wire Line
	2200 3200 2350 3200
$Comp
L power:GND #PWR?
U 1 1 5FC04457
P 2350 3200
AR Path="/5FC04457" Ref="#PWR?"  Part="1" 
AR Path="/5FB8B9E0/5FC04457" Ref="#PWR014"  Part="1" 
F 0 "#PWR014" H 2350 2950 50  0001 C CNN
F 1 "GND" V 2355 3072 50  0000 R CNN
F 2 "" H 2350 3200 50  0001 C CNN
F 3 "" H 2350 3200 50  0001 C CNN
	1    2350 3200
	1    0    0    -1  
$EndComp
$Comp
L Device:R_POT RV?
U 1 1 5FC06C3D
P 2200 4150
AR Path="/5FC06C3D" Ref="RV?"  Part="1" 
AR Path="/5FB8B9E0/5FC06C3D" Ref="RV3"  Part="1" 
F 0 "RV3" H 2131 4196 50  0000 R CNN
F 1 "20K" H 2131 4105 50  0000 R CNN
F 2 "benou-footprints:Potentiometer_Alpha_RD901F-40-00D_Single_Vertical_CircularHoles" H 2200 4150 50  0001 C CNN
F 3 "~" H 2200 4150 50  0001 C CNN
	1    2200 4150
	1    0    0    -1  
$EndComp
$Comp
L Device:R R6
U 1 1 5FC06C49
P 2550 4000
F 0 "R6" H 2620 4046 50  0000 L CNN
F 1 "10K" H 2620 3955 50  0000 L CNN
F 2 "Resistor_SMD:R_0603_1608Metric" V 2480 4000 50  0001 C CNN
F 3 "~" H 2550 4000 50  0001 C CNN
	1    2550 4000
	1    0    0    -1  
$EndComp
$Comp
L Device:R R7
U 1 1 5FC06C4F
P 2550 4300
F 0 "R7" H 2620 4346 50  0000 L CNN
F 1 "10K" H 2620 4255 50  0000 L CNN
F 2 "Resistor_SMD:R_0603_1608Metric" V 2480 4300 50  0001 C CNN
F 3 "~" H 2550 4300 50  0001 C CNN
	1    2550 4300
	1    0    0    -1  
$EndComp
$Comp
L Device:R R12
U 1 1 5FC06C55
P 3050 3850
F 0 "R12" V 2843 3850 50  0000 C CNN
F 1 "20K" V 2934 3850 50  0000 C CNN
F 2 "Resistor_SMD:R_0603_1608Metric" V 2980 3850 50  0001 C CNN
F 3 "~" H 3050 3850 50  0001 C CNN
	1    3050 3850
	0    1    1    0   
$EndComp
$Comp
L Device:R R16
U 1 1 5FC06C5B
P 3700 3500
F 0 "R16" V 3493 3500 50  0000 C CNN
F 1 "20K" V 3584 3500 50  0000 C CNN
F 2 "Resistor_SMD:R_0603_1608Metric" V 3630 3500 50  0001 C CNN
F 3 "~" H 3700 3500 50  0001 C CNN
	1    3700 3500
	0    1    1    0   
$EndComp
Wire Wire Line
	1650 3850 2200 3850
Connection ~ 2550 3850
Wire Wire Line
	2550 3850 2900 3850
Wire Wire Line
	3200 3850 3300 3850
Wire Wire Line
	3300 3850 3300 3500
Wire Wire Line
	3300 3500 3550 3500
Connection ~ 3300 3850
Wire Wire Line
	3300 3850 3400 3850
Wire Wire Line
	2200 4000 2200 3850
Connection ~ 2200 3850
Wire Wire Line
	2200 3850 2550 3850
Wire Wire Line
	2350 4150 2550 4150
Connection ~ 2550 4150
Wire Wire Line
	2550 4150 3100 4150
Wire Wire Line
	3100 4150 3100 4050
Wire Wire Line
	3100 4050 3400 4050
Wire Wire Line
	2200 4300 2200 4450
Wire Wire Line
	2200 4450 2350 4450
$Comp
L power:GND #PWR?
U 1 1 5FC06C73
P 2350 4450
AR Path="/5FC06C73" Ref="#PWR?"  Part="1" 
AR Path="/5FB8B9E0/5FC06C73" Ref="#PWR015"  Part="1" 
F 0 "#PWR015" H 2350 4200 50  0001 C CNN
F 1 "GND" V 2355 4322 50  0000 R CNN
F 2 "" H 2350 4450 50  0001 C CNN
F 3 "" H 2350 4450 50  0001 C CNN
	1    2350 4450
	1    0    0    -1  
$EndComp
$Comp
L Device:R_POT RV?
U 1 1 5FC0B6B9
P 2200 5400
AR Path="/5FC0B6B9" Ref="RV?"  Part="1" 
AR Path="/5FB8B9E0/5FC0B6B9" Ref="RV4"  Part="1" 
F 0 "RV4" H 2131 5446 50  0000 R CNN
F 1 "20K" H 2131 5355 50  0000 R CNN
F 2 "benou-footprints:Potentiometer_Alpha_RD901F-40-00D_Single_Vertical_CircularHoles" H 2200 5400 50  0001 C CNN
F 3 "~" H 2200 5400 50  0001 C CNN
	1    2200 5400
	1    0    0    -1  
$EndComp
$Comp
L Device:R R8
U 1 1 5FC0B6C5
P 2550 5250
F 0 "R8" H 2620 5296 50  0000 L CNN
F 1 "10K" H 2620 5205 50  0000 L CNN
F 2 "Resistor_SMD:R_0603_1608Metric" V 2480 5250 50  0001 C CNN
F 3 "~" H 2550 5250 50  0001 C CNN
	1    2550 5250
	1    0    0    -1  
$EndComp
$Comp
L Device:R R9
U 1 1 5FC0B6CB
P 2550 5550
F 0 "R9" H 2620 5596 50  0000 L CNN
F 1 "10K" H 2620 5505 50  0000 L CNN
F 2 "Resistor_SMD:R_0603_1608Metric" V 2480 5550 50  0001 C CNN
F 3 "~" H 2550 5550 50  0001 C CNN
	1    2550 5550
	1    0    0    -1  
$EndComp
$Comp
L Device:R R13
U 1 1 5FC0B6D1
P 3050 5100
F 0 "R13" V 2843 5100 50  0000 C CNN
F 1 "20K" V 2934 5100 50  0000 C CNN
F 2 "Resistor_SMD:R_0603_1608Metric" V 2980 5100 50  0001 C CNN
F 3 "~" H 3050 5100 50  0001 C CNN
	1    3050 5100
	0    1    1    0   
$EndComp
$Comp
L Device:R R17
U 1 1 5FC0B6D7
P 3700 4750
F 0 "R17" V 3493 4750 50  0000 C CNN
F 1 "20K" V 3584 4750 50  0000 C CNN
F 2 "Resistor_SMD:R_0603_1608Metric" V 3630 4750 50  0001 C CNN
F 3 "~" H 3700 4750 50  0001 C CNN
	1    3700 4750
	0    1    1    0   
$EndComp
Wire Wire Line
	1650 5100 2200 5100
Connection ~ 2550 5100
Wire Wire Line
	2550 5100 2900 5100
Wire Wire Line
	3200 5100 3300 5100
Wire Wire Line
	3300 5100 3300 4750
Wire Wire Line
	3300 4750 3550 4750
Connection ~ 3300 5100
Wire Wire Line
	3300 5100 3400 5100
Wire Wire Line
	2200 5250 2200 5100
Connection ~ 2200 5100
Wire Wire Line
	2200 5100 2550 5100
Wire Wire Line
	2350 5400 2550 5400
Connection ~ 2550 5400
Wire Wire Line
	2550 5400 3100 5400
Wire Wire Line
	3100 5400 3100 5300
Wire Wire Line
	3100 5300 3400 5300
Wire Wire Line
	2200 5550 2200 5700
Wire Wire Line
	2200 5700 2350 5700
$Comp
L power:GND #PWR?
U 1 1 5FC0B6EF
P 2350 5700
AR Path="/5FC0B6EF" Ref="#PWR?"  Part="1" 
AR Path="/5FB8B9E0/5FC0B6EF" Ref="#PWR016"  Part="1" 
F 0 "#PWR016" H 2350 5450 50  0001 C CNN
F 1 "GND" V 2355 5572 50  0000 R CNN
F 2 "" H 2350 5700 50  0001 C CNN
F 3 "" H 2350 5700 50  0001 C CNN
	1    2350 5700
	1    0    0    -1  
$EndComp
Connection ~ 2350 2000
Wire Wire Line
	2350 2000 2550 2000
Connection ~ 2350 3200
Wire Wire Line
	2350 3200 2550 3200
Connection ~ 2350 4450
Wire Wire Line
	2350 4450 2550 4450
Connection ~ 2350 5700
Wire Wire Line
	2350 5700 2550 5700
Wire Wire Line
	3850 2250 4150 2250
Wire Wire Line
	4150 2250 4150 2700
Wire Wire Line
	4150 2700 4000 2700
Wire Wire Line
	3850 3500 4150 3500
Wire Wire Line
	4150 3500 4150 3950
Wire Wire Line
	4150 3950 4000 3950
Wire Wire Line
	3850 4750 4150 4750
Wire Wire Line
	4150 4750 4150 5200
Wire Wire Line
	4150 5200 4000 5200
$Comp
L Amplifier_Operational:MCP6004 U8
U 1 1 5FC2256E
P 7550 1600
F 0 "U8" H 7550 1967 50  0000 C CNN
F 1 "MCP6004" H 7550 1876 50  0000 C CNN
F 2 "Package_SO:TSSOP-14_4.4x5mm_P0.65mm" H 7500 1700 50  0001 C CNN
F 3 "http://ww1.microchip.com/downloads/en/DeviceDoc/21733j.pdf" H 7600 1800 50  0001 C CNN
	1    7550 1600
	1    0    0    -1  
$EndComp
$Comp
L Amplifier_Operational:MCP6004 U8
U 2 1 5FC23957
P 7550 2800
F 0 "U8" H 7550 3167 50  0000 C CNN
F 1 "MCP6004" H 7550 3076 50  0000 C CNN
F 2 "Package_SO:TSSOP-14_4.4x5mm_P0.65mm" H 7500 2900 50  0001 C CNN
F 3 "http://ww1.microchip.com/downloads/en/DeviceDoc/21733j.pdf" H 7600 3000 50  0001 C CNN
	2    7550 2800
	1    0    0    -1  
$EndComp
$Comp
L Amplifier_Operational:MCP6004 U8
U 3 1 5FC24F93
P 7550 4050
F 0 "U8" H 7550 4417 50  0000 C CNN
F 1 "MCP6004" H 7550 4326 50  0000 C CNN
F 2 "Package_SO:TSSOP-14_4.4x5mm_P0.65mm" H 7500 4150 50  0001 C CNN
F 3 "http://ww1.microchip.com/downloads/en/DeviceDoc/21733j.pdf" H 7600 4250 50  0001 C CNN
	3    7550 4050
	1    0    0    -1  
$EndComp
$Comp
L Amplifier_Operational:MCP6004 U8
U 4 1 5FC262F6
P 7550 5300
F 0 "U8" H 7550 5667 50  0000 C CNN
F 1 "MCP6004" H 7550 5576 50  0000 C CNN
F 2 "Package_SO:TSSOP-14_4.4x5mm_P0.65mm" H 7500 5400 50  0001 C CNN
F 3 "http://ww1.microchip.com/downloads/en/DeviceDoc/21733j.pdf" H 7600 5500 50  0001 C CNN
	4    7550 5300
	1    0    0    -1  
$EndComp
$Comp
L Amplifier_Operational:MCP6004 U8
U 5 1 5FC27E6A
P 10000 5750
F 0 "U8" H 9958 5796 50  0000 L CNN
F 1 "MCP6004" H 9958 5705 50  0000 L CNN
F 2 "Package_SO:TSSOP-14_4.4x5mm_P0.65mm" H 9950 5850 50  0001 C CNN
F 3 "http://ww1.microchip.com/downloads/en/DeviceDoc/21733j.pdf" H 10050 5950 50  0001 C CNN
	5    10000 5750
	1    0    0    -1  
$EndComp
$Comp
L Amplifier_Operational:LM324 U7
U 1 1 5FC33438
P 3700 1500
F 0 "U7" H 3700 1133 50  0000 C CNN
F 1 "LM324" H 3700 1224 50  0000 C CNN
F 2 "Package_SO:TSSOP-14_4.4x5mm_P0.65mm" H 3650 1600 50  0001 C CNN
F 3 "http://www.ti.com/lit/ds/symlink/lm2902-n.pdf" H 3750 1700 50  0001 C CNN
	1    3700 1500
	1    0    0    1   
$EndComp
$Comp
L Amplifier_Operational:LM324 U7
U 2 1 5FC3519A
P 3700 2700
F 0 "U7" H 3700 2333 50  0000 C CNN
F 1 "LM324" H 3700 2424 50  0000 C CNN
F 2 "Package_SO:TSSOP-14_4.4x5mm_P0.65mm" H 3650 2800 50  0001 C CNN
F 3 "http://www.ti.com/lit/ds/symlink/lm2902-n.pdf" H 3750 2900 50  0001 C CNN
	2    3700 2700
	1    0    0    1   
$EndComp
$Comp
L Amplifier_Operational:LM324 U7
U 3 1 5FC36AF9
P 3700 3950
F 0 "U7" H 3700 3583 50  0000 C CNN
F 1 "LM324" H 3700 3674 50  0000 C CNN
F 2 "Package_SO:TSSOP-14_4.4x5mm_P0.65mm" H 3650 4050 50  0001 C CNN
F 3 "http://www.ti.com/lit/ds/symlink/lm2902-n.pdf" H 3750 4150 50  0001 C CNN
	3    3700 3950
	1    0    0    1   
$EndComp
$Comp
L Amplifier_Operational:LM324 U7
U 4 1 5FC3852F
P 3700 5200
F 0 "U7" H 3700 4833 50  0000 C CNN
F 1 "LM324" H 3700 4924 50  0000 C CNN
F 2 "Package_SO:TSSOP-14_4.4x5mm_P0.65mm" H 3650 5300 50  0001 C CNN
F 3 "http://www.ti.com/lit/ds/symlink/lm2902-n.pdf" H 3750 5400 50  0001 C CNN
	4    3700 5200
	1    0    0    1   
$EndComp
$Comp
L Amplifier_Operational:LM324 U7
U 5 1 5FC3973D
P 3350 6600
F 0 "U7" H 3308 6646 50  0000 L CNN
F 1 "LM324" H 3308 6555 50  0000 L CNN
F 2 "Package_SO:TSSOP-14_4.4x5mm_P0.65mm" H 3300 6700 50  0001 C CNN
F 3 "http://www.ti.com/lit/ds/symlink/lm2902-n.pdf" H 3400 6800 50  0001 C CNN
	5    3350 6600
	1    0    0    -1  
$EndComp
Wire Wire Line
	5850 1000 5900 1000
Wire Wire Line
	4900 1100 5250 1100
Wire Wire Line
	4950 2300 5250 2300
Wire Wire Line
	5000 3550 5300 3550
Wire Wire Line
	5000 4800 5300 4800
$Comp
L Amplifier_Operational:LM324 U9
U 1 1 5FC59229
P 5550 1000
F 0 "U9" H 5550 633 50  0000 C CNN
F 1 "LM324" H 5550 724 50  0000 C CNN
F 2 "Package_SO:TSSOP-14_4.4x5mm_P0.65mm" H 5500 1100 50  0001 C CNN
F 3 "http://www.ti.com/lit/ds/symlink/lm2902-n.pdf" H 5600 1200 50  0001 C CNN
	1    5550 1000
	1    0    0    1   
$EndComp
$Comp
L Amplifier_Operational:LM324 U9
U 2 1 5FC5922F
P 5550 2200
F 0 "U9" H 5550 1833 50  0000 C CNN
F 1 "LM324" H 5550 1924 50  0000 C CNN
F 2 "Package_SO:TSSOP-14_4.4x5mm_P0.65mm" H 5500 2300 50  0001 C CNN
F 3 "http://www.ti.com/lit/ds/symlink/lm2902-n.pdf" H 5600 2400 50  0001 C CNN
	2    5550 2200
	1    0    0    1   
$EndComp
$Comp
L Amplifier_Operational:LM324 U9
U 3 1 5FC59235
P 5600 3450
F 0 "U9" H 5600 3083 50  0000 C CNN
F 1 "LM324" H 5600 3174 50  0000 C CNN
F 2 "Package_SO:TSSOP-14_4.4x5mm_P0.65mm" H 5550 3550 50  0001 C CNN
F 3 "http://www.ti.com/lit/ds/symlink/lm2902-n.pdf" H 5650 3650 50  0001 C CNN
	3    5600 3450
	1    0    0    1   
$EndComp
$Comp
L Amplifier_Operational:LM324 U9
U 4 1 5FC5923B
P 5600 4700
F 0 "U9" H 5600 4333 50  0000 C CNN
F 1 "LM324" H 5600 4424 50  0000 C CNN
F 2 "Package_SO:TSSOP-14_4.4x5mm_P0.65mm" H 5550 4800 50  0001 C CNN
F 3 "http://www.ti.com/lit/ds/symlink/lm2902-n.pdf" H 5650 4900 50  0001 C CNN
	4    5600 4700
	1    0    0    1   
$EndComp
$Comp
L Amplifier_Operational:LM324 U9
U 5 1 5FC59241
P 5350 6600
F 0 "U9" H 5308 6646 50  0000 L CNN
F 1 "LM324" H 5308 6555 50  0000 L CNN
F 2 "Package_SO:TSSOP-14_4.4x5mm_P0.65mm" H 5300 6700 50  0001 C CNN
F 3 "http://www.ti.com/lit/ds/symlink/lm2902-n.pdf" H 5400 6800 50  0001 C CNN
	5    5350 6600
	1    0    0    -1  
$EndComp
Wire Wire Line
	5250 4600 5250 4250
Wire Wire Line
	6000 4250 6000 4700
Wire Wire Line
	5250 4250 6000 4250
Wire Wire Line
	5250 4600 5300 4600
Connection ~ 6000 4700
Wire Wire Line
	6000 4700 5900 4700
Wire Wire Line
	5250 3350 5250 3000
Wire Wire Line
	5250 3000 5950 3000
Wire Wire Line
	5950 3000 5950 3450
Wire Wire Line
	5250 3350 5300 3350
Connection ~ 5950 3450
Wire Wire Line
	5950 3450 5900 3450
Wire Wire Line
	5200 2100 5200 1750
Wire Wire Line
	5200 1750 5950 1750
Wire Wire Line
	5200 2100 5250 2100
Connection ~ 5950 2200
Wire Wire Line
	5950 2200 5850 2200
Wire Wire Line
	5200 900  5200 550 
Wire Wire Line
	5200 550  5900 550 
Wire Wire Line
	5900 550  5900 1000
Wire Wire Line
	5200 900  5250 900 
Connection ~ 5900 1000
$Comp
L Device:R_POT RV?
U 1 1 5FC95154
P 4750 1100
AR Path="/5FC95154" Ref="RV?"  Part="1" 
AR Path="/5FB8B9E0/5FC95154" Ref="RV5"  Part="1" 
F 0 "RV5" H 4681 1146 50  0000 R CNN
F 1 "50K" H 4681 1055 50  0000 R CNN
F 2 "benou-footprints:Potentiometer_Alpha_RD901F-40-00D_Single_Vertical_CircularHoles" H 4750 1100 50  0001 C CNN
F 3 "~" H 4750 1100 50  0001 C CNN
	1    4750 1100
	1    0    0    -1  
$EndComp
$Comp
L Device:R_POT RV?
U 1 1 5FC95B49
P 4800 2300
AR Path="/5FC95B49" Ref="RV?"  Part="1" 
AR Path="/5FB8B9E0/5FC95B49" Ref="RV6"  Part="1" 
F 0 "RV6" H 4731 2346 50  0000 R CNN
F 1 "50K" H 4731 2255 50  0000 R CNN
F 2 "benou-footprints:Potentiometer_Alpha_RD901F-40-00D_Single_Vertical_CircularHoles" H 4800 2300 50  0001 C CNN
F 3 "~" H 4800 2300 50  0001 C CNN
	1    4800 2300
	1    0    0    -1  
$EndComp
$Comp
L Device:R_POT RV?
U 1 1 5FC95F24
P 4850 3550
AR Path="/5FC95F24" Ref="RV?"  Part="1" 
AR Path="/5FB8B9E0/5FC95F24" Ref="RV7"  Part="1" 
F 0 "RV7" H 4781 3596 50  0000 R CNN
F 1 "50K" H 4781 3505 50  0000 R CNN
F 2 "benou-footprints:Potentiometer_Alpha_RD901F-40-00D_Single_Vertical_CircularHoles" H 4850 3550 50  0001 C CNN
F 3 "~" H 4850 3550 50  0001 C CNN
	1    4850 3550
	1    0    0    -1  
$EndComp
$Comp
L Device:R_POT RV?
U 1 1 5FC962EF
P 4850 4800
AR Path="/5FC962EF" Ref="RV?"  Part="1" 
AR Path="/5FB8B9E0/5FC962EF" Ref="RV8"  Part="1" 
F 0 "RV8" H 4781 4846 50  0000 R CNN
F 1 "50K" H 4781 4755 50  0000 R CNN
F 2 "benou-footprints:Potentiometer_Alpha_RD901F-40-00D_Single_Vertical_CircularHoles" H 4850 4800 50  0001 C CNN
F 3 "~" H 4850 4800 50  0001 C CNN
	1    4850 4800
	1    0    0    -1  
$EndComp
$Comp
L power:-10V #PWR?
U 1 1 5FC9A0F3
P 4750 950
AR Path="/5FC9A0F3" Ref="#PWR?"  Part="1" 
AR Path="/5FB8B9E0/5FC9A0F3" Ref="#PWR018"  Part="1" 
F 0 "#PWR018" H 4750 1050 50  0001 C CNN
F 1 "-10V" H 4765 1123 50  0000 C CNN
F 2 "" H 4750 950 50  0001 C CNN
F 3 "" H 4750 950 50  0001 C CNN
	1    4750 950 
	1    0    0    -1  
$EndComp
$Comp
L power:-10V #PWR?
U 1 1 5FC9D0A3
P 4800 2150
AR Path="/5FC9D0A3" Ref="#PWR?"  Part="1" 
AR Path="/5FB8B9E0/5FC9D0A3" Ref="#PWR020"  Part="1" 
F 0 "#PWR020" H 4800 2250 50  0001 C CNN
F 1 "-10V" H 4815 2323 50  0000 C CNN
F 2 "" H 4800 2150 50  0001 C CNN
F 3 "" H 4800 2150 50  0001 C CNN
	1    4800 2150
	1    0    0    -1  
$EndComp
$Comp
L power:-10V #PWR?
U 1 1 5FC9FECE
P 4850 3400
AR Path="/5FC9FECE" Ref="#PWR?"  Part="1" 
AR Path="/5FB8B9E0/5FC9FECE" Ref="#PWR022"  Part="1" 
F 0 "#PWR022" H 4850 3500 50  0001 C CNN
F 1 "-10V" H 4865 3573 50  0000 C CNN
F 2 "" H 4850 3400 50  0001 C CNN
F 3 "" H 4850 3400 50  0001 C CNN
	1    4850 3400
	1    0    0    -1  
$EndComp
$Comp
L power:-10V #PWR?
U 1 1 5FCA2C06
P 4850 4650
AR Path="/5FCA2C06" Ref="#PWR?"  Part="1" 
AR Path="/5FB8B9E0/5FCA2C06" Ref="#PWR024"  Part="1" 
F 0 "#PWR024" H 4850 4750 50  0001 C CNN
F 1 "-10V" H 4865 4823 50  0000 C CNN
F 2 "" H 4850 4650 50  0001 C CNN
F 3 "" H 4850 4650 50  0001 C CNN
	1    4850 4650
	1    0    0    -1  
$EndComp
$Comp
L power:GND #PWR?
U 1 1 5FCABF5D
P 4750 1250
AR Path="/5FCABF5D" Ref="#PWR?"  Part="1" 
AR Path="/5FB8B9E0/5FCABF5D" Ref="#PWR019"  Part="1" 
F 0 "#PWR019" H 4750 1000 50  0001 C CNN
F 1 "GND" H 4830 1110 50  0000 R CNN
F 2 "" H 4750 1250 50  0001 C CNN
F 3 "" H 4750 1250 50  0001 C CNN
	1    4750 1250
	1    0    0    -1  
$EndComp
$Comp
L power:GND #PWR?
U 1 1 5FCAC395
P 4800 2450
AR Path="/5FCAC395" Ref="#PWR?"  Part="1" 
AR Path="/5FB8B9E0/5FCAC395" Ref="#PWR021"  Part="1" 
F 0 "#PWR021" H 4800 2200 50  0001 C CNN
F 1 "GND" H 4880 2310 50  0000 R CNN
F 2 "" H 4800 2450 50  0001 C CNN
F 3 "" H 4800 2450 50  0001 C CNN
	1    4800 2450
	1    0    0    -1  
$EndComp
$Comp
L power:GND #PWR?
U 1 1 5FCAC5EA
P 4850 3700
AR Path="/5FCAC5EA" Ref="#PWR?"  Part="1" 
AR Path="/5FB8B9E0/5FCAC5EA" Ref="#PWR023"  Part="1" 
F 0 "#PWR023" H 4850 3450 50  0001 C CNN
F 1 "GND" H 4930 3560 50  0000 R CNN
F 2 "" H 4850 3700 50  0001 C CNN
F 3 "" H 4850 3700 50  0001 C CNN
	1    4850 3700
	1    0    0    -1  
$EndComp
$Comp
L power:GND #PWR?
U 1 1 5FCAC99B
P 4850 4950
AR Path="/5FCAC99B" Ref="#PWR?"  Part="1" 
AR Path="/5FB8B9E0/5FCAC99B" Ref="#PWR025"  Part="1" 
F 0 "#PWR025" H 4850 4700 50  0001 C CNN
F 1 "GND" H 4930 4810 50  0000 R CNN
F 2 "" H 4850 4950 50  0001 C CNN
F 3 "" H 4850 4950 50  0001 C CNN
	1    4850 4950
	1    0    0    -1  
$EndComp
$Comp
L Device:R R25
U 1 1 5FCDEB43
P 6400 5200
F 0 "R25" V 6193 5200 50  0000 C CNN
F 1 "100K" V 6284 5200 50  0000 C CNN
F 2 "Resistor_SMD:R_0603_1608Metric" V 6330 5200 50  0001 C CNN
F 3 "~" H 6400 5200 50  0001 C CNN
	1    6400 5200
	0    1    1    0   
$EndComp
$Comp
L Device:R R24
U 1 1 5FCDFD8F
P 6400 4700
F 0 "R24" V 6193 4700 50  0000 C CNN
F 1 "100K" V 6284 4700 50  0000 C CNN
F 2 "Resistor_SMD:R_0603_1608Metric" V 6330 4700 50  0001 C CNN
F 3 "~" H 6400 4700 50  0001 C CNN
	1    6400 4700
	0    1    1    0   
$EndComp
$Comp
L Device:R R23
U 1 1 5FCE19E0
P 6350 3950
F 0 "R23" V 6143 3950 50  0000 C CNN
F 1 "100K" V 6234 3950 50  0000 C CNN
F 2 "Resistor_SMD:R_0603_1608Metric" V 6280 3950 50  0001 C CNN
F 3 "~" H 6350 3950 50  0001 C CNN
	1    6350 3950
	0    1    1    0   
$EndComp
$Comp
L Device:R R22
U 1 1 5FCE19E6
P 6350 3450
F 0 "R22" V 6143 3450 50  0000 C CNN
F 1 "100K" V 6234 3450 50  0000 C CNN
F 2 "Resistor_SMD:R_0603_1608Metric" V 6280 3450 50  0001 C CNN
F 3 "~" H 6350 3450 50  0001 C CNN
	1    6350 3450
	0    1    1    0   
$EndComp
$Comp
L Device:R R21
U 1 1 5FCE4B30
P 6300 2700
F 0 "R21" V 6093 2700 50  0000 C CNN
F 1 "100K" V 6184 2700 50  0000 C CNN
F 2 "Resistor_SMD:R_0603_1608Metric" V 6230 2700 50  0001 C CNN
F 3 "~" H 6300 2700 50  0001 C CNN
	1    6300 2700
	0    1    1    0   
$EndComp
$Comp
L Device:R R20
U 1 1 5FCE4B36
P 6300 2200
F 0 "R20" V 6093 2200 50  0000 C CNN
F 1 "100K" V 6184 2200 50  0000 C CNN
F 2 "Resistor_SMD:R_0603_1608Metric" V 6230 2200 50  0001 C CNN
F 3 "~" H 6300 2200 50  0001 C CNN
	1    6300 2200
	0    1    1    0   
$EndComp
$Comp
L Device:R R19
U 1 1 5FCE7C4E
P 6300 1500
F 0 "R19" V 6093 1500 50  0000 C CNN
F 1 "100K" V 6184 1500 50  0000 C CNN
F 2 "Resistor_SMD:R_0603_1608Metric" V 6230 1500 50  0001 C CNN
F 3 "~" H 6300 1500 50  0001 C CNN
	1    6300 1500
	0    1    1    0   
$EndComp
$Comp
L Device:R R18
U 1 1 5FCE7C54
P 6300 1000
F 0 "R18" V 6093 1000 50  0000 C CNN
F 1 "100K" V 6184 1000 50  0000 C CNN
F 2 "Resistor_SMD:R_0603_1608Metric" V 6230 1000 50  0001 C CNN
F 3 "~" H 6300 1000 50  0001 C CNN
	1    6300 1000
	0    1    1    0   
$EndComp
Wire Wire Line
	4150 1500 6150 1500
Connection ~ 4150 1500
Wire Wire Line
	4150 2700 6150 2700
Connection ~ 4150 2700
Wire Wire Line
	4150 3950 6200 3950
Connection ~ 4150 3950
Wire Wire Line
	4150 5200 6250 5200
Connection ~ 4150 5200
Wire Wire Line
	5950 1750 5950 2200
Wire Wire Line
	6550 5200 7000 5200
Wire Wire Line
	6000 4700 6250 4700
Wire Wire Line
	6550 4700 7000 4700
Wire Wire Line
	7000 4700 7000 4800
Connection ~ 7000 5200
Wire Wire Line
	7000 5200 7250 5200
Wire Wire Line
	6500 3950 7000 3950
Wire Wire Line
	5950 3450 6200 3450
Wire Wire Line
	6500 3450 7000 3450
Connection ~ 7000 3950
Wire Wire Line
	7000 3950 7250 3950
Wire Wire Line
	6450 2700 7000 2700
Wire Wire Line
	5950 2200 6150 2200
Wire Wire Line
	6450 2200 7000 2200
Connection ~ 7000 2700
Wire Wire Line
	7000 2700 7250 2700
Wire Wire Line
	6450 1500 7000 1500
Wire Wire Line
	5900 1000 6150 1000
Wire Wire Line
	6450 1000 7000 1000
Connection ~ 7000 1500
Wire Wire Line
	7000 1500 7250 1500
$Comp
L Device:C C10
U 1 1 5FD6413F
P 7750 4450
F 0 "C10" V 7498 4450 50  0000 C CNN
F 1 "4.7nF" V 7589 4450 50  0000 C CNN
F 2 "Capacitor_SMD:C_0603_1608Metric" H 7788 4300 50  0001 C CNN
F 3 "~" H 7750 4450 50  0001 C CNN
	1    7750 4450
	0    1    1    0   
$EndComp
$Comp
L Device:R R29
U 1 1 5FD66C34
P 7750 4800
F 0 "R29" V 7543 4800 50  0000 C CNN
F 1 "33K" V 7634 4800 50  0000 C CNN
F 2 "Resistor_SMD:R_0603_1608Metric" V 7680 4800 50  0001 C CNN
F 3 "~" H 7750 4800 50  0001 C CNN
	1    7750 4800
	0    1    1    0   
$EndComp
Wire Wire Line
	7000 4800 7600 4800
Connection ~ 7000 4800
Wire Wire Line
	7000 4800 7000 5200
Wire Wire Line
	7600 4450 7000 4450
Wire Wire Line
	7000 4450 7000 4700
Connection ~ 7000 4700
Wire Wire Line
	7900 4450 8100 4450
Wire Wire Line
	8100 4450 8100 4800
Wire Wire Line
	8100 5300 7850 5300
Connection ~ 8100 4800
Wire Wire Line
	8100 4800 8100 5300
Wire Wire Line
	7900 4800 8100 4800
Wire Wire Line
	7000 1000 7000 1150
Wire Wire Line
	7000 2200 7000 2350
Wire Wire Line
	7000 3450 7000 3550
$Comp
L Device:C C9
U 1 1 5FD966D4
P 7750 3200
F 0 "C9" V 7498 3200 50  0000 C CNN
F 1 "4.7nF" V 7589 3200 50  0000 C CNN
F 2 "Capacitor_SMD:C_0603_1608Metric" H 7788 3050 50  0001 C CNN
F 3 "~" H 7750 3200 50  0001 C CNN
	1    7750 3200
	0    1    1    0   
$EndComp
$Comp
L Device:R R28
U 1 1 5FD966DA
P 7750 3550
F 0 "R28" V 7543 3550 50  0000 C CNN
F 1 "33K" V 7634 3550 50  0000 C CNN
F 2 "Resistor_SMD:R_0603_1608Metric" V 7680 3550 50  0001 C CNN
F 3 "~" H 7750 3550 50  0001 C CNN
	1    7750 3550
	0    1    1    0   
$EndComp
Wire Wire Line
	7600 3200 7000 3200
Wire Wire Line
	7900 3200 8100 3200
Wire Wire Line
	7900 3550 8100 3550
$Comp
L Device:C C8
U 1 1 5FD9BB23
P 7750 2000
F 0 "C8" V 7498 2000 50  0000 C CNN
F 1 "4.7nF" V 7589 2000 50  0000 C CNN
F 2 "Capacitor_SMD:C_0603_1608Metric" H 7788 1850 50  0001 C CNN
F 3 "~" H 7750 2000 50  0001 C CNN
	1    7750 2000
	0    1    1    0   
$EndComp
$Comp
L Device:R R27
U 1 1 5FD9BB29
P 7750 2350
F 0 "R27" V 7543 2350 50  0000 C CNN
F 1 "33K" V 7634 2350 50  0000 C CNN
F 2 "Resistor_SMD:R_0603_1608Metric" V 7680 2350 50  0001 C CNN
F 3 "~" H 7750 2350 50  0001 C CNN
	1    7750 2350
	0    1    1    0   
$EndComp
Wire Wire Line
	7600 2000 7000 2000
Wire Wire Line
	7900 2000 8100 2000
Wire Wire Line
	7900 2350 8100 2350
$Comp
L Device:C C7
U 1 1 5FDA1065
P 7750 800
F 0 "C7" V 7498 800 50  0000 C CNN
F 1 "4.7nF" V 7589 800 50  0000 C CNN
F 2 "Capacitor_SMD:C_0603_1608Metric" H 7788 650 50  0001 C CNN
F 3 "~" H 7750 800 50  0001 C CNN
	1    7750 800 
	0    1    1    0   
$EndComp
$Comp
L Device:R R26
U 1 1 5FDA106B
P 7750 1150
F 0 "R26" V 7543 1150 50  0000 C CNN
F 1 "33K" V 7634 1150 50  0000 C CNN
F 2 "Resistor_SMD:R_0603_1608Metric" V 7680 1150 50  0001 C CNN
F 3 "~" H 7750 1150 50  0001 C CNN
	1    7750 1150
	0    1    1    0   
$EndComp
Wire Wire Line
	7900 800  8100 800 
Wire Wire Line
	7900 1150 8100 1150
Wire Wire Line
	7000 1000 7000 800 
Wire Wire Line
	7000 800  7600 800 
Connection ~ 7000 1000
Wire Wire Line
	8100 800  8100 1150
Wire Wire Line
	8100 1600 7850 1600
Connection ~ 8100 1150
Wire Wire Line
	8100 1150 8100 1600
Wire Wire Line
	7000 2200 7000 2000
Connection ~ 7000 2200
Wire Wire Line
	8100 2000 8100 2350
Wire Wire Line
	8100 2800 7850 2800
Connection ~ 8100 2350
Wire Wire Line
	8100 2350 8100 2800
Wire Wire Line
	7000 3450 7000 3200
Connection ~ 7000 3450
Wire Wire Line
	8100 3200 8100 3550
Wire Wire Line
	8100 4050 7850 4050
Connection ~ 8100 3550
Wire Wire Line
	8100 3550 8100 4050
$Comp
L power:GND #PWR?
U 1 1 5FDCB6AA
P 7250 5400
AR Path="/5FDCB6AA" Ref="#PWR?"  Part="1" 
AR Path="/5FB8B9E0/5FDCB6AA" Ref="#PWR029"  Part="1" 
F 0 "#PWR029" H 7250 5150 50  0001 C CNN
F 1 "GND" H 7330 5260 50  0000 R CNN
F 2 "" H 7250 5400 50  0001 C CNN
F 3 "" H 7250 5400 50  0001 C CNN
	1    7250 5400
	1    0    0    -1  
$EndComp
$Comp
L power:GND #PWR?
U 1 1 5FDCBD8F
P 7250 4150
AR Path="/5FDCBD8F" Ref="#PWR?"  Part="1" 
AR Path="/5FB8B9E0/5FDCBD8F" Ref="#PWR028"  Part="1" 
F 0 "#PWR028" H 7250 3900 50  0001 C CNN
F 1 "GND" H 7330 4010 50  0000 R CNN
F 2 "" H 7250 4150 50  0001 C CNN
F 3 "" H 7250 4150 50  0001 C CNN
	1    7250 4150
	1    0    0    -1  
$EndComp
$Comp
L power:GND #PWR?
U 1 1 5FDCC3F2
P 7250 2900
AR Path="/5FDCC3F2" Ref="#PWR?"  Part="1" 
AR Path="/5FB8B9E0/5FDCC3F2" Ref="#PWR027"  Part="1" 
F 0 "#PWR027" H 7250 2650 50  0001 C CNN
F 1 "GND" H 7330 2760 50  0000 R CNN
F 2 "" H 7250 2900 50  0001 C CNN
F 3 "" H 7250 2900 50  0001 C CNN
	1    7250 2900
	1    0    0    -1  
$EndComp
$Comp
L power:GND #PWR?
U 1 1 5FDCC67D
P 7250 1700
AR Path="/5FDCC67D" Ref="#PWR?"  Part="1" 
AR Path="/5FB8B9E0/5FDCC67D" Ref="#PWR026"  Part="1" 
F 0 "#PWR026" H 7250 1450 50  0001 C CNN
F 1 "GND" H 7330 1560 50  0000 R CNN
F 2 "" H 7250 1700 50  0001 C CNN
F 3 "" H 7250 1700 50  0001 C CNN
	1    7250 1700
	1    0    0    -1  
$EndComp
Wire Wire Line
	8100 1600 8500 1600
Connection ~ 8100 1600
Wire Wire Line
	8100 2800 8500 2800
Connection ~ 8100 2800
Wire Wire Line
	8100 4050 8500 4050
Connection ~ 8100 4050
Wire Wire Line
	8100 5300 8500 5300
Connection ~ 8100 5300
$Comp
L Device:C C?
U 1 1 605FF011
P 2850 6450
AR Path="/605FF011" Ref="C?"  Part="1" 
AR Path="/5FB8B9E0/605FF011" Ref="C36"  Part="1" 
F 0 "C36" H 2965 6496 50  0000 L CNN
F 1 "100nF" H 2965 6405 50  0000 L CNN
F 2 "Capacitor_SMD:C_0603_1608Metric" H 2888 6300 50  0001 C CNN
F 3 "~" H 2850 6450 50  0001 C CNN
	1    2850 6450
	1    0    0    -1  
$EndComp
$Comp
L Device:C C?
U 1 1 605FF017
P 2850 6750
AR Path="/605FF017" Ref="C?"  Part="1" 
AR Path="/5FB8B9E0/605FF017" Ref="C37"  Part="1" 
F 0 "C37" H 2965 6796 50  0000 L CNN
F 1 "100nF" H 2965 6705 50  0000 L CNN
F 2 "Capacitor_SMD:C_0603_1608Metric" H 2888 6600 50  0001 C CNN
F 3 "~" H 2850 6750 50  0001 C CNN
	1    2850 6750
	1    0    0    -1  
$EndComp
$Comp
L power:GND #PWR?
U 1 1 605FF01D
P 2850 6600
AR Path="/605FF01D" Ref="#PWR?"  Part="1" 
AR Path="/5FB8B9E0/605FF01D" Ref="#PWR072"  Part="1" 
F 0 "#PWR072" H 2850 6350 50  0001 C CNN
F 1 "GND" V 2855 6472 50  0000 R CNN
F 2 "" H 2850 6600 50  0001 C CNN
F 3 "" H 2850 6600 50  0001 C CNN
	1    2850 6600
	0    1    1    0   
$EndComp
Connection ~ 2850 6600
$Comp
L Device:C C?
U 1 1 60605900
P 4850 6450
AR Path="/60605900" Ref="C?"  Part="1" 
AR Path="/5FB8B9E0/60605900" Ref="C38"  Part="1" 
F 0 "C38" H 4965 6496 50  0000 L CNN
F 1 "100nF" H 4965 6405 50  0000 L CNN
F 2 "Capacitor_SMD:C_0603_1608Metric" H 4888 6300 50  0001 C CNN
F 3 "~" H 4850 6450 50  0001 C CNN
	1    4850 6450
	1    0    0    -1  
$EndComp
$Comp
L Device:C C?
U 1 1 60605906
P 4850 6750
AR Path="/60605906" Ref="C?"  Part="1" 
AR Path="/5FB8B9E0/60605906" Ref="C39"  Part="1" 
F 0 "C39" H 4965 6796 50  0000 L CNN
F 1 "100nF" H 4965 6705 50  0000 L CNN
F 2 "Capacitor_SMD:C_0603_1608Metric" H 4888 6600 50  0001 C CNN
F 3 "~" H 4850 6750 50  0001 C CNN
	1    4850 6750
	1    0    0    -1  
$EndComp
$Comp
L power:GND #PWR?
U 1 1 6060590C
P 4850 6600
AR Path="/6060590C" Ref="#PWR?"  Part="1" 
AR Path="/5FB8B9E0/6060590C" Ref="#PWR075"  Part="1" 
F 0 "#PWR075" H 4850 6350 50  0001 C CNN
F 1 "GND" V 4855 6472 50  0000 R CNN
F 2 "" H 4850 6600 50  0001 C CNN
F 3 "" H 4850 6600 50  0001 C CNN
	1    4850 6600
	0    1    1    0   
$EndComp
Connection ~ 4850 6600
$Comp
L Device:C C?
U 1 1 6060BB18
P 9550 5800
AR Path="/6060BB18" Ref="C?"  Part="1" 
AR Path="/5FB8B9E0/6060BB18" Ref="C40"  Part="1" 
F 0 "C40" H 9665 5846 50  0000 L CNN
F 1 "100nF" H 9665 5755 50  0000 L CNN
F 2 "Capacitor_SMD:C_0603_1608Metric" H 9588 5650 50  0001 C CNN
F 3 "~" H 9550 5800 50  0001 C CNN
	1    9550 5800
	1    0    0    -1  
$EndComp
Wire Wire Line
	2850 6300 3050 6300
Wire Wire Line
	2850 6900 3050 6900
Wire Wire Line
	4850 6300 5050 6300
Wire Wire Line
	4850 6900 5050 6900
Wire Wire Line
	9550 5650 9550 5450
Wire Wire Line
	9550 5450 9700 5450
Wire Wire Line
	9550 5950 9550 6050
Wire Wire Line
	9550 6050 9700 6050
$Comp
L power:+12V #PWR?
U 1 1 60652CDE
P 3050 6300
AR Path="/60652CDE" Ref="#PWR?"  Part="1" 
AR Path="/5FB8B9E0/60652CDE" Ref="#PWR073"  Part="1" 
F 0 "#PWR073" H 3050 6150 50  0001 C CNN
F 1 "+12V" H 3065 6473 50  0000 C CNN
F 2 "" H 3050 6300 50  0001 C CNN
F 3 "" H 3050 6300 50  0001 C CNN
	1    3050 6300
	1    0    0    -1  
$EndComp
$Comp
L power:+12V #PWR?
U 1 1 60652F4D
P 5050 6300
AR Path="/60652F4D" Ref="#PWR?"  Part="1" 
AR Path="/5FB8B9E0/60652F4D" Ref="#PWR076"  Part="1" 
F 0 "#PWR076" H 5050 6150 50  0001 C CNN
F 1 "+12V" H 5065 6473 50  0000 C CNN
F 2 "" H 5050 6300 50  0001 C CNN
F 3 "" H 5050 6300 50  0001 C CNN
	1    5050 6300
	1    0    0    -1  
$EndComp
Connection ~ 5050 6300
Wire Wire Line
	5050 6300 5250 6300
$Comp
L power:-12V #PWR?
U 1 1 60653130
P 3050 6900
AR Path="/60653130" Ref="#PWR?"  Part="1" 
AR Path="/5FB8B9E0/60653130" Ref="#PWR074"  Part="1" 
F 0 "#PWR074" H 3050 7000 50  0001 C CNN
F 1 "-12V" H 3065 7073 50  0000 C CNN
F 2 "" H 3050 6900 50  0001 C CNN
F 3 "" H 3050 6900 50  0001 C CNN
	1    3050 6900
	-1   0    0    1   
$EndComp
Connection ~ 3050 6900
Wire Wire Line
	3050 6900 3250 6900
$Comp
L power:-12V #PWR?
U 1 1 60653264
P 5050 6900
AR Path="/60653264" Ref="#PWR?"  Part="1" 
AR Path="/5FB8B9E0/60653264" Ref="#PWR077"  Part="1" 
F 0 "#PWR077" H 5050 7000 50  0001 C CNN
F 1 "-12V" H 5065 7073 50  0000 C CNN
F 2 "" H 5050 6900 50  0001 C CNN
F 3 "" H 5050 6900 50  0001 C CNN
	1    5050 6900
	-1   0    0    1   
$EndComp
Connection ~ 5050 6900
Wire Wire Line
	5050 6900 5250 6900
Connection ~ 3050 6300
Wire Wire Line
	3050 6300 3250 6300
$Comp
L power:VDDA #PWR078
U 1 1 6066328A
P 9700 5450
F 0 "#PWR078" H 9700 5300 50  0001 C CNN
F 1 "VDDA" H 9715 5623 50  0000 C CNN
F 2 "" H 9700 5450 50  0001 C CNN
F 3 "" H 9700 5450 50  0001 C CNN
	1    9700 5450
	1    0    0    -1  
$EndComp
Connection ~ 9700 5450
Wire Wire Line
	9700 5450 9900 5450
$Comp
L power:GND #PWR?
U 1 1 6066364C
P 9700 6050
AR Path="/6066364C" Ref="#PWR?"  Part="1" 
AR Path="/5FB8B9E0/6066364C" Ref="#PWR079"  Part="1" 
F 0 "#PWR079" H 9700 5800 50  0001 C CNN
F 1 "GND" H 9780 5910 50  0000 R CNN
F 2 "" H 9700 6050 50  0001 C CNN
F 3 "" H 9700 6050 50  0001 C CNN
	1    9700 6050
	1    0    0    -1  
$EndComp
Connection ~ 9700 6050
Wire Wire Line
	9700 6050 9900 6050
Connection ~ 7000 2350
Wire Wire Line
	7000 2350 7000 2700
Wire Wire Line
	7000 2350 7600 2350
Wire Wire Line
	7600 3550 7000 3550
Connection ~ 7000 3550
Wire Wire Line
	7000 3550 7000 3950
Wire Wire Line
	7600 1150 7000 1150
Connection ~ 7000 1150
Wire Wire Line
	7000 1150 7000 1500
$EndSCHEMATC
