%TF.GenerationSoftware,KiCad,Pcbnew,(5.1.8)-1*%
%TF.CreationDate,2021-02-12T12:31:06+01:00*%
%TF.ProjectId,traouiero_encoder,7472616f-7569-4657-926f-5f656e636f64,rev?*%
%TF.SameCoordinates,Original*%
%TF.FileFunction,Soldermask,Bot*%
%TF.FilePolarity,Negative*%
%FSLAX46Y46*%
G04 Gerber Fmt 4.6, Leading zero omitted, Abs format (unit mm)*
G04 Created by KiCad (PCBNEW (5.1.8)-1) date 2021-02-12 12:31:06*
%MOMM*%
%LPD*%
G01*
G04 APERTURE LIST*
%ADD10O,1.000000X1.000000*%
%ADD11R,1.000000X1.000000*%
%ADD12C,1.800000*%
%ADD13R,1.800000X1.800000*%
G04 APERTURE END LIST*
D10*
%TO.C,J13*%
X176100000Y-96640000D03*
X176100000Y-95370000D03*
X176100000Y-94100000D03*
X176100000Y-92830000D03*
D11*
X176100000Y-91560000D03*
%TD*%
D12*
%TO.C,SW1*%
X164190000Y-98850000D03*
X164190000Y-86150000D03*
X171810000Y-86150000D03*
D13*
X164190000Y-91230000D03*
D12*
X171810000Y-98850000D03*
X171810000Y-96310000D03*
X171810000Y-93770000D03*
X171810000Y-88690000D03*
X171810000Y-91230000D03*
%TD*%
M02*
