EESchema Schematic File Version 4
EELAYER 30 0
EELAYER END
$Descr A4 11693 8268
encoding utf-8
Sheet 1 1
Title ""
Date ""
Rev ""
Comp ""
Comment1 ""
Comment2 ""
Comment3 ""
Comment4 ""
$EndDescr
$Comp
L Amplifier_Operational:OPA2134 U?
U 1 1 6054B7A1
P 4700 3150
F 0 "U?" H 4700 3517 50  0000 C CNN
F 1 "OPA2134" H 4700 3426 50  0000 C CNN
F 2 "" H 4700 3150 50  0001 C CNN
F 3 "http://www.ti.com/lit/ds/symlink/opa134.pdf" H 4700 3150 50  0001 C CNN
	1    4700 3150
	1    0    0    1   
$EndComp
$Comp
L Amplifier_Operational:OPA2134 U?
U 2 1 6054D368
P 8450 3250
F 0 "U?" H 8450 3617 50  0000 C CNN
F 1 "OPA2134" H 8450 3526 50  0000 C CNN
F 2 "" H 8450 3250 50  0001 C CNN
F 3 "http://www.ti.com/lit/ds/symlink/opa134.pdf" H 8450 3250 50  0001 C CNN
	2    8450 3250
	1    0    0    1   
$EndComp
$Comp
L Amplifier_Operational:OPA2134 U?
U 3 1 6054FB87
P 4850 4700
F 0 "U?" H 4808 4746 50  0000 L CNN
F 1 "OPA2134" H 4808 4655 50  0000 L CNN
F 2 "" H 4850 4700 50  0001 C CNN
F 3 "http://www.ti.com/lit/ds/symlink/opa134.pdf" H 4850 4700 50  0001 C CNN
	3    4850 4700
	1    0    0    -1  
$EndComp
$Comp
L Device:R_POT RV?
U 1 1 6055267F
P 9650 4150
F 0 "RV?" H 9581 4196 50  0000 R CNN
F 1 "20K" H 9581 4105 50  0000 R CNN
F 2 "benou-footprints:Potentiometer_Alpha_RD901F-40-00D_Single_Vertical_CircularHoles" H 9650 4150 50  0001 C CNN
F 3 "~" H 9650 4150 50  0001 C CNN
	1    9650 4150
	1    0    0    -1  
$EndComp
$Comp
L Connector:Conn_Coaxial_Power J?
U 1 1 605530D7
P 1900 1450
F 0 "J?" H 1820 1354 50  0000 R CNN
F 1 "Conn_Coaxial_Power" H 1820 1445 50  0000 R CNN
F 2 "" H 1900 1400 50  0001 C CNN
F 3 "~" H 1900 1400 50  0001 C CNN
	1    1900 1450
	-1   0    0    1   
$EndComp
$Comp
L power:+12V #PWR?
U 1 1 605544F8
P 1900 1150
F 0 "#PWR?" H 1900 1000 50  0001 C CNN
F 1 "+12V" H 1915 1323 50  0000 C CNN
F 2 "" H 1900 1150 50  0001 C CNN
F 3 "" H 1900 1150 50  0001 C CNN
	1    1900 1150
	1    0    0    -1  
$EndComp
$Comp
L power:GND #PWR?
U 1 1 60556046
P 1900 1550
F 0 "#PWR?" H 1900 1300 50  0001 C CNN
F 1 "GND" H 1905 1377 50  0000 C CNN
F 2 "" H 1900 1550 50  0001 C CNN
F 3 "" H 1900 1550 50  0001 C CNN
	1    1900 1550
	1    0    0    -1  
$EndComp
$Comp
L Device:C C?
U 1 1 6055734D
P 1450 1350
F 0 "C?" H 1565 1396 50  0000 L CNN
F 1 "C" H 1565 1305 50  0000 L CNN
F 2 "Capacitor_SMD:C_0603_1608Metric" H 1488 1200 50  0001 C CNN
F 3 "~" H 1450 1350 50  0001 C CNN
	1    1450 1350
	1    0    0    -1  
$EndComp
Wire Wire Line
	1450 1200 1900 1200
Wire Wire Line
	1900 1200 1900 1150
Wire Wire Line
	1900 1200 1900 1250
Connection ~ 1900 1200
$Comp
L power:GND #PWR?
U 1 1 60558669
P 1450 1500
F 0 "#PWR?" H 1450 1250 50  0001 C CNN
F 1 "GND" H 1455 1327 50  0000 C CNN
F 2 "" H 1450 1500 50  0001 C CNN
F 3 "" H 1450 1500 50  0001 C CNN
	1    1450 1500
	1    0    0    -1  
$EndComp
Text Notes 2450 1250 0    50   ~ 0
Center negative +9 to +12V
$Comp
L Diode:1N4148W D?
U 1 1 605591CE
P 3500 2650
F 0 "D?" V 3454 2730 50  0000 L CNN
F 1 "1N4148W" V 3545 2730 50  0000 L CNN
F 2 "Diode_SMD:D_SOD-123" H 3500 2475 50  0001 C CNN
F 3 "https://www.vishay.com/docs/85748/1n4148w.pdf" H 3500 2650 50  0001 C CNN
	1    3500 2650
	0    1    1    0   
$EndComp
$Comp
L Device:R_POT RV?
U 1 1 6055FA75
P 6750 3850
F 0 "RV?" V 6650 3900 50  0000 R CNN
F 1 "20K" V 6550 3900 50  0000 R CNN
F 2 "benou-footprints:Potentiometer_Alpha_RD901F-40-00D_Single_Vertical_CircularHoles" H 6750 3850 50  0001 C CNN
F 3 "~" H 6750 3850 50  0001 C CNN
	1    6750 3850
	0    -1   -1   0   
$EndComp
$Comp
L Device:R_POT RV?
U 1 1 60560549
P 6750 2450
F 0 "RV?" V 6550 2500 50  0000 R CNN
F 1 "20K" V 6650 2500 50  0000 R CNN
F 2 "benou-footprints:Potentiometer_Alpha_RD901F-40-00D_Single_Vertical_CircularHoles" H 6750 2450 50  0001 C CNN
F 3 "~" H 6750 2450 50  0001 C CNN
	1    6750 2450
	0    -1   1    0   
$EndComp
$Comp
L Connector:AudioJack2_Switch J?
U 1 1 605623D8
P 1400 3050
F 0 "J?" H 1221 3058 50  0000 R CNN
F 1 "AudioJack2_Switch" H 1221 3149 50  0000 R CNN
F 2 "benou-footprints:Jack_6.35mm_Neutrik_NMJ4HFD2_Horizontal" H 1400 3250 50  0001 C CNN
F 3 "~" H 1400 3250 50  0001 C CNN
	1    1400 3050
	1    0    0    1   
$EndComp
$Comp
L Connector:AudioJack2_Switch J?
U 1 1 60563684
P 10250 4150
F 0 "J?" H 10070 4158 50  0000 R CNN
F 1 "AudioJack2_Switch" H 10070 4249 50  0000 R CNN
F 2 "benou-footprints:Jack_6.35mm_Neutrik_NMJ4HFD2_Horizontal" H 10250 4350 50  0001 C CNN
F 3 "~" H 10250 4350 50  0001 C CNN
	1    10250 4150
	-1   0    0    1   
$EndComp
$Comp
L power:GND #PWR?
U 1 1 6056598D
P 1600 3250
F 0 "#PWR?" H 1600 3000 50  0001 C CNN
F 1 "GND" H 1605 3077 50  0000 C CNN
F 2 "" H 1600 3250 50  0001 C CNN
F 3 "" H 1600 3250 50  0001 C CNN
	1    1600 3250
	1    0    0    -1  
$EndComp
$Comp
L power:GND #PWR?
U 1 1 60565FC2
P 10050 4350
F 0 "#PWR?" H 10050 4100 50  0001 C CNN
F 1 "GND" H 10055 4177 50  0000 C CNN
F 2 "" H 10050 4350 50  0001 C CNN
F 3 "" H 10050 4350 50  0001 C CNN
	1    10050 4350
	1    0    0    -1  
$EndComp
$Comp
L Diode:1N4148W D?
U 1 1 6056666E
P 3500 3700
F 0 "D?" V 3454 3780 50  0000 L CNN
F 1 "1N4148W" V 3545 3780 50  0000 L CNN
F 2 "Diode_SMD:D_SOD-123" H 3500 3525 50  0001 C CNN
F 3 "https://www.vishay.com/docs/85748/1n4148w.pdf" H 3500 3700 50  0001 C CNN
	1    3500 3700
	0    1    1    0   
$EndComp
$Comp
L Device:R R?
U 1 1 60566E68
P 2800 2650
F 0 "R?" H 2870 2696 50  0000 L CNN
F 1 "10K" H 2870 2605 50  0000 L CNN
F 2 "Resistor_SMD:R_0603_1608Metric" V 2730 2650 50  0001 C CNN
F 3 "~" H 2800 2650 50  0001 C CNN
	1    2800 2650
	1    0    0    -1  
$EndComp
$Comp
L Device:R R?
U 1 1 60568EDF
P 2800 3700
F 0 "R?" H 2870 3746 50  0000 L CNN
F 1 "10K" H 2870 3655 50  0000 L CNN
F 2 "Resistor_SMD:R_0603_1608Metric" V 2730 3700 50  0001 C CNN
F 3 "~" H 2800 3700 50  0001 C CNN
	1    2800 3700
	1    0    0    -1  
$EndComp
Wire Wire Line
	4400 3250 2800 3250
Connection ~ 2800 3250
Wire Wire Line
	2800 3250 2800 3350
Wire Wire Line
	4400 3050 4050 3050
Connection ~ 3500 3050
Wire Wire Line
	3500 3050 3500 2800
$Comp
L Device:C C?
U 1 1 6056F8FF
P 2350 3050
F 0 "C?" V 2098 3050 50  0000 C CNN
F 1 "100n" V 2189 3050 50  0000 C CNN
F 2 "Capacitor_SMD:C_0603_1608Metric" H 2388 2900 50  0001 C CNN
F 3 "~" H 2350 3050 50  0001 C CNN
	1    2350 3050
	0    1    1    0   
$EndComp
Wire Wire Line
	2200 3050 1600 3050
Wire Wire Line
	3500 3050 2500 3050
Wire Wire Line
	3500 3050 3500 3550
Wire Wire Line
	2800 2800 2800 3250
$Comp
L Device:C C?
U 1 1 605760C5
P 4700 2700
F 0 "C?" V 4448 2700 50  0000 C CNN
F 1 "10n" V 4539 2700 50  0000 C CNN
F 2 "Capacitor_SMD:C_0603_1608Metric" H 4738 2550 50  0001 C CNN
F 3 "~" H 4700 2700 50  0001 C CNN
	1    4700 2700
	0    1    1    0   
$EndComp
$Comp
L Device:R R?
U 1 1 605763A1
P 4700 2350
F 0 "R?" V 4493 2350 50  0000 C CNN
F 1 "1M" V 4584 2350 50  0000 C CNN
F 2 "Resistor_SMD:R_0603_1608Metric" V 4630 2350 50  0001 C CNN
F 3 "~" H 4700 2350 50  0001 C CNN
	1    4700 2350
	0    1    1    0   
$EndComp
Wire Wire Line
	4050 3050 4050 2700
Wire Wire Line
	4050 2350 4550 2350
Connection ~ 4050 3050
Wire Wire Line
	4050 3050 3500 3050
Wire Wire Line
	5000 3150 5300 3150
Wire Wire Line
	4850 2350 5300 2350
Wire Wire Line
	5300 2350 5300 2700
Connection ~ 5300 3150
Wire Wire Line
	5300 3150 5350 3150
Wire Wire Line
	4850 2700 5300 2700
Connection ~ 5300 2700
Wire Wire Line
	5300 2700 5300 3150
Wire Wire Line
	4050 2700 4550 2700
Connection ~ 4050 2700
Wire Wire Line
	4050 2700 4050 2350
$Comp
L Device:C C?
U 1 1 60581475
P 5500 3150
F 0 "C?" V 5248 3150 50  0000 C CNN
F 1 "10u" V 5339 3150 50  0000 C CNN
F 2 "Capacitor_SMD:C_0603_1608Metric" H 5538 3000 50  0001 C CNN
F 3 "~" H 5500 3150 50  0001 C CNN
	1    5500 3150
	0    1    1    0   
$EndComp
$Comp
L Device:C C?
U 1 1 60591316
P 6750 4200
F 0 "C?" V 6600 4200 50  0000 R CNN
F 1 "10n" V 6500 4250 50  0000 R CNN
F 2 "Capacitor_SMD:C_0603_1608Metric" H 6788 4050 50  0001 C CNN
F 3 "~" H 6750 4200 50  0001 C CNN
	1    6750 4200
	0    1    -1   0   
$EndComp
$Comp
L Device:R R?
U 1 1 60592971
P 6750 3400
F 0 "R?" H 6957 3400 50  0000 C CNN
F 1 "3k9" H 6950 3500 50  0000 C CNN
F 2 "Resistor_SMD:R_0603_1608Metric" V 6680 3400 50  0001 C CNN
F 3 "~" H 6750 3400 50  0001 C CNN
	1    6750 3400
	-1   0    0    1   
$EndComp
$Comp
L Device:C C?
U 1 1 6059342E
P 6750 2950
F 0 "C?" H 7002 2950 50  0000 C CNN
F 1 "110p" H 7000 2850 50  0000 C CNN
F 2 "Capacitor_SMD:C_0603_1608Metric" H 6788 2800 50  0001 C CNN
F 3 "~" H 6750 2950 50  0001 C CNN
	1    6750 2950
	-1   0    0    -1  
$EndComp
Wire Wire Line
	7600 2450 7500 2450
Wire Wire Line
	7500 3850 7600 3850
Wire Wire Line
	7600 3850 7600 2450
Wire Wire Line
	6900 3850 7000 3850
Wire Wire Line
	6900 4200 7000 4200
Wire Wire Line
	7000 4200 7000 3850
Connection ~ 7000 3850
Wire Wire Line
	7000 3850 7200 3850
Wire Wire Line
	6600 4200 6450 4200
Wire Wire Line
	6450 4200 6450 3850
Wire Wire Line
	6450 3850 6600 3850
Wire Wire Line
	6050 3850 5800 3850
Wire Wire Line
	5800 3850 5800 3150
Wire Wire Line
	8950 3250 8750 3250
Wire Wire Line
	6000 2450 5800 2450
Wire Wire Line
	6750 3700 6750 3550
Wire Wire Line
	6750 2800 6750 2600
Wire Wire Line
	7200 2450 6900 2450
Wire Wire Line
	6600 2450 6300 2450
$Comp
L power:+6V #PWR?
U 1 1 605A0061
P 2800 3350
F 0 "#PWR?" H 2800 3200 50  0001 C CNN
F 1 "+6V" V 2815 3478 50  0000 L CNN
F 2 "" H 2800 3350 50  0001 C CNN
F 3 "" H 2800 3350 50  0001 C CNN
	1    2800 3350
	0    -1   -1   0   
$EndComp
Connection ~ 2800 3350
Wire Wire Line
	2800 3350 2800 3550
$Comp
L power:+6V #PWR?
U 1 1 605A159E
P 8150 3350
F 0 "#PWR?" H 8150 3200 50  0001 C CNN
F 1 "+6V" V 8165 3478 50  0000 L CNN
F 2 "" H 8150 3350 50  0001 C CNN
F 3 "" H 8150 3350 50  0001 C CNN
	1    8150 3350
	0    -1   -1   0   
$EndComp
$Comp
L Device:C C?
U 1 1 605A26C3
P 9250 3250
F 0 "C?" V 8998 3250 50  0000 C CNN
F 1 "10u" V 9089 3250 50  0000 C CNN
F 2 "Capacitor_SMD:C_0603_1608Metric" H 9288 3100 50  0001 C CNN
F 3 "~" H 9250 3250 50  0001 C CNN
	1    9250 3250
	0    1    1    0   
$EndComp
$Comp
L Device:R R?
U 1 1 605A31F4
P 9650 3550
F 0 "R?" H 9580 3504 50  0000 R CNN
F 1 "1M" H 9580 3595 50  0000 R CNN
F 2 "Resistor_SMD:R_0603_1608Metric" V 9580 3550 50  0001 C CNN
F 3 "~" H 9650 3550 50  0001 C CNN
	1    9650 3550
	-1   0    0    1   
$EndComp
Wire Wire Line
	6750 3100 6750 3150
Wire Wire Line
	6350 3850 6450 3850
Connection ~ 6450 3850
Wire Wire Line
	5650 3150 5800 3150
Connection ~ 5800 3150
Wire Wire Line
	5800 3150 5800 2450
Wire Wire Line
	6750 3150 8150 3150
Connection ~ 6750 3150
Wire Wire Line
	6750 3150 6750 3250
Wire Wire Line
	8950 2450 8950 3250
Wire Wire Line
	7600 2450 8950 2450
Connection ~ 7600 2450
Wire Wire Line
	8950 3250 9100 3250
Connection ~ 8950 3250
Wire Wire Line
	9400 3250 9650 3250
Wire Wire Line
	9650 3250 9650 3400
Wire Wire Line
	9650 3700 9650 4000
Wire Wire Line
	9800 4150 10050 4150
$Comp
L power:GND #PWR?
U 1 1 605C11A1
P 9650 4300
F 0 "#PWR?" H 9650 4050 50  0001 C CNN
F 1 "GND" H 9655 4127 50  0000 C CNN
F 2 "" H 9650 4300 50  0001 C CNN
F 3 "" H 9650 4300 50  0001 C CNN
	1    9650 4300
	1    0    0    -1  
$EndComp
$Comp
L Device:R R?
U 1 1 60597314
P 6150 2450
F 0 "R?" V 5950 2450 50  0000 R CNN
F 1 "2.2K" V 6050 2450 50  0000 R CNN
F 2 "Resistor_SMD:R_0603_1608Metric" V 6080 2450 50  0001 C CNN
F 3 "~" H 6150 2450 50  0001 C CNN
	1    6150 2450
	0    1    1    0   
$EndComp
$Comp
L Device:R R?
U 1 1 605C2EA0
P 6200 3850
F 0 "R?" V 6000 3850 50  0000 R CNN
F 1 "3.9K" V 6100 3850 50  0000 R CNN
F 2 "Resistor_SMD:R_0603_1608Metric" V 6130 3850 50  0001 C CNN
F 3 "~" H 6200 3850 50  0001 C CNN
	1    6200 3850
	0    1    1    0   
$EndComp
$Comp
L Device:R R?
U 1 1 605C33E4
P 7350 3850
F 0 "R?" V 7150 3850 50  0000 R CNN
F 1 "3.9K" V 7250 3850 50  0000 R CNN
F 2 "Resistor_SMD:R_0603_1608Metric" V 7280 3850 50  0001 C CNN
F 3 "~" H 7350 3850 50  0001 C CNN
	1    7350 3850
	0    1    1    0   
$EndComp
$Comp
L Device:R R?
U 1 1 605C3837
P 7350 2450
F 0 "R?" V 7150 2450 50  0000 R CNN
F 1 "2.2K" V 7250 2450 50  0000 R CNN
F 2 "Resistor_SMD:R_0603_1608Metric" V 7280 2450 50  0001 C CNN
F 3 "~" H 7350 2450 50  0001 C CNN
	1    7350 2450
	0    1    1    0   
$EndComp
$EndSCHEMATC
