<?xml version="1.0" encoding="UTF-8" standalone="no"?>
<!-- Created with Inkscape (http://www.inkscape.org/) -->

<svg
   width="10mm"
   height="10mm"
   viewBox="0 0 9.9999999 10"
   version="1.1"
   id="svg5"
   inkscape:version="1.2.1 (9c6d41e410, 2022-07-14)"
   sodipodi:docname="EMISSA_outline_hatch.svg"
   xmlns:inkscape="http://www.inkscape.org/namespaces/inkscape"
   xmlns:sodipodi="http://sodipodi.sourceforge.net/DTD/sodipodi-0.dtd"
   xmlns="http://www.w3.org/2000/svg"
   xmlns:svg="http://www.w3.org/2000/svg">
  <sodipodi:namedview
     id="namedview7"
     pagecolor="#ffffff"
     bordercolor="#666666"
     borderopacity="1.0"
     inkscape:pageshadow="2"
     inkscape:pageopacity="0.0"
     inkscape:pagecheckerboard="0"
     inkscape:document-units="mm"
     showgrid="false"
     fit-margin-top="0"
     fit-margin-left="0"
     fit-margin-right="0"
     fit-margin-bottom="0"
     inkscape:zoom="22.627417"
     inkscape:cx="17.014757"
     inkscape:cy="21.610951"
     inkscape:window-width="1920"
     inkscape:window-height="1017"
     inkscape:window-x="-8"
     inkscape:window-y="-8"
     inkscape:window-maximized="1"
     inkscape:current-layer="layer1"
     inkscape:showpageshadow="2"
     inkscape:deskcolor="#d1d1d1" />
  <defs
     id="defs2">
    <clipPath
       clipPathUnits="userSpaceOnUse"
       id="clipPath526">
      <g
         id="g530"
         style="stroke-width:0.00143584"
         transform="matrix(696.45644,0,0,-696.45644,692197,-516405.72)">
        <path
           d="m -999.52755,-746.66204 h 17.09441 v 7.00057 h -17.09441 z"
           id="path528"
           style="stroke-width:0.00143584" />
      </g>
    </clipPath>
    <clipPath
       clipPathUnits="userSpaceOnUse"
       id="clipPath538">
      <g
         id="g542"
         style="stroke-width:0.00143584"
         transform="matrix(696.45644,0,0,-696.45644,690908.7,-519227.67)">
        <path
           d="m -999.52755,-746.66204 h 17.09441 v 7.00057 h -17.09441 z"
           id="path540"
           style="stroke-width:0.00143584" />
      </g>
    </clipPath>
    <clipPath
       clipPathUnits="userSpaceOnUse"
       id="clipPath550">
      <g
         id="g554"
         style="stroke-width:0.00143584"
         transform="matrix(696.45644,0,0,-696.45644,690393.37,-519260.14)">
        <path
           d="m -999.52755,-746.66204 h 17.09441 v 7.00057 h -17.09441 z"
           id="path552"
           style="stroke-width:0.00143584" />
      </g>
    </clipPath>
    <clipPath
       clipPathUnits="userSpaceOnUse"
       id="clipPath562">
      <g
         id="g566"
         style="stroke-width:0.00143584"
         transform="matrix(696.45644,0,0,-696.45644,690393.37,-518606.39)">
        <path
           d="m -999.52755,-746.66204 h 17.09441 v 7.00057 h -17.09441 z"
           id="path564"
           style="stroke-width:0.00143584" />
      </g>
    </clipPath>
    <clipPath
       clipPathUnits="userSpaceOnUse"
       id="clipPath574">
      <g
         id="g578"
         style="stroke-width:0.00143584"
         transform="matrix(696.45644,0,0,-696.45644,689418.66,-517486.82)">
        <path
           d="m -999.52755,-746.66204 h 17.09441 v 7.00057 h -17.09441 z"
           id="path576"
           style="stroke-width:0.00143584" />
      </g>
    </clipPath>
    <clipPath
       clipPathUnits="userSpaceOnUse"
       id="clipPath586">
      <g
         id="g590"
         style="stroke-width:0.00143584"
         transform="matrix(696.45644,0,0,-696.45644,688445.86,-517228.13)">
        <path
           d="m -999.52755,-746.66204 h 17.09441 v 7.00057 h -17.09441 z"
           id="path588"
           style="stroke-width:0.00143584" />
      </g>
    </clipPath>
    <clipPath
       clipPathUnits="userSpaceOnUse"
       id="clipPath604">
      <g
         id="g608"
         style="stroke-width:0.00143584"
         transform="matrix(696.45644,0,0,-696.45644,687275.74,-519239.6)">
        <path
           d="m -999.52755,-746.66204 h 17.09441 v 7.00057 h -17.09441 z"
           id="path606"
           style="stroke-width:0.00143584" />
      </g>
    </clipPath>
    <clipPath
       clipPathUnits="userSpaceOnUse"
       id="clipPath616">
      <g
         id="g620"
         style="stroke-width:0.00143584"
         transform="matrix(696.45644,0,0,-696.45644,687275.74,-516145.44)">
        <path
           d="m -999.52755,-746.66204 h 17.09441 v 7.00057 h -17.09441 z"
           id="path618"
           style="stroke-width:0.00143584" />
      </g>
    </clipPath>
  </defs>
  <g
     inkscape:label="Calque 1"
     inkscape:groupmode="layer"
     id="layer1"
     transform="translate(995.97999,748.00056)">
    <g
       id="g840"
       transform="matrix(0.00143584,0,0,-0.00143584,-986.81801,-741.10227)"
       style="stroke-width:69.64564372;stroke:#000000;stroke-opacity:1;fill:none;stroke-dasharray:none"
       clip-path="url(#clipPath616)">
      <g
         id="g380">
        <path
           d="m 0,0 v -226.172 c -1605.471,-1036.7 -4191.871,-1036.7 -5797.287,0 V 0 C -4214.687,-735.119 -1582.6,-735.119 0,0"
           style="fill:none;fill-opacity:1;fill-rule:nonzero;stroke:#000000;stroke-width:69.64564372;stroke-opacity:1;stroke-dasharray:none"
           id="path842" />
        <path
           style="stroke:#000000;fill:none;stroke-width:69.64564372"
           d="M -5736.410950,-65.775062 l -26.053233,-26.053233 M -5742.624113,-219.728927 l 111.102840,111.102840 M -5527.030606,-151.876122 l -123.885855,-123.885855 M -5557.150576,-329.736794 l 137.895329,137.895329 M -5308.679792,-229.006713 l -152.680859,-152.680859 M -5363.345263,-431.412885 l 165.752065,165.752065 M -5083.876963,-299.685287 l -179.522233,-179.522233 M -5161.295442,-524.844468 l 194.645447,194.645447 M -4850.629250,-361.918978 l -206.588543,-206.588543 M -4951.018675,-610.049106 l 219.779593,219.779593 M -4607.938756,-414.709888 l -234.861213,-234.861213 M -4734.627356,-689.139190 l 247.846231,247.846231 M -4361.824500,-464.077036 l -258.230993,-258.230993 M -4507.903331,-757.896569 l 273.079662,273.079662 M -4106.233177,-503.967118 l -282.580908,-282.580908 M -4269.890309,-815.364951 l 294.228904,294.228904 M -3843.200459,-536.415804 l -305.615252,-305.615252 M -4025.348666,-866.304713 l 318.307561,318.307561 M -3572.254161,-560.950909 l -327.442407,-327.442407 M -3771.437857,-907.875308 l 337.660727,337.660727 M -3293.389688,-577.567840 l -347.324191,-347.324191 M -3511.759017,-943.677872 l 361.143334,361.143334 M -3005.918271,-585.577828 l -365.620561,-365.620561 M -3232.668234,-960.068493 l 374.124493,374.124493 M -2709.097494,-584.238455 l -381.726204,-381.726204 M -2945.823116,-968.704779 l 389.115970,389.115970 M -2401.911762,-572.534127 l -395.543984,-395.543984 M -2645.476674,-963.839741 l 411.988230,411.988230 M -2082.900619,-549.004388 l -406.699297,-406.699297 M -2337.249377,-951.093848 l 418.562042,418.562042 M -1746.780583,-508.365756 l -417.495361,-417.495361 M -1999.581676,-908.907551 l 437.690026,437.690026 M -1400.982057,-458.048635 l -416.700376,-416.700376 M -1634.282256,-839.089536 l 415.909435,415.909435 M -1010.376496,-362.924477 l -432.310423,-432.310423 M -1247.512863,-747.801547 l 419.636128,419.636128 M -614.772363,-262.801748 l -411.691274,-411.691274 M -801.517291,-597.287378 l 428.335595,428.335595 M -135.166063,-78.676852 l -442.996875,-442.996875 M -289.580713,-380.832204 l 254.757895,254.757895 M -5762.464183,-173.165195 l 138.264363,-138.264363 M -5303.677208,-484.211468 l -436.128939,436.128939 M -5472.857654,-167.290319 l 425.509854,-425.509854 M -4824.020283,-668.386989 l -438.599840,438.599840 M -5050.419315,-294.247254 l 449.550106,-449.550106 M -4411.744370,-785.181497 l -424.538254,424.538254 M -4653.165506,-396.019659 l 430.187409,-430.187409 M -4035.235045,-866.209418 l -434.145634,434.145634 M -4285.009750,-468.694012 l 437.156903,-437.156903 M -3686.650525,-919.312535 l -414.511075,414.511075 M -3931.797342,-526.425016 l 422.135187,-422.135187 M -3358.257422,-952.224233 l -407.871719,407.871719 M -3604.240419,-558.500534 l 403.173432,-403.173432 M -3047.877123,-967.123129 l -397.616229,397.616229 M -3289.483805,-577.775744 l 391.097106,-391.097106 M -2752.338281,-967.180566 l -384.263521,384.263521 M -2985.962423,-585.815723 l 376.451727,-376.451727 M -2469.713084,-954.324360 l -368.491230,368.491230 M -2692.426314,-583.870427 l 359.867972,-359.867972 M -2198.781114,-929.774925 l -350.471395,350.471395 M -2407.961673,-572.853664 l 340.707224,-340.707224 M -1938.225694,-894.848941 l -330.751834,330.751834 M -2131.901934,-553.432000 l 320.123446,-320.123446 M -1687.592125,-850.001106 l -309.108593,309.108593 M -1863.633568,-526.218961 l 297.975955,-297.975955 M -1446.156021,-795.955806 l -286.309936,286.309936 M -1607.935782,-486.435343 l 279.245704,-279.245704 M -1213.533731,-733.096691 l -262.134396,262.134396 M -1350.132163,-448.757558 l 249.761095,-249.761095 M -989.448484,-661.700535 l -236.974256,236.974256 M -1104.479483,-398.928833 l 224.005477,-224.005477 M -773.715466,-581.952149 l -210.793347,210.793347 M -866.375409,-341.551503 l 197.969533,-197.969533 M -566.231404,-493.954806 l -183.813507,183.813507 M -635.730078,-276.715430 l 170.135045,-170.135045 M -366.967711,-397.737096 l -156.348359,156.348359 M -412.796617,-204.167488 l 142.314995,-142.314995 M -175.966576,-293.256827 l -128.419869,128.419869 M -197.997878,-123.484822 l 114.314934,-114.314934 M -34.822817,-138.919181 l -58.818776,58.818776"
           id="path378" />
      </g>
    </g>
    <g
       id="g844"
       transform="matrix(0.00143584,0,0,-0.00143584,-986.81801,-741.10226)"
       style="stroke-width:69.64564372;stroke-dasharray:none;stroke:#000000;stroke-opacity:1;fill:none"
       clip-path="none">
      <g
         id="g386">
        <path
           d="m 0,-226.17 c -1605.468,-1036.702 -4191.871,-1036.702 -5797.285,0 V 0 C -4214.684,-735.116 -1582.602,-735.116 0,0 Z"
           style="fill:none;fill-opacity:1;fill-rule:nonzero;stroke:#000000;stroke-width:69.64564372;stroke-dasharray:none;stroke-opacity:1"
           id="path846"
           sodipodi:nodetypes="ccccc" />
        <path
           style="stroke:#000000;fill:none;stroke-width:69.64564372"
           d="M -5736.408699,-65.775014 l -26.053484,-26.053484 M -5742.620811,-219.727829 l 111.101706,111.101706 M -5527.028074,-151.875794 l -123.885153,-123.885153 M -5557.147417,-329.735839 l 137.894835,137.894835 M -5308.677486,-229.006610 l -152.680077,-152.680077 M -5363.342226,-431.412052 l 165.751938,165.751938 M -5083.873935,-299.684463 l -179.522283,-179.522283 M -5161.292508,-524.843738 l 194.644873,194.644873 M -4850.626005,-361.917937 l -206.588905,-206.588905 M -4951.015828,-610.048462 l 219.780097,219.780097 M -4607.936414,-414.709750 l -234.860751,-234.860751 M -4734.625667,-689.139706 l 247.848086,247.848086 M -4361.820859,-464.075599 l -258.231893,-258.231893 M -4507.901673,-757.897116 l 273.080271,273.080271 M -4106.229364,-503.965509 l -282.582032,-282.582032 M -4269.887635,-815.364481 l 294.230131,294.230131 M -3843.196474,-536.414022 l -305.616586,-305.616586 M -4025.346024,-866.304274 l 318.307013,318.307013 M -3572.250021,-560.948973 l -327.443920,-327.443920 M -3771.435232,-907.874887 l 337.662302,337.662302 M -3293.385396,-577.565753 l -347.325856,-347.325856 M -3511.757338,-943.678396 l 361.145998,361.145998 M -3005.913840,-585.575601 l -365.622361,-365.622361 M -3232.665590,-960.068052 l 374.126322,374.126322 M -2709.092936,-584.236101 l -381.728098,-381.728098 M -2945.820427,-968.704294 l 389.117870,389.117870 M -2401.907096,-572.531664 l -395.545929,-395.545929 M -2645.473914,-963.839184 l 411.986904,411.986904 M -2082.899254,-549.005226 l -406.697852,-406.697852 M -2337.247536,-951.094211 l 418.565000,418.565000 M -1746.779358,-508.366735 l -417.493624,-417.493624 M -1999.579792,-908.907871 l 437.689296,437.689296 M -1400.977162,-458.045943 l -416.702080,-416.702080 M -1634.278893,-839.088376 l 415.910983,415.910983 M -1010.375511,-362.925696 l -432.307825,-432.307825 M -1247.510918,-747.801805 l 419.635124,419.635124 M -614.771454,-262.803043 l -411.687880,-411.687880 M -801.515345,-597.287636 l 428.334544,428.334544 M -135.165166,-78.678160 l -442.995831,-442.995831 M -289.578799,-380.832495 l 254.755982,254.755982 M -5762.462183,-173.164491 l 138.263784,-138.263784 M -5303.675789,-484.210182 l -436.128080,436.128080 M -5472.855504,-167.289766 l 425.509130,-425.509130 M -4824.018841,-668.385727 l -438.599243,438.599243 M -5050.417393,-294.246473 l 449.549641,-449.549641 M -4411.742893,-785.180271 l -424.537932,424.537932 M -4653.163816,-396.018646 l 430.187829,-430.187829 M -4035.233529,-866.208231 l -434.145573,434.145573 M -4285.008289,-468.692769 l 437.156978,-437.156978 M -3686.648302,-919.312053 l -414.512650,414.512650 M -3931.796751,-526.422902 l 422.136168,-422.136168 M -3358.255191,-952.223761 l -407.873410,407.873410 M -3604.239911,-558.498338 l 403.175152,-403.175152 M -3047.874906,-967.122642 l -397.617961,397.617961 M -3289.483341,-577.773504 l 391.098843,-391.098843 M -2752.336102,-967.180042 l -384.265243,384.265243 M -2985.961971,-585.813470 l 376.453429,-376.453429 M -2469.710960,-954.323779 l -368.492897,368.492897 M -2692.425851,-583.868186 l 359.869123,-359.869123 M -2198.779058,-929.774277 l -350.472975,350.472975 M -2407.961178,-572.851455 l 340.708744,-340.708744 M -1938.223724,-894.848207 l -330.753288,330.753288 M -2131.901389,-553.429840 l 320.124826,-320.124826 M -1687.590253,-850.000275 l -309.109889,309.109889 M -1863.632957,-526.216869 l 297.977160,-297.977160 M -1446.154261,-795.954862 l -286.311045,286.311045 M -1607.935779,-486.432642 l 279.247397,-279.247397 M -1213.532102,-733.095617 l -262.135281,262.135281 M -1350.131367,-448.755650 l 249.761856,-249.761856 M -989.447002,-661.699313 l -236.974887,236.974887 M -1104.478566,-398.927047 l 224.005959,-224.005959 M -773.714152,-581.950759 l -210.793679,210.793679 M -866.374359,-341.549850 l 197.969427,-197.969427 M -566.230281,-493.953225 l -183.813497,183.813497 M -635.728866,-276.713939 l 170.134852,-170.134852 M -366.966804,-397.735299 l -156.347969,156.347969 M -412.795218,-204.166182 l 142.314386,-142.314386 M -175.965915,-293.254784 l -128.419035,128.419035 M -197.996279,-123.483717 l 114.313863,-114.313863 M -34.822817,-138.916477 l -58.817052,58.817052"
           id="path384" />
      </g>
    </g>
    <g
       id="g848"
       transform="matrix(0.00143584,0,0,-0.00143584,-986.81801,-745.545)"
       style="stroke-width:69.64564372;stroke:#000000;stroke-opacity:1;fill:none;stroke-dasharray:none"
       clip-path="url(#clipPath604)">
      <g
         id="g392">
        <path
           d="m 0,0 v -226.131 c -1582.6,735.144 -4214.687,735.144 -5797.287,0 V 0 C -4191.871,1036.758 -1605.471,1036.758 0,0"
           style="fill:none;fill-opacity:1;fill-rule:nonzero;stroke:#000000;stroke-width:69.64564372;stroke-opacity:1;stroke-dasharray:none"
           id="path850" />
        <path
           style="stroke:#000000;fill:none;stroke-width:69.64564372"
           d="M -5624.215279,85.284650 l -138.248903,-138.248903 M -5739.806581,-178.047354 l 436.118451,436.118451 M -5047.355898,366.662628 l -425.500704,-425.500704 M -5262.618117,3.659706 l 438.591749,438.591749 M -4600.873662,517.663460 l -449.542872,-449.542872 M -4836.279220,134.517199 l 424.531569,424.531569 M -4222.987093,600.068624 l -430.174549,-430.174549 M -4469.376442,205.938573 l 434.139845,434.139845 M -3847.853795,679.720518 l -437.151422,-437.151422 M -4101.144712,278.688899 l 414.492094,414.492094 M -3509.662333,722.430576 l -422.117753,-422.117753 M -3766.111547,318.240660 l 407.854138,407.854138 M -3201.066420,735.545085 l -403.156268,-403.156268 M -3445.475648,343.395155 l 397.599392,397.599392 M -2898.385754,742.744347 l -391.080259,-391.080259 M -3136.584234,356.805165 l 384.246783,384.246783 M -2609.510147,736.138550 l -376.434803,-376.434803 M -2838.187219,359.720775 l 368.474256,368.474256 M -2332.558514,717.608779 l -359.850955,-359.850955 M -2549.236169,353.190422 l 350.453931,350.453931 M -2067.256352,687.429537 l -340.689361,-340.689361 M -2268.962176,337.983010 l 330.733714,330.733714 M -1811.782232,647.422253 l -320.104844,-320.104844 M -1996.686441,314.777341 l 309.089550,309.089550 M -1565.663459,598.059622 l -297.956502,-297.956502 M -1732.453059,283.529319 l 286.290006,286.290006 M -1328.698295,539.543382 l -279.233966,-279.233966 M -1475.656699,244.844276 l 262.113457,262.113457 M -1100.381839,472.378434 l -249.739718,-249.739718 M -1226.412985,198.606585 l 236.952353,236.952353 M -880.487464,396.791404 l -223.983094,-223.983094 M -984.500800,145.037366 l 210.770439,210.770439 M -668.409661,313.387803 l -197.958672,-197.958672 M -750.038755,84.018007 l 183.789643,183.789643 M -465.614236,220.701825 l -170.110670,-170.110670 M -523.311898,15.263460 l 156.323652,156.323652 M -270.503659,120.330997 l -142.289778,-142.289778 M -304.384299,-61.290345 l 128.394395,128.394395 M -83.707760,11.645492 l -114.289014,-114.289014 M -93.641536,-146.028986 l 58.818718,58.818718 M -5762.464183,-134.301757 l 26.053092,-26.053092 M -5631.521596,-117.503642 l -111.077686,111.077686 M -5650.892896,49.608361 l 123.860040,-123.860040 M -5419.258542,-34.285291 l -137.869975,137.869975 M -5461.340099,155.536968 l 152.659154,-152.659154 M -5197.598513,39.536084 l -165.727531,165.727531 M -5263.381479,253.059752 l 179.498203,-179.498203 M -4966.652002,104.070976 l -194.627076,194.627076 M -5057.202905,342.362581 l 206.565456,-206.565456 M -4731.248210,164.148589 l -219.756922,219.756922 M -4842.787854,423.428935 l 234.846265,-234.846265 M -4486.791968,215.173751 l -247.832599,247.832599 M -4620.046048,496.168533 l 258.209866,-258.209866 M -4234.827264,258.690451 l -273.073850,273.073850 M -4388.807161,560.411050 l 282.560795,-282.560795 M -3975.675325,295.019916 l -294.209227,294.209227 M -4148.811107,615.896400 l 305.596036,-305.596036 M -3707.045573,321.871568 l -318.299539,318.299539 M -3899.694023,662.260720 l 327.424048,-327.424048 M -3433.793409,344.100808 l -337.642806,337.642806 M -3640.713055,698.761156 l 347.306503,-347.306503 M -3150.632892,356.421695 l -361.126054,361.126054 M -3371.539346,725.068852 l 365.603390,-365.603390 M -2858.561633,359.831840 l -374.107599,374.107599 M -3090.825039,739.835949 l 381.709311,-381.709311 M -2556.725425,353.477036 l -389.099216,389.099216 M -2797.457270,741.949584 l 395.527053,-395.527053 M -2233.493796,325.726811 l -411.984193,411.984193 M -2489.600778,729.574496 l 406.694890,-406.694890 M -1918.705391,306.419810 l -418.544080,418.544080 M -2164.274966,699.730088 l 417.489365,-417.489365 M -1561.896465,245.092289 l -437.684611,437.684611 M -1817.677921,648.614447 l 416.679390,-416.679390 M -1218.388362,197.065590 l -415.886666,415.886666 M -1442.676109,569.094039 l 432.295846,-432.295846 M -827.879977,102.038609 l -419.629009,419.629009 M -1026.441391,448.340725 l 411.666495,-411.666495 M -373.183242,-57.176723 l -428.326709,428.326709 M -578.153262,295.533999 l 442.986907,-442.986907 M -34.822817,-100.055743 l -254.744492,254.744492"
           id="path390" />
      </g>
    </g>
    <g
       id="g856"
       transform="matrix(0.00143584,0,0,-0.00143584,-986.96599,-744.81157)"
       style="stroke-width:69.64564372;stroke:#000000;stroke-opacity:1;fill:none;stroke-dasharray:none"
       clip-path="none">
      <g
         id="g398">
        <path
           d="m 0,-2298.68 c -57.798,-23.308 -173.111,-66.987 -231.903,-87.746 v 538.477 c -82.081,-32.827 -245.394,-92.001 -329.408,-119.338 l -94.011,-557.563 c -61.565,-18.452 -184.123,-52.351 -246.457,-68.09 L -438.09,158.614 C -325.748,123.107 -108.882,44.555 0,0 Z m -231.903,2144.89 c -5.601,2.079 -16.768,6.254 -22.38,8.235 l -264.138,-1567.137 c 72.981,25.323 215.226,79.494 286.518,109.121 z"
           style="fill:none;fill-opacity:1;fill-rule:nonzero;stroke:#000000;stroke-width:69.6456;stroke-dasharray:none;stroke-opacity:1"
           id="path858"
           sodipodi:nodetypes="cccccccccccccc" />
        <path
           style="stroke:#000000;fill:none;stroke-width:69.6456"
           d="M -314.566294,80.184525 l -121.983228,-121.983228 M -466.492609,-219.482491 l 260.717132,260.717132 M -98.159195,1.110221 l -122.084837,-122.084837 M -496.435695,-397.166279 l 197.762619,197.762619 M -34.822817,-83.294104 l -162.257365,-162.257365 M -526.378781,-574.850067 l 197.756385,197.756385 M -34.822817,-231.034806 l -162.257365,-162.257365 M -556.321867,-752.533855 l 197.750152,197.750152 M -34.822817,-378.775508 l -162.257365,-162.257365 M -586.264953,-930.217643 l 197.743918,197.743918 M -34.822817,-526.516210 l -162.257365,-162.257365 M -616.208039,-1107.901431 l 197.737684,197.737684 M -34.822817,-674.256912 l -162.257365,-162.257365 M -646.151125,-1285.585219 l 197.731451,197.731451 M -34.822817,-821.997614 l -162.257365,-162.257365 M -676.094210,-1463.269007 l 197.725217,197.725217 M -34.822817,-969.738316 l -162.257365,-162.257365 M -706.037296,-1640.952795 l 197.718983,197.718983 M -34.822817,-1117.479018 l -162.257365,-162.257365 M -735.980382,-1818.636583 l 197.712750,197.712750 M -34.822817,-1265.219720 l -162.257365,-162.257365 M -765.923468,-1996.320371 l 259.653742,259.653742 M -34.822817,-1412.960422 l -761.043737,-761.043737 M -332.046212,-1857.924518 l 297.223394,297.223394 M -628.104172,-2153.982479 l -197.705468,-197.705468 M -197.080183,-1870.699191 l 162.257365,162.257365 M -658.066833,-2331.685841 l -197.685894,-197.685894 M -197.080183,-2018.439893 l 162.257365,162.257365 M -34.822817,-2003.923230 l -162.257365,-162.257365 M -197.080183,-2313.921297 l 162.257365,162.257365 M -839.481496,-2432.817430 l 84.421873,-84.421873 M -677.516971,-2447.041253 l -140.657974,140.657974 M -796.868394,-2179.949128 l 140.667883,-140.667883 M -634.884051,-2194.192769 l -140.677792,140.677792 M -754.255293,-1927.080825 l 140.687702,-140.687702 M -589.722027,-1943.873389 l -143.226715,143.226715 M -711.642191,-1674.212523 l 229.315692,-229.315692 M -89.584214,-2296.270500 l -107.495969,107.495969 M -690.335640,-1547.778372 l 316.751398,-316.751398 M -34.822817,-2203.291194 l -162.257365,162.257365 M -669.029089,-1421.344220 l 140.687596,-140.687596 M -266.333091,-1824.040219 l -121.948470,121.948470 M -197.080183,-1893.293127 l 162.257365,-162.257365 M -507.031787,-1435.600821 l -140.690752,140.690752 M -281.523546,-1661.109062 l 246.700728,-246.700728 M -485.722080,-1309.169826 l -140.693908,140.693908 M -197.080183,-1597.811723 l 162.257365,-162.257365 M -464.412373,-1182.738831 l -140.697064,140.697064 M -197.080183,-1450.071021 l 162.257365,-162.257365 M -443.102666,-1056.307836 l -140.700220,140.700220 M -197.080183,-1302.330319 l 162.257365,-162.257365 M -421.792959,-929.876840 l -140.703376,140.703376 M -197.080183,-1154.589617 l 162.257365,-162.257365 M -400.483252,-803.445845 l -140.706532,140.706532 M -197.080183,-1006.848915 l 162.257365,-162.257365 M -379.173545,-677.014850 l -140.709688,140.709688 M -197.080183,-859.108213 l 162.257365,-162.257365 M -357.863838,-550.583855 l -140.712844,140.712844 M -197.080183,-711.367511 l 162.257365,-162.257365 M -336.554131,-424.152860 l -140.716001,140.716001 M -197.080183,-563.626809 l 162.257365,-162.257365 M -315.244424,-297.721865 l -140.719157,140.719157 M -197.080183,-415.886107 l 162.257365,-162.257365 M -293.934718,-171.290870 l -140.722313,140.722313 M -197.080183,-268.145405 l 162.257365,-162.257365 M -34.822817,-282.662068 l -378.527662,378.527662 M -214.176246,44.432063 l 179.353428,-179.353428"
           id="path396" />
      </g>
    </g>
    <g
       id="g860"
       transform="matrix(0.00143584,0,0,-0.00143584,-988.49811,-742.65685)"
       style="stroke-width:69.64564372;stroke:#000000;stroke-opacity:1;fill:none;stroke-dasharray:none"
       clip-path="url(#clipPath586)">
      <g
         id="g404">
        <path
           d="m 0,0 c 21.58,-35.803 38.628,-103.557 36.445,-145.123 v -677.015 c 0,-208.214 -173.058,-376.968 -386.492,-376.968 -213.416,0 -386.555,168.754 -386.555,376.968 v 392.647 c 65.147,9.26 193.165,31 257.78,43.641 v -436.288 c 0,-69.404 57.577,-125.732 128.775,-125.732 71.147,0 128.781,56.328 128.781,125.732 v 677.015 c 2.286,41.566 -14.71,109.32 -36.513,145.123 l -442.327,828.338 c -21.671,35.779 -38.771,103.605 -36.496,145.112 v 551.394 c 0,208.207 173.139,376.911 386.555,376.911 213.434,0 386.492,-168.704 386.492,-376.911 v -424.802 c -64.442,17.649 -192.466,49.2 -257.711,63.517 v 361.285 c 0,69.407 -57.634,125.614 -128.781,125.614 -71.198,0 -128.775,-56.207 -128.775,-125.614 V 973.45 c -2.282,-41.507 14.703,-109.333 36.324,-145.112 L 0,0"
           style="fill:none;fill-opacity:1;fill-rule:nonzero;stroke:#000000;stroke-width:69.64564372;stroke-opacity:1;stroke-dasharray:none"
           id="path862" />
        <path
           style="stroke:#000000;fill:none;stroke-width:69.64564372"
           d="M -524.175861,1846.089016 l -152.888942,-152.888942 M -701.779183,1520.744992 l 349.406681,349.406681 M -228.748862,1846.034611 l -473.030320,-473.030320 M -264.751301,1662.291469 l 131.665424,131.665424 M -513.644817,1413.397953 l -188.134365,-188.134365 M -198.931641,1580.370428 l 138.479512,138.479512 M -513.644817,1265.657251 l -188.134365,-188.134365 M -186.443183,1445.118184 l 174.620399,174.620399 M -513.644817,1117.916549 l -186.068454,-186.068454 M -186.443183,1297.377482 l 188.065365,188.065365 M -513.644817,970.175847 l -145.192917,-145.192917 M -152.564081,1183.515881 l 154.186264,154.186264 M -489.948504,846.131459 l -117.459702,-117.459702 M -33.984131,1154.355130 l 35.606313,35.606313 M -439.506425,748.832836 l -116.472253,-116.472253 M -504.549149,536.049409 l 116.485212,116.485212 M -336.621449,556.236407 l -116.498172,-116.498172 M -401.690093,343.427062 l 116.511131,116.511131 M -233.736474,363.639978 l -116.524090,-116.524090 M -298.831036,150.804714 l 116.537050,116.537050 M -130.851499,171.043549 l -116.550009,-116.550009 M -201.243541,-47.089195 l 121.834530,121.834530 M -596.526987,-442.372641 l -105.252196,-105.252196 M -186.443183,-180.029538 l 158.476659,158.476659 M -513.644817,-507.231173 l -188.134365,-188.134365 M -186.443183,-327.770240 l 194.029889,194.029889 M -513.644817,-654.971875 l -188.134409,-188.134409 M -186.443183,-475.510942 l 188.065365,188.065365 M -513.644817,-802.712577 l -158.500769,-158.500769 M -186.443183,-623.251644 l 188.065365,188.065365 M -481.255384,-918.063846 l -131.479571,-131.479571 M -186.443183,-770.992346 l 188.065365,188.065365 M -387.699411,-972.248575 l -143.351715,-143.351715 M -424.847940,-1157.137806 l 426.470123,426.470123 M -0.514579,-880.545147 l -287.468408,-287.468408 M -524.178929,-1143.436948 l -152.912950,152.912950 M -701.779183,-818.095992 l 349.406585,-349.406585 M -228.753408,-1143.381065 l -473.025775,473.025775 M -701.779183,-522.614588 l 188.134365,-188.134365 M -133.097006,-1091.296765 l -131.636991,131.636991 M -628.897670,-447.755399 l 115.252853,-115.252853 M -60.466997,-1016.186072 l -138.503858,138.503858 M -186.443183,-742.469184 l 174.607577,-174.607577 M 1.622183,-782.793847 l -188.065365,188.065365 M -186.443183,-446.987780 l 188.065365,-188.065365 M 1.622183,-487.312443 l -188.065365,188.065365 M -195.042053,-142.907505 l 196.664236,-196.664236 M 1.622183,-191.831039 l -252.116581,252.116581 M -419.789319,377.321165 l 415.539645,-415.539645 M -205.488628,310.761175 l -383.595612,383.595612 M -701.779183,954.792432 l 326.855128,-326.855128 M -483.383043,884.136995 l -218.396140,218.396140 M -701.779183,1250.273836 l 188.134365,-188.134365 M -513.644817,1209.880173 l -188.134365,188.134365 M -701.785692,1545.761749 l 188.140874,-188.140874 M -513.644817,1505.361577 l -158.538016,158.538016 M -612.748567,1752.206029 l 131.486668,-131.486668 M 1.622183,1137.835279 l -188.065365,188.065365 M -531.059626,1818.257790 l 143.376397,-143.376397 M 1.622183,1285.575981 l -188.065365,188.065365 M -424.849809,1859.788675 l 426.471992,-426.471992 M -0.552359,1583.231927 l -287.430765,287.430765"
           id="path402" />
      </g>
    </g>
    <g
       id="g864"
       transform="matrix(0.00143584,0,0,-0.00143584,-988.4981,-742.65684)"
       style="stroke-width:69.64564372;stroke:#000000;stroke-opacity:1;fill:none;stroke-dasharray:none"
       clip-path="none">
      <g
         id="g410">
        <path
           d="M 0,0 C 21.579,-35.8 38.627,-103.55 36.441,-145.116 V -822.13 c 0,-208.221 -173.058,-376.971 -386.489,-376.971 -213.419,0 -386.557,168.75 -386.557,376.971 v 392.646 c 65.146,9.258 193.167,31.007 257.782,43.645 V -822.13 c 0,-69.407 57.578,-125.738 128.775,-125.738 71.146,0 128.78,56.331 128.78,125.738 v 677.014 C -218.982,-103.55 -235.977,-35.8 -257.783,0 l -442.324,828.352 c -21.672,35.767 -38.773,103.598 -36.498,145.099 v 551.406 c 0,208.205 173.138,376.906 386.557,376.906 213.431,0 386.489,-168.701 386.489,-376.906 V 1100.05 c -64.44,17.64 -192.464,49.201 -257.709,63.511 v 361.296 c 0,69.407 -57.634,125.608 -128.78,125.608 -71.197,0 -128.775,-56.201 -128.775,-125.608 V 973.451 c -2.282,-41.501 14.704,-109.332 36.323,-145.099 z"
           style="fill:none;fill-opacity:1;fill-rule:nonzero;stroke:#000000;stroke-width:69.64564372;stroke-opacity:1;stroke-dasharray:none"
           id="path866" />
        <path
           style="stroke:#000000;fill:none;stroke-width:69.64564372"
           d="M -524.178691,1846.097891 l -152.887556,-152.887556 M -701.782183,1520.753698 l 349.407753,349.407753 M -228.751970,1846.043209 l -473.030213,-473.030213 M -264.753858,1662.300619 l 131.665135,131.665135 M -513.645817,1413.408659 l -188.136365,-188.136365 M -198.931378,1580.382397 l 138.476519,138.476519 M -513.645817,1265.667957 l -188.136365,-188.136365 M -186.445183,1445.127890 l 174.619482,174.619482 M -513.645817,1117.927255 l -186.073261,-186.073261 M -186.445183,1297.387188 l 188.063365,188.063365 M -513.645817,970.186553 l -145.191933,-145.191933 M -152.570140,1183.521528 l 154.188323,154.188323 M -489.950217,846.141452 l -117.458799,-117.458799 M -33.990626,1154.360341 l 35.608808,35.608808 M -439.507201,748.843765 l -116.473080,-116.473080 M -504.551548,536.058717 l 116.486419,116.486419 M -336.623056,556.246506 l -116.499757,-116.499757 M -401.694079,343.434781 l 116.513095,116.513095 M -233.738912,363.649247 l -116.526433,-116.526433 M -298.836611,150.810845 l 116.539772,116.539772 M -130.854767,171.051987 l -116.553110,-116.553110 M -201.249443,-47.083391 l 121.836749,121.836749 M -596.529151,-442.363099 l -105.253032,-105.253032 M -186.445183,-180.019833 l 158.474561,158.474561 M -513.645817,-507.220467 l -188.136365,-188.136365 M -186.445183,-327.760535 l 194.027318,194.027318 M -513.645817,-654.961169 l -188.136590,-188.136590 M -186.445183,-475.501237 l 188.063365,188.063365 M -513.645817,-802.701871 l -158.506552,-158.506552 M -186.445183,-623.241939 l 188.063365,188.063365 M -481.258813,-918.055569 l -131.481497,-131.481497 M -186.445183,-770.982641 l 188.063365,188.063365 M -387.702641,-972.240099 l -143.354213,-143.354213 M -424.853768,-1157.131928 l 426.471950,426.471950 M -0.519200,-880.538062 l -287.466955,-287.466955 M -524.181752,-1143.432830 l -152.913329,152.913329 M -701.782183,-818.091698 l 349.407658,-349.407658 M -228.756495,-1143.376683 l -473.025687,473.025687 M -701.782183,-522.610294 l 188.136365,-188.136365 M -133.100016,-1091.292460 l -131.635699,131.635699 M -628.904267,-447.747507 l 115.258450,-115.258450 M -60.470336,-1016.181439 l -138.505105,138.505105 M -186.445183,-742.465890 l 174.605608,-174.605608 M 1.618183,-782.788553 l -188.063365,188.063365 M -186.445183,-446.984486 l 188.063365,-188.063365 M 1.618183,-487.307149 l -188.063365,188.063365 M -195.046271,-142.901993 l 196.664454,-196.664454 M 1.618183,-191.825745 l -252.121457,252.121457 M -419.789591,377.322731 l 415.537743,-415.537743 M -205.485467,310.759308 l -383.590441,383.590441 M -701.782183,954.796726 l 326.865793,-326.865793 M -483.387315,884.142561 l -218.394868,218.394868 M -701.782183,1250.278131 l 188.136365,-188.136365 M -513.645817,1209.882467 l -188.136365,188.136365 M -701.789669,1545.767021 l 188.143852,-188.143852 M -513.645817,1505.363871 l -158.545993,158.545993 M -612.754321,1752.213077 l 131.487998,-131.487998 M 1.618183,1137.840573 l -188.063365,188.063365 M -531.065407,1818.264865 l 143.380006,-143.380006 M 1.618183,1285.581276 l -188.063365,188.063365 M -424.855613,1859.795773 l 426.473796,-426.473796 M -0.561368,1583.242230 l -287.424922,287.424922"
           id="path408" />
      </g>
    </g>
    <g
       id="g868"
       transform="matrix(0.00143584,0,0,-0.00143584,-989.89489,-743.02828)"
       style="stroke-width:69.64564372;stroke:#000000;stroke-opacity:1;fill:none;stroke-dasharray:none"
       clip-path="url(#clipPath574)">
      <g
         id="g416">
        <path
           d="m 0,0 c 25.481,-38.336 45.658,-111.224 42.978,-156.928 v -1021.687 c 0,-222.08 -184.567,-402.067 -412.262,-402.067 -227.651,0 -412.175,179.987 -412.175,402.067 v 416.85 c 64.809,-0.653 192.805,1.365 257.625,3.977 v -420.827 c 0,-83.283 69.243,-150.774 154.55,-150.774 85.357,0 154.652,67.491 154.652,150.774 v 1021.687 c 2.51,45.704 -17.43,118.592 -43.085,156.928 l -480.737,813.646 c -25.666,38.24 -45.629,111.18 -43.005,156.827 v 393.471 c 0,222.037 184.524,402.124 412.175,402.124 227.695,0 412.262,-180.087 412.262,-402.124 v -337.908 c -64.65,8.065 -192.571,20.591 -257.61,25.388 v 312.52 c 0,83.238 -69.295,150.731 -154.652,150.731 -85.307,0 -154.55,-67.493 -154.55,-150.731 V 970.473 c -2.618,-45.647 17.437,-118.587 43.04,-156.827 L 0,0"
           style="fill:none;fill-opacity:1;fill-rule:nonzero;stroke:#000000;stroke-width:69.64564372;stroke-opacity:1;stroke-dasharray:none"
           id="path870" />
        <path
           style="stroke:#000000;fill:none;stroke-width:69.64564372"
           d="M -431.382586,1729.179055 l -321.423146,-321.423146 M -746.636183,1266.184757 l 457.442122,457.442122 M -182.196737,1682.883500 l -140.560923,-140.560923 M -746.636183,1118.444055 l 187.979365,187.979365 M -98.093387,1619.246148 l -130.761151,-130.761151 M -751.845088,965.494448 l 193.188270,193.188270 M -34.888131,1534.710702 l -148.772603,-148.772603 M -719.424339,850.174495 l 160.767521,160.767521 M 3.467187,1425.325319 l -183.276370,-183.276370 M -664.657030,757.201101 l 119.624144,119.624144 M 8.155183,1282.272612 l -187.964365,-187.964365 M -609.785774,664.331656 l 111.115705,111.115705 M 8.155183,1134.531910 l -69.408897,-69.408897 M -554.914517,571.462210 l 111.119795,111.119795 M -388.919376,589.716649 l -111.123884,-111.123884 M -445.172003,385.723320 l 111.127974,111.127974 M -279.168683,403.985938 l -111.132063,-111.132063 M -335.429490,199.984429 l 111.136153,111.136153 M -169.417991,218.255226 l -111.140242,-111.140242 M -225.404662,14.527853 l 110.862017,110.862017 M -59.667299,32.524514 l -127.959127,-127.959127 M -179.809183,-235.358072 l 171.835118,171.835118 M 8.155183,-195.134409 l -187.964365,-187.964365 M -746.636183,-949.925774 l 155.200093,155.200093 M 8.155183,-342.875111 l -187.964365,-187.964365 M -746.636183,-1097.666476 l 187.979365,187.979365 M 8.155183,-490.615813 l -187.964365,-187.964365 M -741.812759,-1240.583754 l 183.155941,183.155941 M 8.155183,-638.356515 l -187.964365,-187.964365 M -703.333983,-1349.845680 l 149.029253,149.029253 M 8.155183,-786.097217 l -187.964365,-187.964365 M -640.037943,-1434.290342 l 130.726652,130.726652 M 8.155183,-933.837919 l -187.964365,-187.964365 M -555.816111,-1497.809212 l 140.212230,140.212230 M 8.155183,-1081.578621 l -457.078961,-457.078961 M -306.907479,-1544.381984 l 321.735327,321.735327 M -752.763319,-1222.412323 l 321.380916,-321.380916 M -289.190443,-1538.244497 l -457.445740,457.445740 M -746.636183,-933.058055 l 187.979365,-187.979365 M -182.181673,-1497.512564 l -140.550405,140.550405 M -735.348850,-796.604686 l 176.692032,-176.692032 M -98.070729,-1433.882806 l -130.739406,130.739406 M -589.634604,-794.578229 l 30.977787,-30.977787 M -34.864664,-1349.348170 l -148.755766,148.755766 M -179.809183,-1056.662949 l 183.289089,-183.289089 M 8.155183,-1096.886612 l -187.964365,187.964365 M -179.809183,-761.181545 l 187.964365,-187.964365 M 8.155183,-801.405208 l -187.964365,187.964365 M -179.809183,-465.700141 l 187.964365,-187.964365 M 8.155183,-505.923804 l -187.964365,187.964365 M -187.815090,-162.212829 l 195.970272,-195.970272 M 8.155183,-210.442400 l -247.061305,247.061305 M -452.250976,397.704461 l 460.607764,-460.607764 M -233.490181,326.684368 l -497.231579,497.231579 M -746.636183,987.571072 l 299.739313,-299.739313 M -545.372879,934.048470 l -201.263304,201.263304 M -746.636183,1283.052476 l 187.979365,-187.979365 M -558.656817,1242.813813 l -183.143220,183.143220 M -703.310544,1535.208241 l 149.046119,-149.046119 M -509.266861,1488.905261 l -130.748478,130.748478 M -179.809183,1159.447582 l 83.380932,-83.380932 M -415.578302,1542.957403 l -140.222819,140.222819 M -179.809183,1307.188284 l 187.964365,-187.964365 M 8.155183,1266.964621 l -457.077384,457.077384 M -306.907286,1729.767791 l 321.777547,-321.777547"
           id="path414" />
      </g>
    </g>
    <g
       id="g872"
       transform="matrix(0.00143584,0,0,-0.00143584,-989.89489,-743.02828)"
       style="stroke-width:69.64564372;stroke:#000000;stroke-opacity:1;fill:none;stroke-dasharray:none"
       clip-path="none">
      <g
         id="g422">
        <path
           d="m 0,0 c 25.48,-38.334 45.659,-111.217 42.975,-156.925 v -1021.693 c 0,-222.076 -184.563,-402.067 -412.259,-402.067 -227.652,0 -412.178,179.991 -412.178,402.067 v 416.863 c 64.81,-0.666 192.806,1.364 257.628,3.964 v -420.827 c 0,-83.279 69.245,-150.77 154.55,-150.77 85.358,0 154.651,67.491 154.651,150.77 v 1021.693 c 2.51,45.708 -17.43,118.591 -43.086,156.925 l -480.735,813.651 c -25.664,38.237 -45.631,111.184 -43.008,156.828 v 393.473 c 0,222.027 184.526,402.115 412.178,402.115 227.696,0 412.259,-180.088 412.259,-402.115 v -337.906 c -64.648,8.058 -192.571,20.58 -257.608,25.389 v 312.517 c 0,83.23 -69.293,150.72 -154.651,150.72 -85.305,0 -154.55,-67.49 -154.55,-150.72 V 970.479 c -2.619,-45.644 17.438,-118.591 43.037,-156.828 z"
           style="fill:none;fill-opacity:1;fill-rule:nonzero;stroke:#000000;stroke-width:69.64564372;stroke-opacity:1;stroke-dasharray:none"
           id="path874" />
        <path
           style="stroke:#000000;fill:none;stroke-width:69.64564372"
           d="M -431.383668,1729.179973 l -321.419402,-321.419402 M -746.639183,1266.183757 l 457.442787,457.442787 M -182.198706,1682.883532 l -140.560072,-140.560072 M -746.639183,1118.443055 l 187.982365,187.982365 M -98.095063,1619.246473 l -130.760597,-130.760597 M -751.842054,965.499481 l 193.185237,193.185237 M -34.889638,1534.711195 l -148.767146,-148.767146 M -719.423192,850.177642 l 160.766374,160.766374 M 3.465457,1425.325589 l -183.275640,-183.275640 M -664.656200,757.203931 l 119.626252,119.626252 M 8.152183,1282.271612 l -187.962365,-187.962365 M -609.785299,664.334131 l 111.114460,111.114460 M 8.152183,1134.530910 l -69.406999,-69.406999 M -554.914397,571.464330 l 111.118908,111.118908 M -388.920140,589.717885 l -111.123356,-111.123356 M -445.172595,385.724728 l 111.127804,111.127804 M -279.169441,403.987180 l -111.132253,-111.132253 M -335.430792,199.985127 l 111.136701,111.136701 M -169.418742,218.256475 l -111.141149,-111.141149 M -225.406571,14.527944 l 110.863178,110.863178 M -59.668043,32.525770 l -127.956788,-127.956788 M -179.810183,-235.357072 l 171.836083,171.836083 M 8.152183,-195.135409 l -187.962365,-187.962365 M -746.639183,-949.926774 l 155.204358,155.204358 M 8.152183,-342.876111 l -187.962365,-187.962365 M -746.639183,-1097.667476 l 187.982365,187.982365 M 8.152183,-490.616813 l -187.962365,-187.962365 M -741.815893,-1240.584888 l 183.159075,183.159075 M 8.152183,-638.357515 l -187.962365,-187.962365 M -703.336766,-1349.846463 l 149.028500,149.028500 M 8.152183,-786.098217 l -187.962365,-187.962365 M -640.040626,-1434.291025 l 130.728960,130.728960 M 8.152183,-933.838919 l -187.962365,-187.962365 M -555.819193,-1497.810294 l 140.215395,140.215395 M 8.152183,-1081.579621 l -457.077366,-457.077366 M -306.908952,-1544.381457 l 321.732651,321.732651 M -752.766564,-1222.415077 l 321.383074,-321.383074 M -289.192897,-1538.248042 l -457.446285,457.446285 M -746.639183,-933.061055 l 187.982365,-187.982365 M -182.184257,-1497.515980 l -140.549459,140.549459 M -735.360257,-796.599278 l 176.703439,-176.703439 M -98.073565,-1433.885970 l -130.739686,130.739686 M -589.642829,-794.576004 l 30.986012,-30.986012 M -34.867775,-1349.351058 l -148.755068,148.755068 M -179.810183,-1056.667949 l 183.286985,-183.286985 M 8.152183,-1096.889612 l -187.962365,187.962365 M -179.810183,-761.186545 l 187.962365,-187.962365 M 8.152183,-801.408208 l -187.962365,187.962365 M -179.810183,-465.705141 l 187.962365,-187.962365 M 8.152183,-505.926804 l -187.962365,187.962365 M -187.822321,-162.211598 l 195.974504,-195.974504 M 8.152183,-210.445400 l -247.054248,247.054248 M -452.241546,397.689031 l 460.591669,-460.591669 M -233.481561,326.669748 l -497.246211,497.246211 M -746.639183,987.568072 l 299.750884,-299.750884 M -545.380879,934.050470 l -201.258303,201.258303 M -746.639183,1283.049476 l 187.982365,-187.982365 M -558.656817,1242.807813 l -183.147725,183.147725 M -703.314927,1535.206624 l 149.040602,-149.040602 M -509.269220,1488.901619 l -130.749958,130.749958 M -179.810183,1159.442582 l 83.372195,-83.372195 M -415.578738,1542.951839 l -140.226076,140.226076 M -179.810183,1307.183284 l 187.962365,-187.962365 M 8.152183,1266.961621 l -457.075844,457.075844 M -306.908765,1729.763270 l 321.768968,-321.768968"
           id="path420" />
      </g>
    </g>
    <g
       id="g876"
       transform="matrix(0.00143584,0,0,-0.00143584,-991.29442,-744.6358)"
       style="stroke-width:69.64564372;stroke:#000000;stroke-opacity:1;fill:none;stroke-dasharray:none"
       clip-path="url(#clipPath562)">
      <g
         id="g428">
        <path
           d="m 0,0 v -2707.538 c -64.883,1.559 -192.994,7.357 -257.722,11.815 V -13.016 C -192.994,-8.114 -64.946,-1.685 0,0"
           style="fill:none;fill-opacity:1;fill-rule:nonzero;stroke:#000000;stroke-width:69.64564372;stroke-opacity:1;stroke-dasharray:none"
           id="path878" />
        <path
           style="stroke:#000000;fill:none;stroke-width:69.64564372"
           d="M -148.358478,-41.057082 l -74.540704,-74.540704 M -222.899183,-263.338489 l 188.076365,188.076365 M -34.822817,-223.002826 l -188.076365,-188.076365 M -222.899183,-558.819893 l 188.076365,188.076365 M -34.822817,-518.484230 l -188.076365,-188.076365 M -222.899183,-854.301297 l 188.076365,188.076365 M -34.822817,-813.965634 l -188.076365,-188.076365 M -222.899183,-1149.782701 l 188.076365,188.076365 M -34.822817,-1109.447038 l -188.076365,-188.076365 M -222.899183,-1445.264105 l 188.076365,188.076365 M -34.822817,-1404.928442 l -188.076365,-188.076365 M -222.899183,-1740.745509 l 188.076365,188.076365 M -34.822817,-1700.409846 l -188.076365,-188.076365 M -222.899183,-2036.226913 l 188.076365,188.076365 M -34.822817,-1995.891250 l -188.076365,-188.076365 M -222.899183,-2331.708317 l 188.076365,188.076365 M -34.822817,-2291.372654 l -188.076365,-188.076365 M -222.899183,-2627.189722 l 188.076365,188.076365 M -34.822817,-2586.854058 l -81.616575,-81.616575 M -147.763139,-2667.076257 l -75.136044,75.136044 M -222.899183,-2444.199511 l 188.076365,-188.076365 M -34.822817,-2484.535174 l -188.076365,188.076365 M -222.899183,-2148.718107 l 188.076365,-188.076365 M -34.822817,-2189.053770 l -188.076365,188.076365 M -222.899183,-1853.236703 l 188.076365,-188.076365 M -34.822817,-1893.572366 l -188.076365,188.076365 M -222.899183,-1557.755299 l 188.076365,-188.076365 M -34.822817,-1598.090962 l -188.076365,188.076365 M -222.899183,-1262.273895 l 188.076365,-188.076365 M -34.822817,-1302.609558 l -188.076365,188.076365 M -222.899183,-966.792491 l 188.076365,-188.076365 M -34.822817,-1007.128154 l -188.076365,188.076365 M -222.899183,-671.311087 l 188.076365,-188.076365 M -34.822817,-711.646750 l -188.076365,188.076365 M -222.899183,-375.829683 l 188.076365,-188.076365 M -34.822817,-416.165346 l -188.076365,188.076365 M -222.899183,-80.348278 l 188.076365,-188.076365 M -34.822817,-120.683942 l -81.213748,81.213748"
           id="path426" />
      </g>
    </g>
    <g
       id="g880"
       transform="matrix(0.00143584,0,0,-0.00143584,-991.29443,-744.63581)"
       style="stroke-width:69.64564372;stroke:#000000;stroke-opacity:1;fill:none;stroke-dasharray:none"
       clip-path="none">
      <g
         id="g434">
        <path
           d="m 0,-2707.536 c -64.883,1.559 -192.993,7.358 -257.721,11.808 V -13.027 C -192.993,-8.122 -64.944,-1.689 0,0 Z"
           style="fill:none;fill-opacity:1;fill-rule:nonzero;stroke:#000000;stroke-width:69.6456;stroke-dasharray:none;stroke-opacity:1"
           id="path882"
           sodipodi:nodetypes="ccccc" />
        <path
           style="stroke:#000000;fill:none;stroke-width:69.6456"
           d="M -148.364585,-41.064164 l -74.533598,-74.533598 M -222.898183,-263.338464 l 188.075365,188.075365 M -34.822817,-223.003801 l -188.075365,-188.075365 M -222.898183,-558.819868 l 188.075365,188.075365 M -34.822817,-518.485205 l -188.075365,-188.075365 M -222.898183,-854.301272 l 188.075365,188.075365 M -34.822817,-813.966609 l -188.075365,-188.075365 M -222.898183,-1149.782676 l 188.075365,188.075365 M -34.822817,-1109.448013 l -188.075365,-188.075365 M -222.898183,-1445.264080 l 188.075365,188.075365 M -34.822817,-1404.929417 l -188.075365,-188.075365 M -222.898183,-1740.745484 l 188.075365,188.075365 M -34.822817,-1700.410821 l -188.075365,-188.075365 M -222.898183,-2036.226888 l 188.075365,188.075365 M -34.822817,-1995.892225 l -188.075365,-188.075365 M -222.898183,-2331.708292 l 188.075365,188.075365 M -34.822817,-2291.373629 l -188.075365,-188.075365 M -222.898183,-2627.189696 l 188.075365,188.075365 M -34.822817,-2586.855033 l -81.613900,-81.613900 M -147.761466,-2667.074955 l -75.136717,75.136717 M -222.898183,-2444.197536 l 188.075365,-188.075365 M -34.822817,-2484.532199 l -188.075365,188.075365 M -222.898183,-2148.716132 l 188.075365,-188.075365 M -34.822817,-2189.050795 l -188.075365,188.075365 M -222.898183,-1853.234728 l 188.075365,-188.075365 M -34.822817,-1893.569391 l -188.075365,188.075365 M -222.898183,-1557.753324 l 188.075365,-188.075365 M -34.822817,-1598.087987 l -188.075365,188.075365 M -222.898183,-1262.271920 l 188.075365,-188.075365 M -34.822817,-1302.606583 l -188.075365,188.075365 M -222.898183,-966.790516 l 188.075365,-188.075365 M -34.822817,-1007.125179 l -188.075365,188.075365 M -222.898183,-671.309112 l 188.075365,-188.075365 M -34.822817,-711.643775 l -188.075365,188.075365 M -222.898183,-375.827708 l 188.075365,-188.075365 M -34.822817,-416.162371 l -188.075365,188.075365 M -222.898183,-80.346304 l 188.075365,-188.075365 M -34.822817,-120.680967 l -81.205693,81.205693"
           id="path432" />
      </g>
    </g>
    <g
       id="g884"
       transform="matrix(0.00143584,0,0,-0.00143584,-991.29442,-745.57449)"
       style="stroke-width:69.64564372;stroke:#000000;stroke-opacity:1;fill:none;stroke-dasharray:none"
       clip-path="url(#clipPath550)">
      <g
         id="g440">
        <path
           d="m 0,0 v -452.627 c -64.946,-1.636 -192.994,-7.909 -257.722,-12.595 V -11.83 C -192.994,-7.469 -64.883,-1.587 0,0"
           style="fill:none;fill-opacity:1;fill-rule:nonzero;stroke:#000000;stroke-width:69.64564372;stroke-opacity:1;stroke-dasharray:none"
           id="path886" />
        <path
           style="stroke:#000000;fill:none;stroke-width:69.64564372"
           d="M -166.164032,-41.588158 l -56.735151,-56.735151 M -222.899183,-246.064011 l 188.076365,188.076365 M -34.822817,-205.728348 l -188.076365,-188.076365 M -107.460726,-426.106959 l 72.637909,72.637909 M -222.899183,-366.898691 l 57.919648,-57.919648 M -34.822817,-407.234354 l -188.076365,188.076365 M -222.899183,-71.417287 l 188.076365,-188.076365 M -34.822817,-111.752950 l -73.056370,73.056370"
           id="path438" />
      </g>
    </g>
    <g
       id="g888"
       transform="matrix(0.00143584,0,0,-0.00143584,-991.29443,-745.57449)"
       style="stroke-width:69.64564372;stroke:#000000;stroke-opacity:1;fill:none;stroke-dasharray:none"
       clip-path="none">
      <g
         id="g446">
        <path
           d="m 0,-452.631 c -64.944,-1.64 -192.993,-7.911 -257.721,-12.589 V -11.825 C -192.993,-7.472 -64.883,-1.592 0,0 Z"
           style="fill:none;fill-opacity:1;fill-rule:nonzero;stroke:#000000;stroke-width:69.6456;stroke-dasharray:none;stroke-opacity:1"
           id="path890"
           sodipodi:nodetypes="ccccc" />
        <path
           style="stroke:#000000;fill:none;stroke-width:69.6456"
           d="M -166.163964,-41.589171 l -56.734218,-56.734218 M -222.898183,-246.064091 l 188.075365,188.075365 M -34.822817,-205.729428 l -188.075365,-188.075365 M -107.461115,-426.108427 l 72.638297,72.638297 M -222.898183,-366.896611 l 57.925644,-57.925644 M -34.822817,-407.231274 l -188.075365,188.075365 M -222.898183,-71.415207 l 188.075365,-188.075365 M -34.822817,-111.749870 l -73.050496,73.050496"
           id="path444" />
      </g>
    </g>
    <g
       id="g892"
       transform="matrix(0.00143584,0,0,-0.00143584,-992.03436,-745.52787)"
       style="stroke-width:69.64564372;stroke:#000000;stroke-opacity:1;fill:none;stroke-dasharray:none"
       clip-path="url(#clipPath538)">
      <g
         id="g452">
        <path
           d="m 0,0 v -3296.41 c -58.454,5.443 -173.798,18.405 -231.931,26.186 v 2127.022 l -309.134,-1524.305 -309.289,1435.618 v -1932.806 c -58.551,12.148 -173.857,38.724 -231.815,53.382 v 2926.209 c 57.958,14.656 173.264,41.184 231.815,53.383 l 309.289,-1435.572 309.134,1541.1 C -173.798,-18.36 -58.454,-5.447 0,0"
           style="fill:none;fill-opacity:1;fill-rule:nonzero;stroke:#000000;stroke-width:69.64564372;stroke-opacity:1;stroke-dasharray:none"
           id="path894" />
        <path
           style="stroke:#000000;fill:none;stroke-width:69.64564372"
           d="M -926.070561,-170.849095 l -121.275621,-121.275621 M -1047.346183,-439.865418 l 187.387090,187.387090 M -833.771004,-374.030942 l -213.575178,-213.575178 M -1047.346183,-735.346822 l 239.763267,239.763267 M -781.394828,-617.136169 l -265.951355,-265.951355 M -234.982926,-218.464970 l 177.723348,177.723348 M -755.206739,-738.688783 l -292.139443,-292.139443 M -272.055113,-403.277859 l 237.232296,237.232296 M -729.018651,-860.241397 l -318.327532,-318.327532 M -309.127300,-588.090748 l 274.304483,274.304483 M -702.830563,-981.794011 l -344.515620,-344.515620 M -346.199488,-772.903637 l 311.376670,311.376670 M -676.642474,-1103.346624 l -136.397444,-136.397444 M -1047.346183,-1474.050333 l 162.169365,162.169365 M -34.822817,-609.267669 l -348.448857,-348.448857 M -786.852520,-1361.297372 l 136.398134,136.398134 M -885.176817,-1459.621669 l -162.169365,-162.169365 M -420.343862,-1142.529416 l 385.521045,385.521045 M -624.266298,-1346.451852 l -136.398825,-136.398825 M -1047.346183,-1769.531737 l 162.169365,162.169365 M -34.822817,-904.749073 l -422.593232,-422.593232 M -734.477724,-1604.403980 l 136.399515,136.399515 M -885.176817,-1755.103073 l -162.169365,-162.169365 M -197.108183,-1214.775141 l 162.285365,162.285365 M -303.568476,-1321.235435 l -190.919760,-190.919760 M -708.290326,-1725.957285 l 136.400206,136.400206 M -885.176817,-1902.843776 l -162.169365,-162.169365 M -197.108183,-1362.515843 l 162.285365,162.285365 M -341.153042,-1506.560702 l -340.949886,-340.949886 M -1047.346183,-2212.753843 l 162.169365,162.169365 M -34.822817,-1347.971180 l -162.285365,-162.285365 M -655.915531,-1969.063893 l 277.177923,277.177923 M -885.176817,-2198.325180 l -162.169365,-162.169365 M -197.108183,-1657.997247 l 162.285365,162.285365 M -416.322173,-1877.211238 l -213.405959,-213.405959 M -1047.346183,-2508.235247 l 162.169365,162.169365 M -34.822817,-1643.452584 l -162.285365,-162.285365 M -603.540735,-2212.170501 l 149.633996,149.633996 M -885.176817,-2493.806584 l -162.169365,-162.169365 M -197.108183,-1953.478651 l 162.285365,162.285365 M -491.491305,-2247.861773 l -85.862032,-85.862032 M -1047.346183,-2803.716651 l 162.169365,162.169365 M -34.822817,-1938.933988 l -162.285365,-162.285365 M -551.165939,-2455.277109 l 22.090069,22.090069 M -885.176817,-2789.287988 l -162.169365,-162.169365 M -197.108183,-2248.960055 l 162.285365,162.285365 M -885.176817,-2937.028690 l -149.937197,-149.937197 M -197.108183,-2396.700757 l 162.285365,162.285365 M -885.176817,-3084.769392 l -30.071990,-30.071990 M -197.108183,-2544.441459 l 162.285365,162.285365 M -34.822817,-2529.896796 l -162.285365,-162.285365 M -197.108183,-2839.922863 l 162.285365,162.285365 M -34.822817,-2825.378200 l -162.285365,-162.285365 M -197.108183,-3135.404267 l 162.285365,162.285365 M -34.822817,-3120.859604 l -123.522501,-123.522501 M -926.061212,-3125.570254 l -121.284970,121.284970 M -1047.346183,-2856.544582 l 162.169365,-162.169365 M -885.176817,-2870.973245 l -162.169365,162.169365 M -1047.346183,-2561.063178 l 162.169365,-162.169365 M -885.176817,-2575.491841 l -162.169365,162.169365 M -1047.346183,-2265.581774 l 162.169365,-162.169365 M -57.265380,-3255.662576 l -139.842802,139.842802 M -1047.346183,-2117.841072 l 162.169365,-162.169365 M -34.822817,-3130.364437 l -162.285365,162.285365 M -1047.346183,-1970.100370 l 162.169365,-162.169365 M -34.822817,-2982.623735 l -162.285365,162.285365 M -1047.346183,-1822.359667 l 162.169365,-162.169365 M -513.469933,-2356.235917 l -75.243926,75.243926 M -197.108183,-2672.597667 l 162.285365,-162.285365 M -885.176817,-1836.788331 l -162.169365,162.169365 M -629.283332,-2092.681816 l 140.723786,-140.723786 M -34.822817,-2687.142331 l -162.285365,162.285365 M -1047.346183,-1526.878263 l 162.169365,-162.169365 M -463.649160,-2110.575286 l -206.203645,206.203645 M -197.108183,-2377.116263 l 162.285365,-162.285365 M -885.176817,-1541.306927 l -162.169365,162.169365 M -710.422278,-1716.061466 l 271.683505,-271.683505 M -34.822817,-2391.660927 l -162.285365,162.285365 M -1047.346183,-1231.396859 l 162.169365,-162.169365 M -413.828387,-1864.914655 l -337.163364,337.163364 M -197.108183,-2081.634859 l 162.285365,-162.285365 M -885.176817,-1245.825522 l -162.169365,162.169365 M -791.561224,-1339.441116 l 402.643224,-402.643224 M -34.822817,-2096.179522 l -162.285365,162.285365 M -1047.346183,-935.915455 l 426.524457,-426.524457 M -364.007614,-1619.254024 l -126.574032,126.574032 M -197.108183,-1786.153455 l 162.285365,-162.285365 M -661.392855,-1174.128080 l -385.953327,385.953327 M -465.897376,-1369.623560 l 126.800149,-126.800149 M -34.822817,-1800.698118 l -162.285365,162.285365 M -1047.346183,-640.434051 l 345.382197,-345.382197 M -314.186840,-1373.593393 l -127.026267,127.026267 M -197.108183,-1490.672051 l 162.285365,-162.285365 M -742.535115,-797.504416 l -304.811067,304.811067 M -416.528838,-1123.510694 l 127.252384,-127.252384 M -34.822817,-1505.216714 l -162.285365,162.285365 M -1047.346183,-344.952647 l 264.239937,-264.239937 M -264.366067,-1127.932762 l -127.478501,127.478501 M -197.108183,-1195.190647 l 162.285365,-162.285365 M -823.677375,-420.880752 l -211.426340,211.426340 M -367.160299,-877.397828 l 332.337482,-332.337482 M -864.248505,-232.568920 l -50.977912,50.977912 M -342.476030,-754.341395 l 307.653213,-307.653213 M -34.822817,-914.253906 l -282.968944,282.968944 M -293.107492,-508.228530 l 258.284674,-258.284674 M -34.822817,-618.772502 l -233.600405,233.600405 M -243.738953,-262.115664 l 208.916136,-208.916136 M -34.822817,-323.291098 l -184.231867,184.231867 M -158.365391,-52.007823 l 123.542573,-123.542573"
           id="path450" />
      </g>
    </g>
    <g
       id="g896"
       transform="matrix(0.00143584,0,0,-0.00143584,-992.03436,-745.52787)"
       style="stroke-width:69.64564372;stroke:#000000;stroke-opacity:1;fill:none;stroke-dasharray:none"
       clip-path="none">
      <g
         id="g458">
        <path
           d="m 0,-3296.415 c -58.455,5.441 -173.797,18.403 -231.932,26.184 v 2127.023 l -309.131,-1524.306 -309.29,1435.618 v -1932.803 c -58.552,12.149 -173.858,38.723 -231.818,53.375 v 2926.217 c 57.96,14.651 173.266,41.176 231.818,53.375 L -541.063,-1567.301 -231.932,-26.2 C -173.797,-18.371 -58.455,-5.458 0,0 Z"
           style="fill:none;fill-opacity:1;fill-rule:nonzero;stroke:#000000;stroke-width:69.6456;stroke-dasharray:none;stroke-opacity:1"
           id="path898"
           sodipodi:nodetypes="ccccccccccccc" />
        <path
           style="stroke:#000000;fill:none;stroke-width:69.6456"
           d="M -926.074825,-170.851059 l -121.273357,-121.273357 M -1047.348183,-439.865118 l 187.387662,187.387662 M -833.772317,-374.029955 l -213.575865,-213.575865 M -1047.348183,-735.346522 l 239.764068,239.764068 M -781.395911,-617.134953 l -265.952271,-265.952271 M -234.981361,-218.461105 l 177.711201,177.711201 M -755.207708,-738.687452 l -292.140474,-292.140474 M -272.053069,-403.273514 l 237.230251,237.230251 M -729.019505,-860.239951 l -318.328677,-318.328677 M -309.124776,-588.085923 l 274.301958,274.301958 M -702.831302,-981.792450 l -344.516880,-344.516880 M -346.196483,-772.898332 l 311.373665,311.373665 M -676.643099,-1103.344949 l -136.397636,-136.397636 M -1047.348183,-1474.050032 l 162.172365,162.172365 M -34.822817,-609.265369 l -348.445372,-348.445372 M -786.853268,-1361.295819 l 136.398371,136.398371 M -885.175817,-1459.618369 l -162.172365,-162.172365 M -420.339897,-1142.523151 l 385.517079,385.517079 M -624.266693,-1346.449947 l -136.399107,-136.399107 M -1047.348183,-1769.531436 l 162.172365,162.172365 M -34.822817,-904.746773 l -422.588786,-422.588786 M -734.478332,-1604.402288 l 136.399842,136.399842 M -885.175817,-1755.099773 l -162.172365,-162.172365 M -197.109183,-1214.773840 l 162.286365,162.286365 M -303.567132,-1321.231790 l -190.916179,-190.916179 M -708.290865,-1725.955523 l 136.400578,136.400578 M -885.175817,-1902.840475 l -162.172365,-162.172365 M -197.109183,-1362.514542 l 162.286365,162.286365 M -341.151209,-1506.556569 l -340.952188,-340.952188 M -1047.348183,-2212.753542 l 162.172365,162.172365 M -34.822817,-1347.968879 l -162.286365,-162.286365 M -655.915930,-1969.061992 l 277.180643,277.180643 M -885.175817,-2198.321879 l -162.172365,-162.172365 M -197.109183,-1657.995947 l 162.286365,162.286365 M -416.319363,-1877.206127 l -213.409099,-213.409099 M -1047.348183,-2508.234947 l 162.172365,162.172365 M -34.822817,-1643.450283 l -162.286365,-162.286365 M -603.540994,-2212.168460 l 149.637554,149.637554 M -885.175817,-2493.803283 l -162.172365,-162.172365 M -197.109183,-1953.477351 l 162.286365,162.286365 M -491.487518,-2247.855686 l -85.866009,-85.866009 M -1047.348183,-2803.716351 l 162.172365,162.172365 M -34.822817,-1938.931687 l -162.286365,-162.286365 M -551.166059,-2455.274929 l 22.094464,22.094464 M -885.175817,-2789.284687 l -162.172365,-162.172365 M -197.109183,-2248.958755 l 162.286365,162.286365 M -885.175817,-2937.025389 l -149.946869,-149.946869 M -197.109183,-2396.699457 l 162.286365,162.286365 M -885.175817,-3084.766092 l -30.078212,-30.078212 M -197.109183,-2544.440159 l 162.286365,162.286365 M -34.822817,-2529.894496 l -162.286365,-162.286365 M -197.109183,-2839.921563 l 162.286365,162.286365 M -34.822817,-2825.375900 l -162.286365,-162.286365 M -197.109183,-3135.402967 l 162.286365,162.286365 M -34.822817,-3120.857304 l -123.530711,-123.530711 M -926.062184,-3125.576583 l -121.285999,121.285999 M -1047.348183,-2856.549882 l 162.172365,-162.172365 M -885.175817,-2870.981545 l -162.172365,162.172365 M -1047.348183,-2561.068478 l 162.172365,-162.172365 M -885.175817,-2575.500141 l -162.172365,162.172365 M -1047.348183,-2265.587074 l 162.172365,-162.172365 M -57.266418,-3255.668838 l -139.842764,139.842764 M -1047.348183,-2117.846372 l 162.172365,-162.172365 M -34.822817,-3130.371737 l -162.286365,162.286365 M -1047.348183,-1970.105670 l 162.172365,-162.172365 M -34.822817,-2982.631035 l -162.286365,162.286365 M -1047.348183,-1822.364968 l 162.172365,-162.172365 M -513.468852,-2356.244298 l -75.242712,75.242712 M -197.109183,-2672.603968 l 162.286365,-162.286365 M -885.175817,-1836.796631 l -162.172365,162.172365 M -629.281204,-2092.691244 l 140.722524,-140.722524 M -34.822817,-2687.149631 l -162.286365,162.286365 M -1047.348183,-1526.883564 l 162.172365,-162.172365 M -463.648508,-2110.583238 l -206.202336,206.202336 M -197.109183,-2377.122564 l 162.286365,-162.286365 M -885.175817,-1541.315227 l -162.172365,162.172365 M -710.420484,-1716.070560 l 271.682148,-271.682148 M -34.822817,-2391.668227 l -162.286365,162.286365 M -1047.348183,-1231.402160 l 162.172365,-162.172365 M -413.828164,-1864.922178 l -337.161960,337.161960 M -197.109183,-2081.641160 l 162.286365,-162.286365 M -885.175817,-1245.833823 l -162.172365,162.172365 M -791.559765,-1339.449875 l 402.641772,-402.641772 M -34.822817,-2096.186823 l -162.286365,162.286365 M -1047.348183,-935.920756 l 426.528504,-426.528504 M -364.007820,-1619.261118 l -126.572183,126.572183 M -197.109183,-1786.159756 l 162.286365,-162.286365 M -661.391084,-1174.137152 l -385.957099,385.957099 M -465.895947,-1369.632289 l 126.798299,-126.798299 M -34.822817,-1800.705419 l -162.286365,162.286365 M -1047.348183,-640.439351 l 345.385694,-345.385694 M -314.187476,-1373.600058 l -127.024414,127.024414 M -197.109183,-1490.678351 l 162.286365,-162.286365 M -742.533894,-797.512938 l -304.814288,304.814288 M -416.527835,-1123.518997 l 127.250530,-127.250530 M -34.822817,-1505.224015 l -162.286365,162.286365 M -1047.348183,-344.957947 l 264.242883,-264.242883 M -264.367133,-1127.938997 l -127.476646,127.476646 M -197.109183,-1195.196947 l 162.286365,-162.286365 M -823.676705,-420.888723 l -211.428691,211.428691 M -367.159722,-877.405706 l 332.336904,-332.336904 M -864.248110,-232.576616 l -50.976096,50.976096 M -342.475666,-754.349060 l 307.652848,-307.652848 M -34.822817,-914.261206 l -282.968792,282.968792 M -293.107553,-508.235769 l 258.284735,-258.284735 M -34.822817,-618.779802 l -233.600679,233.600679 M -243.739440,-262.122478 l 208.916623,-208.916623 M -34.822817,-323.298398 l -184.232566,184.232566 M -158.363139,-52.017375 l 123.540322,-123.540322"
           id="path456" />
      </g>
    </g>
    <g
       id="g900"
       transform="matrix(0.00143584,0,0,-0.00143584,-993.88415,-741.476)"
       style="stroke-width:69.64564372;stroke:#000000;stroke-opacity:1;fill:none;stroke-dasharray:none"
       clip-path="url(#clipPath526)">
      <g
         id="g464">
        <path
           d="m 0,0 v -235.374 c -201.606,52.225 -581.236,179.825 -772.958,259.842 v 2298.613 c 166.282,68.951 496.068,182.421 669.868,230.475 v -236.475 c -105.539,-30.834 -309.575,-99.253 -412.228,-138.256 v -891.969 h 463.763 v -226.18 H -515.318 V 168.71 C -387.119,119.682 -132.583,36.388 0,0"
           style="fill:none;fill-opacity:1;fill-rule:nonzero;stroke:#000000;stroke-width:69.64564372;stroke-opacity:1;stroke-dasharray:none"
           id="path902" />
        <path
           style="stroke:#000000;fill:none;stroke-width:69.64564372"
           d="M -646.040967,2354.977061 l -92.094216,-92.094216 M -738.135183,2115.142143 l 292.699868,292.699868 M -198.792752,2506.743871 l -539.342430,-539.342430 M -250.147001,2307.648920 l 112.234184,112.234184 M -550.140817,2007.655104 l -187.994365,-187.994365 M -738.135183,1671.920037 l 187.994365,187.994365 M -550.140817,1712.173700 l -187.994365,-187.994365 M -738.135183,1376.438633 l 187.994365,187.994365 M -550.140817,1416.692296 l -187.994365,-187.994365 M -738.135183,1080.957228 l 187.994365,187.994365 M -419.318526,1252.033183 l -318.816656,-318.816656 M -428.112190,1095.498817 l 156.534365,156.534365 M -550.140817,973.470190 l -187.994365,-187.994365 M -280.371488,1095.498817 l 156.534365,156.534365 M -550.140817,825.729488 l -187.994365,-187.994365 M -132.630785,1095.498817 l 46.252968,46.252968 M -550.140817,677.988785 l -187.994365,-187.994365 M -738.135183,342.253718 l 187.994365,187.994365 M -550.140817,382.507381 l -187.994365,-187.994365 M -737.356465,47.551031 l 187.215648,187.215648 M -508.223793,128.943002 l -122.787257,-122.787257 M -524.862092,-35.435999 l 125.439030,125.439030 M -288.927715,52.757675 l -124.101240,-124.101240 M -302.230809,-108.286120 l 125.017691,125.017691 M -64.115758,-17.911771 l -126.084683,-126.084683 M -76.612461,-178.149176 l 41.789644,41.789644 M -738.135183,55.299155 l 27.483023,-27.483023 M -466.177256,-68.918070 l -271.957927,271.957927 M -738.135183,350.780559 l 487.556567,-487.556567 M -550.140817,310.526896 l -187.994365,187.994365 M -310.912860,71.298938 l 255.914484,-255.914484 M -550.140817,458.267598 l -187.994365,187.994365 M -96.917935,5.044716 l 62.095118,-62.095118 M -550.140817,606.008300 l -187.994365,187.994365 M -738.135183,941.743367 l 187.994365,-187.994365 M -550.140817,901.489704 l -187.994365,187.994365 M -738.135183,1237.224772 l 187.994365,-187.994365 M -448.668526,1095.498817 l -289.466656,289.466656 M -738.135183,1532.706176 l 187.994365,-187.994365 M -300.927824,1095.498817 l -156.534365,156.534365 M -738.135183,1680.446878 l 187.994365,-187.994365 M -153.187122,1095.498817 l -156.534365,156.534365 M -738.135183,1828.187580 l 187.994365,-187.994365 M -86.377817,1176.430215 l -75.602968,75.602968 M -738.135183,1975.928282 l 187.994365,-187.994365 M -550.140817,1935.674619 l -187.994365,187.994365 M -738.135183,2271.409686 l 187.994365,-187.994365 M -529.639833,2210.655038 l -122.531909,122.531909 M -544.145455,2372.901362 l 123.033178,-123.033178 M -310.978177,2287.474786 l -123.880608,123.880608 M -324.500382,2448.737693 l 124.909528,-124.909528 M -137.912817,2409.890831 l -74.749824,74.749824"
           id="path462" />
      </g>
    </g>
    <g
       id="g904"
       transform="matrix(0.00143584,0,0,-0.00143584,-993.88415,-741.476)"
       style="stroke-width:69.64564372;stroke:#000000;stroke-opacity:1;fill:none;stroke-dasharray:none"
       clip-path="none">
      <g
         id="g470">
        <path
           d="m 0,-235.379 c -201.609,52.237 -581.24,179.827 -772.962,259.841 v 2298.615 c 166.285,68.952 496.069,182.427 669.871,230.474 v -236.468 c -105.54,-30.829 -309.574,-99.261 -412.23,-138.261 v -891.96 H -51.556 V 1060.677 H -515.321 V 168.718 C -387.123,119.68 -132.585,36.385 0,0 Z"
           style="fill:none;fill-opacity:1;fill-rule:nonzero;stroke:#000000;stroke-width:69.6456;stroke-dasharray:none;stroke-opacity:1"
           id="path906"
           sodipodi:nodetypes="ccccccccccccc" />
        <path
           style="stroke:#000000;fill:none;stroke-width:69.6456"
           d="M -646.042713,2354.973070 l -92.096470,-92.096470 M -738.139183,2115.135898 l 292.706047,292.706047 M -198.794003,2506.740376 l -539.345179,-539.345179 M -250.139714,2307.653962 l 112.225897,112.225897 M -550.143817,2007.649859 l -187.995365,-187.995365 M -738.139183,1671.913792 l 187.995365,187.995365 M -550.143817,1712.168455 l -187.995365,-187.995365 M -738.139183,1376.432388 l 187.995365,187.995365 M -550.143817,1416.687051 l -187.995365,-187.995365 M -738.139183,1080.950984 l 187.995365,187.995365 M -419.310282,1252.039183 l -318.828901,-318.828901 M -428.108945,1095.499817 l 156.539365,156.539365 M -550.143817,973.464945 l -187.995365,-187.995365 M -280.368243,1095.499817 l 156.539365,156.539365 M -550.143817,825.724243 l -187.995365,-187.995365 M -132.627541,1095.499817 l 46.248723,46.248723 M -550.143817,677.983541 l -187.995365,-187.995365 M -738.139183,342.247474 l 187.995365,187.995365 M -550.143817,382.502137 l -187.995365,-187.995365 M -737.360023,47.545229 l 187.216205,187.216205 M -508.218027,128.946523 l -122.795136,-122.795136 M -524.865063,-35.441215 l 125.444208,125.444208 M -288.927140,52.756006 l -124.101154,-124.101154 M -302.229314,-108.286870 l 125.016369,125.016369 M -64.114892,-17.913150 l -126.083956,-126.083956 M -76.612049,-178.151009 l 41.789231,41.789231 M -738.139183,55.295400 l 27.483309,-27.483309 M -466.182128,-68.920952 l -271.957054,271.957054 M -738.139183,350.776804 l 487.555991,-487.555991 M -550.143817,310.522141 l -187.995365,187.995365 M -310.917878,71.296202 l 255.911668,-255.911668 M -550.143817,458.262843 l -187.995365,187.995365 M -96.921223,5.040248 l 62.098405,-62.098405 M -550.143817,606.003545 l -187.995365,187.995365 M -738.139183,941.739612 l 187.995365,-187.995365 M -550.143817,901.484949 l -187.995365,187.995365 M -738.139183,1237.221016 l 187.995365,-187.995365 M -448.677282,1095.499817 l -289.461901,289.461901 M -738.139183,1532.702420 l 187.995365,-187.995365 M -300.936580,1095.499817 l -156.539365,156.539365 M -738.139183,1680.443122 l 187.995365,-187.995365 M -153.195878,1095.499817 l -156.539365,156.539365 M -738.139183,1828.183824 l 187.995365,-187.995365 M -86.378817,1176.423459 l -75.615723,75.615723 M -738.139183,1975.924526 l 187.995365,-187.995365 M -550.143817,1935.669863 l -187.995365,187.995365 M -738.139183,2271.405930 l 187.995365,-187.995365 M -529.644143,2210.651593 l -122.531718,122.531718 M -544.150153,2372.898305 l 123.033561,-123.033561 M -310.984713,2287.473567 l -123.879235,123.879235 M -324.505700,2448.735256 l 124.906399,-124.906399 M -137.913817,2409.884075 l -74.753527,74.753527"
           id="path468" />
      </g>
    </g>
    <g
       id="g476">
      <path
         d="m -986.81801,-745.22032 c -2.27236,-1.05553 -6.05161,-1.05553 -8.32397,0 v -0.32467 c 2.30511,-1.48863 6.01877,-1.48863 8.32397,0 z"
         style="fill:none;fill-opacity:1;fill-rule:nonzero;stroke:#000000;stroke-width:0.1;stroke-dasharray:none;stroke-opacity:1"
         id="path721"
         sodipodi:nodetypes="ccccc"
         clip-path="none"
         mask="none" />
      <path
         style="stroke:#000000;fill:none;stroke-width:0.1"
         d="M -994.893481,-745.667451 l -0.198499,0.198499 M -995.059445,-745.289356 l 0.626189,-0.626189 M -994.065204,-746.071465 l -0.610945,0.610945 M -994.374280,-745.550256 l 0.629742,-0.629742 M -993.424127,-746.288278 l -0.645467,0.645467 M -993.762127,-745.738145 l 0.609555,-0.609555 M -992.881540,-746.406600 l -0.617660,0.617660 M -993.235315,-745.840694 l 0.623352,-0.623352 M -992.342911,-746.520965 l -0.627676,0.627676 M -992.706597,-745.945148 l 0.595148,-0.595148 M -991.857323,-746.582290 l -0.606094,0.606094 M -992.225544,-746.001937 l 0.585618,-0.585618 M -991.414225,-746.601124 l -0.578873,0.578873 M -991.765162,-746.038054 l 0.570894,-0.570894 M -990.979624,-746.611461 l -0.561534,0.561534 M -991.321644,-746.057309 l 0.551722,-0.551722 M -990.564845,-746.601975 l -0.540505,0.540505 M -990.893193,-746.061495 l 0.529075,-0.529075 M -990.167190,-746.575366 l -0.516689,0.516689 M -990.478306,-746.052119 l 0.503200,-0.503200 M -989.786256,-746.532036 l -0.489179,0.489179 M -990.075877,-746.030284 l 0.474884,-0.474884 M -989.419437,-746.474592 l -0.459622,0.459622 M -989.684932,-745.996965 l 0.443805,-0.443805 M -989.066050,-746.403714 l -0.427819,0.427819 M -989.305534,-745.952098 l 0.411067,-0.411067 M -988.725807,-746.319694 l -0.400935,0.400935 M -988.936815,-745.896554 l 0.376352,-0.376352 M -988.397981,-746.223255 l -0.358585,0.358585 M -988.578940,-745.830165 l 0.340223,-0.340223 M -988.082249,-746.114723 l -0.321601,0.321601 M -988.231592,-745.753249 l 0.302628,-0.302628 M -987.777740,-745.994969 l -0.284232,0.284232 M -987.894940,-745.665636 l 0.263887,-0.263887 M -987.486559,-745.861886 l -0.244245,0.244245 M -987.569396,-745.566916 l 0.224448,-0.224448 M -987.206412,-745.717769 l -0.204297,0.204297 M -987.255050,-745.456999 l 0.184344,-0.184344 M -986.938203,-745.561713 l -0.164090,0.164090 M -986.952456,-745.335329 l 0.084446,-0.084446 M -995.091980,-745.352170 l 0.037407,0.037407 M -994.903967,-745.376289 l -0.159480,-0.159480 M -994.931772,-745.616226 l 0.177835,0.177835 M -994.599190,-745.495776 l -0.197952,-0.197952 M -994.659606,-745.768324 l 0.219186,0.219186 M -994.280920,-745.601770 l -0.237953,-0.237953 M -994.375369,-745.908351 l 0.257727,0.257727 M -993.949320,-745.694434 l -0.279447,-0.279447 M -994.079331,-746.036576 l 0.296593,0.296593 M -993.611313,-745.780691 l -0.315534,-0.315534 M -993.771465,-746.152975 l 0.337196,0.337196 M -993.260312,-745.853954 l -0.355857,-0.355857 M -993.451644,-746.257418 l 0.370749,0.370749 M -992.898537,-745.916442 l -0.392094,-0.392094 M -993.119622,-746.349660 l 0.405715,0.405715 M -992.526428,-745.968598 l -0.422440,-0.422440 M -992.775026,-746.429328 l 0.438791,0.438791 M -992.140726,-746.007160 l -0.457023,-0.457023 M -992.417334,-746.495900 l 0.470133,0.470133 M -991.748370,-746.039068 l -0.484806,-0.484806 M -992.045479,-746.548309 l 0.498682,0.498682 M -991.341797,-746.056759 l -0.518534,-0.518534 M -991.658988,-746.586082 l 0.524954,0.524954 M -990.922428,-746.061654 l -0.537164,-0.537164 M -991.255927,-746.607285 l 0.548079,0.548079 M -990.489040,-746.052530 l -0.558690,-0.558690 M -990.834697,-746.610319 l 0.567919,0.567919 M -990.024942,-746.012697 l -0.591536,-0.591536 M -990.392664,-746.592550 l 0.583941,0.583941 M -989.572945,-745.984963 l -0.600978,-0.600978 M -989.925546,-746.549697 l 0.599438,0.599438 M -989.060637,-745.896919 l -0.628447,-0.628447 M -989.427887,-746.476301 l 0.598286,0.598286 M -988.567403,-745.827949 l -0.597146,-0.597146 M -988.889441,-746.362119 l 0.620692,0.620692 M -988.006709,-745.691519 l -0.602519,-0.602519 M -988.291790,-746.188732 l 0.591066,0.591066 M -987.353838,-745.462912 l -0.615005,-0.615005 M -987.648138,-745.969344 l 0.636053,0.636053 M -986.868010,-745.401348 l -0.365764,-0.365764"
         id="path474" />
    </g>
  </g>
</svg>
