(footprint "Wago_218-114_1x16_P2.5mm_Vertical" (version 20211014) (generator pcbnew)
  (layer "F.Cu")
  (tedit 0)
  (attr smd)
  (fp_text reference "REF**" (at -5.08 -7.62 unlocked) (layer "F.SilkS")
    (effects (font (size 1 1) (thickness 0.15)))
    (tstamp 33306145-76a6-4054-8f09-f469bc9b8085)
  )
  (fp_text value "Wago_218-114_1x16_P2.5mm_Vertical" (at 15.24 -7.62 unlocked) (layer "F.Fab")
    (effects (font (size 1 1) (thickness 0.15)))
    (tstamp 5921a89e-2cff-473a-9c3f-9e70c5ef188a)
  )
  (fp_text user "${REFERENCE}" (at -5.08 -7.62 unlocked) (layer "F.Fab")
    (effects (font (size 1 1) (thickness 0.15)))
    (tstamp 865fed0f-eb0a-4669-a3d5-bf0703134d2c)
  )
  (fp_circle (center 0 -2.5) (end 0.381 -2.5) (layer "B.SilkS") (width 0.12) (fill none) (tstamp 25f6cf3e-7389-4aac-867b-8bd0efc3bcad))
  (fp_line (start 34.627795 8.926795) (end 34.627795 -4.332006) (layer "F.SilkS") (width 0.12) (tstamp 06750ceb-756f-487a-a4df-fe2650f8511b))
  (fp_line (start -2.12621 8.926795) (end 34.627795 8.926795) (layer "F.SilkS") (width 0.12) (tstamp 228dcc2a-c16c-4c09-a5ea-88c3ae26fcc7))
  (fp_line (start 34.627795 -4.332006) (end -2.12621 -4.332006) (layer "F.SilkS") (width 0.12) (tstamp 2ec9ebed-7fbc-42c3-a6c8-8e13901ce191))
  (fp_line (start -2.12621 -4.332006) (end -2.12621 8.926795) (layer "F.SilkS") (width 0.12) (tstamp 71893488-5fbf-454b-b3ed-d67bfd72b5be))
  (fp_circle (center 0 -2.5) (end 0.381 -2.5) (layer "F.SilkS") (width 0.12) (fill none) (tstamp 5fc92a23-36f8-4d29-bcad-86b02bb7a27b))
  (fp_line (start 34.754795 9.053794) (end 34.754795 -4.459006) (layer "F.CrtYd") (width 0.05) (tstamp 104c07c2-7c99-42c8-b61a-34b3142f1711))
  (fp_line (start -2.25321 9.053794) (end 34.754795 9.053794) (layer "F.CrtYd") (width 0.05) (tstamp 3bab5686-47a1-4fd8-8bb1-d174720bb2a7))
  (fp_line (start -2.25321 -4.459006) (end -2.25321 9.053794) (layer "F.CrtYd") (width 0.05) (tstamp 84361b4b-246a-4a8f-bae9-b402f58441f8))
  (fp_line (start 34.754795 -4.459006) (end -2.25321 -4.459006) (layer "F.CrtYd") (width 0.05) (tstamp 8ef46a1d-247b-4a8c-8471-ee72a542f414))
  (fp_line (start -2.25321 9.053794) (end 34.754795 9.053794) (layer "F.CrtYd") (width 0.05) (tstamp 9290c105-eb08-4718-a11d-d4eca425b224))
  (fp_line (start -2.25321 -4.459006) (end -2.25321 9.053794) (layer "F.CrtYd") (width 0.05) (tstamp 99c0f8e0-3f4f-477e-b0fb-d162c08d3163))
  (fp_line (start 34.754795 9.053794) (end 34.754795 -4.459006) (layer "F.CrtYd") (width 0.05) (tstamp a496f832-4a06-48ef-8812-3b43f8bdb22d))
  (fp_line (start 34.754795 -4.459006) (end -2.25321 -4.459006) (layer "F.CrtYd") (width 0.05) (tstamp ebd409eb-627b-4a03-93a5-201c82967a54))
  (fp_line (start -1.99921 -4.205006) (end -1.99921 8.799795) (layer "F.Fab") (width 0.1) (tstamp 0ca20d98-e9d5-40af-ad47-6fde281290ee))
  (fp_line (start 34.500795 -4.205006) (end -1.99921 -4.205006) (layer "F.Fab") (width 0.1) (tstamp 15458ae3-d558-46f3-ac94-1d74d2ec7388))
  (fp_line (start -1.99921 8.799795) (end 34.500795 8.799795) (layer "F.Fab") (width 0.1) (tstamp b0670704-a2d6-4a11-b9c4-22d29e3155a8))
  (fp_line (start 34.500795 8.799795) (end 34.500795 -4.205006) (layer "F.Fab") (width 0.1) (tstamp d7b856e2-4577-46ae-8b09-a22260d2e1ff))
  (fp_circle (center 0 -2.5) (end 0.381 -2.5) (layer "F.Fab") (width 0.1) (fill none) (tstamp 00f19c6b-778e-48dc-bc79-29024db23093))
  (pad "1" thru_hole circle (at 0 0) (size 2 2) (drill 1.5) (layers *.Cu *.Mask) (tstamp 1977ab8a-629f-492f-bdd4-f372dda2ddfe))
  (pad "1" thru_hole circle (at 0 4.99999) (size 2 2) (drill 1.5) (layers *.Cu *.Mask) (tstamp 643ccf21-e9ed-4631-a2af-c8f7580a0f80))
  (pad "2" thru_hole circle (at 2.5 0) (size 2 2) (drill 1.5) (layers *.Cu *.Mask) (tstamp dcaef017-c3d1-4079-99ae-62a3892b7436))
  (pad "2" thru_hole circle (at 2.5 5) (size 2 2) (drill 1.5) (layers *.Cu *.Mask) (tstamp f2227ecb-92e2-4c38-9242-f5f11d75aac4))
  (pad "3" thru_hole circle (at 5 5) (size 2 2) (drill 1.5) (layers *.Cu *.Mask) (tstamp 081eb5cb-debc-41cc-b6c1-8584830fb5eb))
  (pad "3" thru_hole circle (at 5 0) (size 2 2) (drill 1.5) (layers *.Cu *.Mask) (tstamp 9da97276-8ec4-4cea-8916-04061f4f0bf4))
  (pad "4" thru_hole circle (at 7.5 0) (size 2 2) (drill 1.5) (layers *.Cu *.Mask) (tstamp 6a443412-09ff-40eb-abad-e902c7959abf))
  (pad "4" thru_hole circle (at 7.5 4.99999) (size 2 2) (drill 1.5) (layers *.Cu *.Mask) (tstamp ce7f019d-6bb6-4b58-95fe-fe3da6b0ed4a))
  (pad "5" thru_hole circle (at 10 0) (size 2 2) (drill 1.5) (layers *.Cu *.Mask) (tstamp 2b8b06ff-033d-4781-9c52-a5fbed199206))
  (pad "5" thru_hole circle (at 10 5) (size 2 2) (drill 1.5) (layers *.Cu *.Mask) (tstamp c9446075-6515-497e-983c-525b59b67b82))
  (pad "6" thru_hole circle (at 12.5 5) (size 2 2) (drill 1.5) (layers *.Cu *.Mask) (tstamp 1ffc9c63-6c3f-4eba-9fb3-870dbcf02e8d))
  (pad "6" thru_hole circle (at 12.5 0) (size 2 2) (drill 1.5) (layers *.Cu *.Mask) (tstamp fbe9afcc-2043-428d-81a4-0a9a83027925))
  (pad "7" thru_hole circle (at 15 0) (size 2 2) (drill 1.5) (layers *.Cu *.Mask) (tstamp 36958717-b1c0-4909-81af-55eb86f4355a))
  (pad "7" thru_hole circle (at 15 5) (size 2 2) (drill 1.5) (layers *.Cu *.Mask) (tstamp 8c7768c2-d01b-4a98-ac94-ea44d9d95938))
  (pad "8" thru_hole circle (at 17.5 0) (size 2 2) (drill 1.5) (layers *.Cu *.Mask) (tstamp 10b20ad8-9402-4620-9e56-26515564867d))
  (pad "8" thru_hole circle (at 17.5 5) (size 2 2) (drill 1.5) (layers *.Cu *.Mask) (tstamp c6069944-a61b-4a0c-b47b-6ad64104f009))
  (pad "9" thru_hole circle (at 20 0) (size 2 2) (drill 1.5) (layers *.Cu *.Mask) (tstamp 41c0d9ce-4f30-48c5-abe8-f2e942c571d7))
  (pad "9" thru_hole circle (at 20 5) (size 2 2) (drill 1.5) (layers *.Cu *.Mask) (tstamp c568fe5a-0444-43c9-a7f2-387b30654c3d))
  (pad "10" thru_hole circle (at 22.5 5) (size 2 2) (drill 1.5) (layers *.Cu *.Mask) (tstamp 237f9043-d67a-4856-98c2-6cc7a142b072))
  (pad "10" thru_hole circle (at 22.5 0) (size 2 2) (drill 1.5) (layers *.Cu *.Mask) (tstamp 7368a47e-1136-4ac0-b2e5-d7c83a37e631))
  (pad "11" thru_hole circle (at 25 0) (size 2 2) (drill 1.5) (layers *.Cu *.Mask) (tstamp 92acc5ae-c314-4d63-a539-126490950ac0))
  (pad "11" thru_hole circle (at 25 5) (size 2 2) (drill 1.5) (layers *.Cu *.Mask) (tstamp bbdde4c3-cd92-450a-9e11-c6417a5dba6e))
  (pad "12" thru_hole circle (at 27.5 5) (size 2 2) (drill 1.5) (layers *.Cu *.Mask) (tstamp 5a5acc10-7561-44a0-9b6d-819436cc6507))
  (pad "12" thru_hole circle (at 27.5 0) (size 2 2) (drill 1.5) (layers *.Cu *.Mask) (tstamp aed01cbc-6005-4c5c-887d-c00d7608967d))
  (pad "13" thru_hole circle (at 30 5) (size 2 2) (drill 1.5) (layers *.Cu *.Mask) (tstamp 720b9c4e-a268-415d-9da3-d4d088f0477a))
  (pad "13" thru_hole circle (at 30 0) (size 2 2) (drill 1.5) (layers *.Cu *.Mask) (tstamp b6fcb198-add4-467e-beb0-1f09ca5bdc7d))
  (pad "14" thru_hole circle (at 32.5 5) (size 2 2) (drill 1.5) (layers *.Cu *.Mask) (tstamp 39ab72a3-5958-4ebc-8bef-1371dce268c5))
  (pad "14" thru_hole circle (at 32.5 0) (size 2 2) (drill 1.5) (layers *.Cu *.Mask) (tstamp 88ee6d4f-9e1f-40b2-beef-2908cdd53216))
  (model ":USR_3D:connector/218-114.stp"
    (offset (xyz -1.5 -5 0))
    (scale (xyz 1 1 1))
    (rotate (xyz -90 0 -90))
  )
)
