2 0.193359 0.734028 0.164844 0.404167
2 0.405078 0.736806 0.164844 0.404167
1 0.651953 0.740972 0.135156 0.390278
1 0.863672 0.743750 0.135156 0.390278
4 0.351172 0.079861 0.222656 0.156944
6 0.772266 0.095833 0.455469 0.186111
