1 0.859766 0.759028 0.147656 0.337500
1 0.654297 0.749306 0.147656 0.337500
2 0.214062 0.690972 0.132812 0.456944
2 0.405469 0.718056 0.167187 0.405556
4 0.435156 0.070833 0.204687 0.138889
6 0.770703 0.088194 0.458594 0.173611
