2 0.394922 0.698611 0.127344 0.433333
2 0.148047 0.700000 0.127344 0.430556
1 0.653125 0.748611 0.132812 0.341667
1 0.903906 0.743056 0.132812 0.341667
4 0.417187 0.075694 0.214062 0.148611
6 0.773438 0.095833 0.453125 0.188889
