8 0.956641 0.827083 0.086719 0.345833
3 0.619531 0.608333 0.129688 0.272222
1 0.863672 0.732639 0.138281 0.429167
0 0.203906 0.726389 0.132812 0.402778
0 0.424219 0.725000 0.135937 0.397222
5 0.447266 0.329167 0.428906 0.655556
