      0/99    0.323G   0.06929   0.02036   0.01627    0.1059         6       640  0.006443     0.203  0.002874 0.0004275   0.07061   0.02614   0.01237
      1/99     1.98G   0.06677   0.01778   0.01712    0.1017        11       640   0.01859   0.06136  0.005261 0.0007064   0.06456   0.02624   0.01165
      2/99     1.98G   0.06157   0.01631   0.01623   0.09411         8       640   0.01236    0.1121  0.006383 0.0009622   0.05915   0.02571   0.01143
      3/99     1.98G   0.06169   0.01608   0.01591   0.09368         6       640   0.02432    0.6258   0.02114  0.004487   0.05456     0.026    0.0117
      4/99     1.98G   0.05367   0.01472   0.01271    0.0811         7       640    0.1394    0.4477    0.1321   0.02698   0.05039   0.02607   0.01115
      5/99     1.98G   0.05689    0.0137   0.01275   0.08334         6       640    0.0568    0.2114   0.04216  0.006741   0.05405   0.02577    0.0127
      6/99     1.98G     0.048   0.01298   0.01337   0.07435         4       640    0.1669    0.2045     0.108   0.03729   0.04988   0.02582    0.0114
      7/99     1.98G   0.04131   0.01212   0.01133   0.06476         8       640    0.1316    0.4182    0.1128   0.03777    0.0465   0.02619   0.01201
      8/99     1.98G   0.04104   0.01112   0.01103   0.06319         6       640    0.1972     0.497    0.1774   0.04961   0.04059   0.02574   0.01196
      9/99     1.98G   0.04097   0.01088    0.0121   0.06394         6       640    0.2732    0.6749    0.2962    0.1459   0.03892   0.02421   0.01179
     10/99     1.98G   0.03599   0.01074   0.01072   0.05744         6       640    0.2875    0.5955    0.3301    0.1595   0.04063   0.02357   0.01141
     11/99     1.98G   0.03203   0.01026   0.01153   0.05381         6       640    0.2734    0.5902    0.3196    0.1151   0.03901   0.02297   0.01183
     12/99     1.98G   0.05063   0.01009   0.01318    0.0739         6       640    0.3551    0.7879    0.4254    0.1839   0.03675   0.02148   0.01136
     13/99     1.98G    0.0288   0.01071  0.009721   0.04922        13       640    0.4354    0.9006    0.5058    0.2448   0.03606   0.01994    0.0113
     14/99     1.98G   0.02717   0.01014  0.009818   0.04713         6       640    0.4526    0.7424    0.4673    0.2293   0.03618   0.01934   0.01119
     15/99     1.98G   0.02835   0.01024  0.009584   0.04818         8       640    0.4822     0.628    0.4885    0.2524   0.03687   0.01918   0.01101
     16/99     1.98G   0.02949  0.009615  0.009885   0.04899         6       640    0.4519    0.7758    0.4869    0.1755   0.03794   0.01982   0.01118
     17/99     1.98G   0.02869  0.009365    0.0101   0.04816         6       640    0.5016    0.7822    0.5839    0.3462   0.03743   0.01855   0.01106
     18/99     1.98G   0.03353  0.009447    0.0108   0.05378         6       640     0.568    0.6705     0.555    0.3036   0.03613   0.01814   0.01146
     19/99     1.98G   0.03315  0.009565   0.01056   0.05328         7       640    0.5083    0.7928    0.5771    0.3328   0.03522    0.0173   0.01125
     20/99     1.98G   0.02807  0.009522    0.0094   0.04699         8       640    0.5369    0.8233     0.598    0.3435   0.03369   0.01719   0.01127
     21/99     1.99G   0.02631  0.009634   0.01062   0.04656        10       640     0.507    0.8356    0.6187    0.2881   0.03575   0.01597   0.01132
     22/99     1.99G   0.03406  0.008067   0.01014   0.05226         8       640    0.4821    0.8465     0.578    0.3043   0.03884   0.01763   0.01096
     23/99     1.99G   0.03277  0.009046  0.009563   0.05138         7       640    0.5174    0.8414    0.6045    0.3132   0.03777   0.01747   0.01036
     24/99     1.99G   0.02584  0.009342   0.00918   0.04437        15       640    0.5104    0.8803    0.6295    0.3213   0.03535   0.01649   0.01042
     25/99     1.99G   0.03302  0.008771  0.009101    0.0509         9       640     0.548    0.8265    0.6358    0.2688   0.03885   0.01695   0.01046
     26/99     1.99G   0.02747  0.009215  0.009224   0.04591        13       640    0.4335    0.6689    0.4637    0.2036    0.0396   0.02481   0.01091
     27/99     1.99G   0.02439  0.008248   0.00845   0.04109         8       640     0.487    0.8176    0.5856    0.2952   0.03659    0.0218   0.01032
     28/99     1.99G    0.0309  0.008208  0.008837   0.04794         4       640    0.6002    0.8409    0.6893    0.3534   0.03413   0.01768  0.009726
     29/99     1.99G   0.02942  0.009095  0.008758   0.04727        10       640    0.7397    0.8735    0.8396    0.4994   0.03143   0.01799  0.009295
     30/99     1.99G   0.03151  0.008835  0.008151   0.04849        10       640     0.684    0.8439     0.841    0.5063   0.03435   0.01828  0.008896
     31/99     1.99G   0.03251  0.008378  0.008956   0.04984        12       640    0.7852    0.7924    0.8328    0.5206   0.03282   0.01944  0.008918
     32/99     1.99G   0.02283  0.008847  0.006909   0.03858         8       640    0.7852    0.9234    0.9285    0.5605   0.03296   0.01828  0.008141
     33/99     1.99G   0.02417  0.008301  0.006505   0.03898        10       640    0.8594     0.897    0.9388    0.6788   0.03042   0.01843  0.007123
     34/99     1.99G   0.02361  0.007412  0.005886   0.03691         3       640    0.8243    0.9667    0.9631    0.5401   0.03316   0.01881  0.006558
     35/99     1.99G    0.0266  0.008223   0.00568    0.0405         4       640    0.7139    0.9439    0.8821    0.4237    0.0324   0.01856  0.005897
     36/99     1.99G   0.03322  0.007797  0.005641   0.04666         6       640     0.804    0.7416    0.7909     0.467   0.02974   0.02318  0.007694
     37/99     1.99G    0.0255  0.007929  0.006627   0.04006         6       640    0.6657    0.8258    0.7257    0.4558   0.02837   0.02148  0.008732
     38/99     1.99G   0.03428  0.008823  0.008452   0.05155        15       640    0.8119    0.8166    0.8497    0.5353   0.02877   0.02007  0.007768
     39/99     1.99G    0.0228  0.008154  0.005694   0.03665         6       640    0.9666    0.8075    0.9357    0.6031   0.02898   0.01937  0.007006
     40/99     1.99G   0.02462  0.007738  0.004695   0.03705        14       640    0.9348    0.9379    0.9654    0.4882   0.03246   0.01974  0.005737
     41/99     1.99G   0.02362  0.007352  0.005019   0.03599         7       640    0.7958    0.9159    0.8451    0.3748   0.03245   0.01903  0.005607
     42/99     1.99G   0.02161  0.008473  0.004628   0.03471         8       640    0.9463    0.9082    0.9651    0.6492   0.02968   0.01807  0.005853
     43/99     1.99G   0.02399  0.008008  0.004097   0.03609        11       640    0.9391    0.8826    0.9613    0.5735    0.0302   0.01798  0.005676
     44/99     1.99G    0.0272  0.007385  0.004605   0.03919         4       640     0.923    0.9519    0.9773    0.6288   0.02769   0.01886  0.004968
     45/99     1.99G   0.02524  0.007899  0.004655    0.0378         8       640    0.9569    0.9303    0.9853    0.5653   0.02679   0.01897  0.004754
     46/99     1.99G   0.02719  0.008548  0.004125   0.03986        18       640    0.7852    0.9523    0.9683    0.6444   0.02884   0.01803  0.004646
     47/99     1.99G   0.02299  0.007342  0.004749   0.03508         4       640     0.725    0.9659    0.9595    0.5106   0.03409   0.01827  0.008746
     48/99     1.99G   0.02462  0.007192  0.003483   0.03529         8       640    0.9494    0.9348      0.97    0.6875   0.02722   0.01871  0.005299
     49/99     1.99G   0.02162  0.007877  0.003106    0.0326        10       640    0.9626    0.9326    0.9849    0.6223   0.02963   0.01846   0.00461
     50/99     1.99G   0.01976  0.007208  0.003133    0.0301        10       640    0.9673    0.9417    0.9901    0.6589   0.02779   0.01769  0.004401
     51/99     1.99G   0.02944  0.007219    0.0033   0.03996         5       640    0.9246    0.9083     0.959    0.6684   0.02811   0.01803  0.004448
     52/99     1.99G   0.01923  0.006713  0.002924   0.02887         5       640    0.9703    0.9667     0.991     0.664   0.02889   0.01786  0.004307
     53/99     1.99G   0.01872    0.0073  0.003035   0.02905         8       640    0.9422    0.9998    0.9915      0.74   0.02563   0.01782  0.004398
     54/99     1.99G   0.02639  0.006967   0.00305   0.03641        11       640      0.97    0.9916    0.9938    0.7091   0.02854   0.01769  0.004059
     55/99     1.99G   0.02831  0.007089  0.004868   0.04027         7       640    0.8742       0.9    0.9843    0.7056   0.02731   0.01914  0.005649
     56/99     1.99G    0.0268   0.00721  0.004149   0.03816         7       640     0.877    0.8751    0.9882    0.7303   0.02752   0.01831  0.005684
     57/99     1.99G   0.01676   0.00689  0.001978   0.02563         6       640    0.8864    0.9334    0.9928    0.7031   0.02667   0.01919  0.004881
     58/99     1.99G   0.02027  0.007603  0.002609   0.03048        10       640    0.8949    0.9583    0.9923    0.7126   0.02717   0.01886  0.004703
     59/99     1.99G   0.02025  0.006889  0.002258    0.0294         6       640     0.972     0.975    0.9925    0.7337   0.02586   0.01786  0.004126
     60/99     1.99G   0.02477  0.006834  0.002527   0.03413         6       640    0.9715    0.9719     0.992    0.7549   0.02382   0.01786  0.003877
     61/99     1.99G   0.01683  0.006964  0.002251   0.02605         7       640    0.9885      0.95    0.9927    0.7273   0.02552   0.01831  0.003807
     62/99     1.99G   0.02055  0.007404  0.002213   0.03017         9       640    0.9616    0.9499    0.9897     0.741   0.02358   0.01851   0.00403
     63/99     1.99G   0.01666   0.00669  0.001939   0.02529         7       640      0.93    0.9833    0.9921    0.7566   0.02193    0.0185  0.003963
     64/99     1.99G   0.01867  0.006284  0.001874   0.02683         6       640    0.9715    0.9667    0.9939     0.772   0.02226   0.01832  0.003883
     65/99     1.99G   0.02251  0.006533  0.002001   0.03104        13       640    0.9696    0.9821    0.9945     0.768   0.02338   0.01821  0.003788
     66/99     1.99G   0.02635  0.006597  0.002814   0.03576        11       640    0.9695    0.9661    0.9943    0.7775   0.02368   0.01778  0.003783
     67/99     1.99G   0.01469  0.007339  0.001798   0.02383        10       640    0.9884         1    0.9956    0.7756   0.02352    0.0173  0.003451
     68/99     1.99G    0.0226  0.006583  0.002461   0.03165        10       640    0.9988    0.9916    0.9954    0.7716   0.02385   0.01807  0.003353
     69/99     1.99G   0.01959  0.006403  0.002955   0.02895         9       640    0.9829     0.972    0.9938    0.7409   0.02361   0.01865  0.003498
     70/99     1.99G   0.02445   0.00663  0.001781   0.03286         5       640    0.9832    0.9833    0.9929    0.7601   0.02315   0.01807  0.003334
     71/99     1.99G    0.0233   0.00617   0.00503    0.0345        10       640    0.9768    0.9483    0.9945    0.7561   0.02359   0.01789  0.003784
     72/99     1.99G    0.0229  0.006508  0.005118   0.03453        13       640       0.9    0.9241    0.9709    0.7188   0.02517   0.01915  0.004855
     73/99     1.99G   0.02416  0.006234  0.001965   0.03236        15       640    0.9215    0.8892    0.9688    0.7343   0.02347   0.01867  0.004688
     74/99     1.99G   0.01453  0.006831   0.00168   0.02304         6       640    0.9288    0.9331    0.9821    0.7697   0.02309   0.01746  0.004185
     75/99     1.99G   0.02299   0.00668  0.002008   0.03168         6       640    0.9772    0.9917    0.9953    0.7847   0.02226   0.01742  0.003321
     76/99     1.99G   0.01388  0.006302  0.001653   0.02183         8       640    0.9764    0.9833    0.9953    0.7937   0.02176   0.01753  0.003278
     77/99     1.99G   0.01986  0.006352  0.002678   0.02889         8       640    0.9841     0.972    0.9944    0.7885   0.02209   0.01744   0.00334
     78/99     1.99G   0.02032  0.006623  0.001445   0.02839         8       640    0.9947     0.972    0.9943    0.7781    0.0229   0.01737  0.003444
     79/99     1.99G     0.017  0.006308  0.001673   0.02498         3       640    0.9915    0.9737     0.995    0.7715   0.02225   0.01726  0.003461
     80/99     1.99G   0.01659  0.005951  0.001336   0.02388         4       640    0.9917     0.988    0.9951    0.7772    0.0221    0.0172  0.003457
     81/99     1.99G   0.01341  0.006341  0.001327   0.02108         5       640    0.9843    0.9998    0.9957    0.7836   0.02239   0.01708  0.003345
     82/99     1.99G   0.01695  0.005852  0.001592   0.02439         5       640    0.9889     0.999    0.9956    0.7786   0.02193   0.01717  0.003269
     83/99     1.99G   0.01922   0.00605  0.002586   0.02786         8       640    0.9889    0.9947    0.9956    0.7903   0.02197   0.01723  0.003244
     84/99     1.99G   0.01348  0.006481  0.001326   0.02129        12       640    0.9836         1    0.9956    0.7864    0.0219   0.01736  0.003225
     85/99     1.99G   0.02039  0.006275  0.003326   0.02999         8       640     0.983         1    0.9958    0.7824   0.02199   0.01731  0.003214
     86/99     1.99G     0.013  0.006437  0.001169    0.0206        14       640    0.9999    0.9962    0.9958    0.7711   0.02226   0.01749  0.003169
     87/99     1.99G   0.01603  0.006509   0.00365   0.02619         7       640    0.9862         1    0.9955    0.7641   0.02228   0.01748   0.00314
     88/99     1.99G   0.02138  0.006111  0.001585   0.02908         6       640    0.9872         1    0.9955    0.7771   0.02198   0.01728  0.003155
     89/99     1.99G   0.01294  0.006143 0.0009882   0.02007         8       640     0.988         1    0.9955    0.7789   0.02195   0.01719  0.003154
     90/99     1.99G   0.01719  0.007077  0.001433    0.0257        18       640    0.9848         1    0.9955    0.7884   0.02194   0.01701   0.00309
     91/99     1.99G   0.01272  0.006201  0.001082   0.02001        13       640         1    0.9851    0.9958    0.7902   0.02181   0.01718  0.003055
     92/99     1.99G   0.01934  0.006512  0.001147     0.027         7       640    0.9998    0.9826    0.9958    0.7824   0.02175   0.01724  0.003035
     93/99     1.99G   0.01547  0.005757  0.001093   0.02232         6       640    0.9947    0.9917    0.9959    0.7811     0.022   0.01737  0.003033
     94/99     1.99G   0.01574  0.006165  0.001232   0.02313         5       640    0.9981    0.9917    0.9959    0.7872   0.02201   0.01747  0.003048
     95/99     1.99G   0.01659  0.006296  0.001909    0.0248        11       640    0.9906         1    0.9959    0.7893   0.02174   0.01739  0.003045
     96/99     1.99G   0.01274  0.006975  0.001406   0.02113        13       640    0.9916         1    0.9959     0.783   0.02181   0.01718  0.003058
     97/99     1.99G     0.016  0.005867  0.001017   0.02288        10       640    0.9921         1     0.996    0.7823   0.02187   0.01714  0.003057
     98/99     1.99G   0.01233  0.006045  0.001346   0.01972         3       640    0.9911         1    0.9959    0.7888   0.02192   0.01706  0.003047
     99/99     1.99G   0.01878  0.006277  0.001256   0.02632        15       640    0.9899         1    0.9959    0.7993   0.02193   0.01693  0.003043
