1 0.862109 0.754167 0.138281 0.361111
1 0.655859 0.754167 0.138281 0.361111
2 0.192969 0.727778 0.175000 0.394444
2 0.431641 0.695833 0.147656 0.469444
2 0.042188 0.705556 0.082812 0.411111
4 0.435156 0.062500 0.200000 0.122222
