1 0.902344 0.747222 0.134375 0.377778
1 0.651953 0.757639 0.135156 0.331944
2 0.118750 0.736806 0.160938 0.362500
2 0.369531 0.735417 0.160938 0.362500
4 0.355469 0.091667 0.242188 0.180556
6 0.753125 0.285417 0.493750 0.565278
