2 0.431250 0.704861 0.123438 0.434722
2 0.217578 0.702083 0.127344 0.440278
1 0.658984 0.758333 0.149219 0.347222
1 0.866797 0.761111 0.149219 0.347222
4 0.420312 0.087500 0.220312 0.172222
6 0.755859 0.259028 0.488281 0.509722
