8 0.952344 0.801389 0.095312 0.397222
4 0.382812 0.070139 0.207813 0.137500
0 0.198047 0.721528 0.158594 0.440278
0 0.640234 0.725694 0.158594 0.440278
0 0.417578 0.718750 0.158594 0.440278
1 0.855859 0.743056 0.130469 0.436111
