2 0.434375 0.718750 0.126562 0.443056
2 0.218750 0.702083 0.126562 0.443056
1 0.654297 0.753472 0.136719 0.370833
1 0.861328 0.752083 0.136719 0.370833
4 0.415625 0.074306 0.206250 0.145833
6 0.763672 0.094444 0.472656 0.186111
