1 0.935156 0.743056 0.126562 0.333333
1 0.647656 0.752778 0.126562 0.333333
2 0.337500 0.743750 0.159375 0.368056
2 0.064062 0.741667 0.126562 0.366667
4 0.355859 0.081944 0.217969 0.161111
6 0.767188 0.103472 0.465625 0.201389
