2 0.366797 0.735417 0.163281 0.362500
2 0.115234 0.736806 0.163281 0.362500
1 0.642578 0.745139 0.130469 0.365278
1 0.934766 0.738194 0.130469 0.365278
6 0.758594 0.098611 0.482812 0.194444
4 0.353125 0.082639 0.215625 0.162500
