{"level":"INFO","time":"2024-02-27T22:43:40.982Z","pid":32114,"hostname":"mbp.home","msg":"Benjamin has signed in!"}
{"level":"INFO","time":"2024-02-27T22:43:51.714Z","pid":32114,"hostname":"mbp.home","msg":"Benjamin has posted a post with the title Drafikus Event hallo"}
{"level":"INFO","time":"2024-02-27T22:44:09.358Z","pid":32114,"hostname":"mbp.home","msg":"Peter has signed in!"}
