%YAML 1.1
%TAG !u! tag:unity3d.com,2011:
--- !u!1 &2232831390961793787
GameObject:
  m_ObjectHideFlags: 0
  m_CorrespondingSourceObject: {fileID: 0}
  m_PrefabInstance: {fileID: 0}
  m_PrefabAsset: {fileID: 0}
  serializedVersion: 6
  m_Component:
  - component: {fileID: 2929527274863102184}
  - component: {fileID: 6196041824399241950}
  - component: {fileID: 486470524525628967}
  - component: {fileID: 105029995723625920}
  m_Layer: 10
  m_Name: Tent
  m_TagString: Untagged
  m_Icon: {fileID: 0}
  m_NavMeshLayer: 0
  m_StaticEditorFlags: 4294967295
  m_IsActive: 1
--- !u!4 &2929527274863102184
Transform:
  m_ObjectHideFlags: 0
  m_CorrespondingSourceObject: {fileID: 0}
  m_PrefabInstance: {fileID: 0}
  m_PrefabAsset: {fileID: 0}
  m_GameObject: {fileID: 2232831390961793787}
  m_LocalRotation: {x: 0, y: 0.5, z: 0, w: 0.8660254}
  m_LocalPosition: {x: -443.72, y: 3.0036387, z: 35.01}
  m_LocalScale: {x: 2.5, y: 2.5, z: 2.5}
  m_Children:
  - {fileID: 553754142716550763}
  m_Father: {fileID: 0}
  m_RootOrder: 0
  m_LocalEulerAnglesHint: {x: 0, y: 60, z: 0}
--- !u!33 &6196041824399241950
MeshFilter:
  m_ObjectHideFlags: 0
  m_CorrespondingSourceObject: {fileID: 0}
  m_PrefabInstance: {fileID: 0}
  m_PrefabAsset: {fileID: 0}
  m_GameObject: {fileID: 2232831390961793787}
  m_Mesh: {fileID: -2989305052099074096, guid: ba1884c39b7f5594e9062e98acb3fa6b, type: 3}
--- !u!23 &486470524525628967
MeshRenderer:
  m_ObjectHideFlags: 0
  m_CorrespondingSourceObject: {fileID: 0}
  m_PrefabInstance: {fileID: 0}
  m_PrefabAsset: {fileID: 0}
  m_GameObject: {fileID: 2232831390961793787}
  m_Enabled: 1
  m_CastShadows: 1
  m_ReceiveShadows: 1
  m_DynamicOccludee: 1
  m_MotionVectors: 1
  m_LightProbeUsage: 1
  m_ReflectionProbeUsage: 1
  m_RayTracingMode: 2
  m_RenderingLayerMask: 1
  m_RendererPriority: 0
  m_Materials:
  - {fileID: 2100000, guid: 8b881a598bd0ebd4caad9eaf54b4d3a6, type: 2}
  m_StaticBatchInfo:
    firstSubMesh: 0
    subMeshCount: 0
  m_StaticBatchRoot: {fileID: 0}
  m_ProbeAnchor: {fileID: 0}
  m_LightProbeVolumeOverride: {fileID: 0}
  m_ScaleInLightmap: 1
  m_ReceiveGI: 1
  m_PreserveUVs: 0
  m_IgnoreNormalsForChartDetection: 0
  m_ImportantGI: 0
  m_StitchLightmapSeams: 1
  m_SelectedEditorRenderState: 3
  m_MinimumChartSize: 4
  m_AutoUVMaxDistance: 0.5
  m_AutoUVMaxAngle: 89
  m_LightmapParameters: {fileID: 0}
  m_SortingLayerID: 0
  m_SortingLayer: 0
  m_SortingOrder: 0
--- !u!65 &105029995723625920
BoxCollider:
  m_ObjectHideFlags: 0
  m_CorrespondingSourceObject: {fileID: 0}
  m_PrefabInstance: {fileID: 0}
  m_PrefabAsset: {fileID: 0}
  m_GameObject: {fileID: 2232831390961793787}
  m_Material: {fileID: 0}
  m_IsTrigger: 0
  m_Enabled: 1
  serializedVersion: 2
  m_Size: {x: 0.5402473, y: 0.2740311, z: 0.3002693}
  m_Center: {x: 0, y: 0.13648954, z: 0}
--- !u!1001 &3081531544839914900
PrefabInstance:
  m_ObjectHideFlags: 0
  serializedVersion: 2
  m_Modification:
    m_TransformParent: {fileID: 2929527274863102184}
    m_Modifications:
    - target: {fileID: 1961248577066609132, guid: 95b687b89565a0547af401d3e910d28d,
        type: 3}
      propertyPath: m_Name
      value: Tent_2 (1)
      objectReference: {fileID: 0}
    - target: {fileID: 3273159153536556031, guid: 95b687b89565a0547af401d3e910d28d,
        type: 3}
      propertyPath: m_LocalPosition.x
      value: -0.084
      objectReference: {fileID: 0}
    - target: {fileID: 3273159153536556031, guid: 95b687b89565a0547af401d3e910d28d,
        type: 3}
      propertyPath: m_LocalPosition.y
      value: -0.00039691926
      objectReference: {fileID: 0}
    - target: {fileID: 3273159153536556031, guid: 95b687b89565a0547af401d3e910d28d,
        type: 3}
      propertyPath: m_LocalPosition.z
      value: 0.243
      objectReference: {fileID: 0}
    - target: {fileID: 3273159153536556031, guid: 95b687b89565a0547af401d3e910d28d,
        type: 3}
      propertyPath: m_LocalRotation.x
      value: -9.313225e-10
      objectReference: {fileID: 0}
    - target: {fileID: 3273159153536556031, guid: 95b687b89565a0547af401d3e910d28d,
        type: 3}
      propertyPath: m_LocalRotation.y
      value: 0.9825614
      objectReference: {fileID: 0}
    - target: {fileID: 3273159153536556031, guid: 95b687b89565a0547af401d3e910d28d,
        type: 3}
      propertyPath: m_LocalRotation.z
      value: -2.910383e-10
      objectReference: {fileID: 0}
    - target: {fileID: 3273159153536556031, guid: 95b687b89565a0547af401d3e910d28d,
        type: 3}
      propertyPath: m_LocalRotation.w
      value: 0.18593857
      objectReference: {fileID: 0}
    - target: {fileID: 3273159153536556031, guid: 95b687b89565a0547af401d3e910d28d,
        type: 3}
      propertyPath: m_RootOrder
      value: 0
      objectReference: {fileID: 0}
    - target: {fileID: 3273159153536556031, guid: 95b687b89565a0547af401d3e910d28d,
        type: 3}
      propertyPath: m_LocalEulerAnglesHint.x
      value: -0.35900003
      objectReference: {fileID: 0}
    - target: {fileID: 3273159153536556031, guid: 95b687b89565a0547af401d3e910d28d,
        type: 3}
      propertyPath: m_LocalEulerAnglesHint.y
      value: -69.990005
      objectReference: {fileID: 0}
    - target: {fileID: 3273159153536556031, guid: 95b687b89565a0547af401d3e910d28d,
        type: 3}
      propertyPath: m_LocalEulerAnglesHint.z
      value: 0.63900006
      objectReference: {fileID: 0}
    - target: {fileID: 3273159153536556031, guid: 95b687b89565a0547af401d3e910d28d,
        type: 3}
      propertyPath: m_LocalScale.x
      value: 1.1999998
      objectReference: {fileID: 0}
    - target: {fileID: 3273159153536556031, guid: 95b687b89565a0547af401d3e910d28d,
        type: 3}
      propertyPath: m_LocalScale.y
      value: 1.2
      objectReference: {fileID: 0}
    - target: {fileID: 3273159153536556031, guid: 95b687b89565a0547af401d3e910d28d,
        type: 3}
      propertyPath: m_LocalScale.z
      value: 1.1999998
      objectReference: {fileID: 0}
    m_RemovedComponents: []
  m_SourcePrefab: {fileID: 100100000, guid: 95b687b89565a0547af401d3e910d28d, type: 3}
--- !u!4 &553754142716550763 stripped
Transform:
  m_CorrespondingSourceObject: {fileID: 3273159153536556031, guid: 95b687b89565a0547af401d3e910d28d,
    type: 3}
  m_PrefabInstance: {fileID: 3081531544839914900}
  m_PrefabAsset: {fileID: 0}
